envs_dirs : /work/scratch/env/beaudol/.conda/envs
pkgs_dirs : /work/scratch/data/beaudol/.conda/pkgs
/work/RECONFORT/Louise/learning/extracted_samples_oak_v4_w_2023/label_2022/
['/work/RECONFORT/Louise/learning/extracted_samples_oak_v4_w_2023/label_2022/2016/', '/work/RECONFORT/Louise/learning/extracted_samples_oak_v4_w_2023/label_2022/2017/', '/work/RECONFORT/Louise/learning/extracted_samples_oak_v4_w_2023/label_2022/2018/', '/work/RECONFORT/Louise/learning/extracted_samples_oak_v4_w_2023/label_2022/2019/', '/work/RECONFORT/Louise/learning/extracted_samples_oak_v4_w_2023/label_2022/2020/', '/work/RECONFORT/Louise/learning/extracted_samples_oak_v4_w_2023/label_2022/2021/', '/work/RECONFORT/Louise/learning/extracted_samples_oak_v4_w_2023/label_2022/2022/', '/work/RECONFORT/Louise/learning/extracted_samples_oak_v4_w_2023/label_2022/2023/']
Merging years
/work/RECONFORT/Louise/learning/extracted_samples_oak_v4_w_2023/label_2022/2016/
/work/RECONFORT/Louise/learning/extracted_samples_oak_v4_w_2023/label_2022/2017/
/work/RECONFORT/Louise/learning/extracted_samples_oak_v4_w_2023/label_2022/2018/
/work/RECONFORT/Louise/learning/extracted_samples_oak_v4_w_2023/label_2022/2019/
/work/RECONFORT/Louise/learning/extracted_samples_oak_v4_w_2023/label_2022/2020/
/work/RECONFORT/Louise/learning/extracted_samples_oak_v4_w_2023/label_2022/2021/
/work/RECONFORT/Louise/learning/extracted_samples_oak_v4_w_2023/label_2022/2022/
/work/RECONFORT/Louise/learning/extracted_samples_oak_v4_w_2023/label_2022/2023/
['tile_o', 'sentinel2_b2_20160101', 'sentinel2_b3_20160101', 'sentinel2_b4_20160101', 'sentinel2_b5_20160101', 'sentinel2_b6_20160101', 'sentinel2_b7_20160101', 'sentinel2_b8_20160101', 'sentinel2_b8a_20160101', 'sentinel2_b11_20160101', 'sentinel2_b12_20160101', 'sentinel2_b2_20160111', 'sentinel2_b3_20160111', 'sentinel2_b4_20160111', 'sentinel2_b5_20160111', 'sentinel2_b6_20160111', 'sentinel2_b7_20160111', 'sentinel2_b8_20160111', 'sentinel2_b8a_20160111', 'sentinel2_b11_20160111', 'sentinel2_b12_20160111', 'sentinel2_b2_20160121', 'sentinel2_b3_20160121', 'sentinel2_b4_20160121', 'sentinel2_b5_20160121', 'sentinel2_b6_20160121', 'sentinel2_b7_20160121', 'sentinel2_b8_20160121', 'sentinel2_b8a_20160121', 'sentinel2_b11_20160121', 'sentinel2_b12_20160121', 'sentinel2_b2_20160131', 'sentinel2_b3_20160131', 'sentinel2_b4_20160131', 'sentinel2_b5_20160131', 'sentinel2_b6_20160131', 'sentinel2_b7_20160131', 'sentinel2_b8_20160131', 'sentinel2_b8a_20160131', 'sentinel2_b11_20160131', 'sentinel2_b12_20160131', 'sentinel2_b2_20160210', 'sentinel2_b3_20160210', 'sentinel2_b4_20160210', 'sentinel2_b5_20160210', 'sentinel2_b6_20160210', 'sentinel2_b7_20160210', 'sentinel2_b8_20160210', 'sentinel2_b8a_20160210', 'sentinel2_b11_20160210', 'sentinel2_b12_20160210', 'sentinel2_b2_20160220', 'sentinel2_b3_20160220', 'sentinel2_b4_20160220', 'sentinel2_b5_20160220', 'sentinel2_b6_20160220', 'sentinel2_b7_20160220', 'sentinel2_b8_20160220', 'sentinel2_b8a_20160220', 'sentinel2_b11_20160220', 'sentinel2_b12_20160220', 'sentinel2_b2_20160301', 'sentinel2_b3_20160301', 'sentinel2_b4_20160301', 'sentinel2_b5_20160301', 'sentinel2_b6_20160301', 'sentinel2_b7_20160301', 'sentinel2_b8_20160301', 'sentinel2_b8a_20160301', 'sentinel2_b11_20160301', 'sentinel2_b12_20160301', 'sentinel2_b2_20160311', 'sentinel2_b3_20160311', 'sentinel2_b4_20160311', 'sentinel2_b5_20160311', 'sentinel2_b6_20160311', 'sentinel2_b7_20160311', 'sentinel2_b8_20160311', 'sentinel2_b8a_20160311', 'sentinel2_b11_20160311', 'sentinel2_b12_20160311', 'sentinel2_b2_20160321', 'sentinel2_b3_20160321', 'sentinel2_b4_20160321', 'sentinel2_b5_20160321', 'sentinel2_b6_20160321', 'sentinel2_b7_20160321', 'sentinel2_b8_20160321', 'sentinel2_b8a_20160321', 'sentinel2_b11_20160321', 'sentinel2_b12_20160321', 'sentinel2_b2_20160331', 'sentinel2_b3_20160331', 'sentinel2_b4_20160331', 'sentinel2_b5_20160331', 'sentinel2_b6_20160331', 'sentinel2_b7_20160331', 'sentinel2_b8_20160331', 'sentinel2_b8a_20160331', 'sentinel2_b11_20160331', 'sentinel2_b12_20160331', 'sentinel2_b2_20160410', 'sentinel2_b3_20160410', 'sentinel2_b4_20160410', 'sentinel2_b5_20160410', 'sentinel2_b6_20160410', 'sentinel2_b7_20160410', 'sentinel2_b8_20160410', 'sentinel2_b8a_20160410', 'sentinel2_b11_20160410', 'sentinel2_b12_20160410', 'sentinel2_b2_20160420', 'sentinel2_b3_20160420', 'sentinel2_b4_20160420', 'sentinel2_b5_20160420', 'sentinel2_b6_20160420', 'sentinel2_b7_20160420', 'sentinel2_b8_20160420', 'sentinel2_b8a_20160420', 'sentinel2_b11_20160420', 'sentinel2_b12_20160420', 'sentinel2_b2_20160430', 'sentinel2_b3_20160430', 'sentinel2_b4_20160430', 'sentinel2_b5_20160430', 'sentinel2_b6_20160430', 'sentinel2_b7_20160430', 'sentinel2_b8_20160430', 'sentinel2_b8a_20160430', 'sentinel2_b11_20160430', 'sentinel2_b12_20160430', 'sentinel2_b2_20160510', 'sentinel2_b3_20160510', 'sentinel2_b4_20160510', 'sentinel2_b5_20160510', 'sentinel2_b6_20160510', 'sentinel2_b7_20160510', 'sentinel2_b8_20160510', 'sentinel2_b8a_20160510', 'sentinel2_b11_20160510', 'sentinel2_b12_20160510', 'sentinel2_b2_20160520', 'sentinel2_b3_20160520', 'sentinel2_b4_20160520', 'sentinel2_b5_20160520', 'sentinel2_b6_20160520', 'sentinel2_b7_20160520', 'sentinel2_b8_20160520', 'sentinel2_b8a_20160520', 'sentinel2_b11_20160520', 'sentinel2_b12_20160520', 'sentinel2_b2_20160530', 'sentinel2_b3_20160530', 'sentinel2_b4_20160530', 'sentinel2_b5_20160530', 'sentinel2_b6_20160530', 'sentinel2_b7_20160530', 'sentinel2_b8_20160530', 'sentinel2_b8a_20160530', 'sentinel2_b11_20160530', 'sentinel2_b12_20160530', 'sentinel2_b2_20160609', 'sentinel2_b3_20160609', 'sentinel2_b4_20160609', 'sentinel2_b5_20160609', 'sentinel2_b6_20160609', 'sentinel2_b7_20160609', 'sentinel2_b8_20160609', 'sentinel2_b8a_20160609', 'sentinel2_b11_20160609', 'sentinel2_b12_20160609', 'sentinel2_b2_20160619', 'sentinel2_b3_20160619', 'sentinel2_b4_20160619', 'sentinel2_b5_20160619', 'sentinel2_b6_20160619', 'sentinel2_b7_20160619', 'sentinel2_b8_20160619', 'sentinel2_b8a_20160619', 'sentinel2_b11_20160619', 'sentinel2_b12_20160619', 'sentinel2_b2_20160629', 'sentinel2_b3_20160629', 'sentinel2_b4_20160629', 'sentinel2_b5_20160629', 'sentinel2_b6_20160629', 'sentinel2_b7_20160629', 'sentinel2_b8_20160629', 'sentinel2_b8a_20160629', 'sentinel2_b11_20160629', 'sentinel2_b12_20160629', 'sentinel2_b2_20160709', 'sentinel2_b3_20160709', 'sentinel2_b4_20160709', 'sentinel2_b5_20160709', 'sentinel2_b6_20160709', 'sentinel2_b7_20160709', 'sentinel2_b8_20160709', 'sentinel2_b8a_20160709', 'sentinel2_b11_20160709', 'sentinel2_b12_20160709', 'sentinel2_b2_20160719', 'sentinel2_b3_20160719', 'sentinel2_b4_20160719', 'sentinel2_b5_20160719', 'sentinel2_b6_20160719', 'sentinel2_b7_20160719', 'sentinel2_b8_20160719', 'sentinel2_b8a_20160719', 'sentinel2_b11_20160719', 'sentinel2_b12_20160719', 'sentinel2_b2_20160729', 'sentinel2_b3_20160729', 'sentinel2_b4_20160729', 'sentinel2_b5_20160729', 'sentinel2_b6_20160729', 'sentinel2_b7_20160729', 'sentinel2_b8_20160729', 'sentinel2_b8a_20160729', 'sentinel2_b11_20160729', 'sentinel2_b12_20160729', 'sentinel2_b2_20160808', 'sentinel2_b3_20160808', 'sentinel2_b4_20160808', 'sentinel2_b5_20160808', 'sentinel2_b6_20160808', 'sentinel2_b7_20160808', 'sentinel2_b8_20160808', 'sentinel2_b8a_20160808', 'sentinel2_b11_20160808', 'sentinel2_b12_20160808', 'sentinel2_b2_20160818', 'sentinel2_b3_20160818', 'sentinel2_b4_20160818', 'sentinel2_b5_20160818', 'sentinel2_b6_20160818', 'sentinel2_b7_20160818', 'sentinel2_b8_20160818', 'sentinel2_b8a_20160818', 'sentinel2_b11_20160818', 'sentinel2_b12_20160818', 'sentinel2_b2_20160828', 'sentinel2_b3_20160828', 'sentinel2_b4_20160828', 'sentinel2_b5_20160828', 'sentinel2_b6_20160828', 'sentinel2_b7_20160828', 'sentinel2_b8_20160828', 'sentinel2_b8a_20160828', 'sentinel2_b11_20160828', 'sentinel2_b12_20160828', 'sentinel2_b2_20160907', 'sentinel2_b3_20160907', 'sentinel2_b4_20160907', 'sentinel2_b5_20160907', 'sentinel2_b6_20160907', 'sentinel2_b7_20160907', 'sentinel2_b8_20160907', 'sentinel2_b8a_20160907', 'sentinel2_b11_20160907', 'sentinel2_b12_20160907', 'sentinel2_b2_20160917', 'sentinel2_b3_20160917', 'sentinel2_b4_20160917', 'sentinel2_b5_20160917', 'sentinel2_b6_20160917', 'sentinel2_b7_20160917', 'sentinel2_b8_20160917', 'sentinel2_b8a_20160917', 'sentinel2_b11_20160917', 'sentinel2_b12_20160917', 'sentinel2_b2_20160927', 'sentinel2_b3_20160927', 'sentinel2_b4_20160927', 'sentinel2_b5_20160927', 'sentinel2_b6_20160927', 'sentinel2_b7_20160927', 'sentinel2_b8_20160927', 'sentinel2_b8a_20160927', 'sentinel2_b11_20160927', 'sentinel2_b12_20160927', 'sentinel2_b2_20161007', 'sentinel2_b3_20161007', 'sentinel2_b4_20161007', 'sentinel2_b5_20161007', 'sentinel2_b6_20161007', 'sentinel2_b7_20161007', 'sentinel2_b8_20161007', 'sentinel2_b8a_20161007', 'sentinel2_b11_20161007', 'sentinel2_b12_20161007', 'sentinel2_b2_20161017', 'sentinel2_b3_20161017', 'sentinel2_b4_20161017', 'sentinel2_b5_20161017', 'sentinel2_b6_20161017', 'sentinel2_b7_20161017', 'sentinel2_b8_20161017', 'sentinel2_b8a_20161017', 'sentinel2_b11_20161017', 'sentinel2_b12_20161017', 'sentinel2_b2_20161027', 'sentinel2_b3_20161027', 'sentinel2_b4_20161027', 'sentinel2_b5_20161027', 'sentinel2_b6_20161027', 'sentinel2_b7_20161027', 'sentinel2_b8_20161027', 'sentinel2_b8a_20161027', 'sentinel2_b11_20161027', 'sentinel2_b12_20161027', 'sentinel2_b2_20161106', 'sentinel2_b3_20161106', 'sentinel2_b4_20161106', 'sentinel2_b5_20161106', 'sentinel2_b6_20161106', 'sentinel2_b7_20161106', 'sentinel2_b8_20161106', 'sentinel2_b8a_20161106', 'sentinel2_b11_20161106', 'sentinel2_b12_20161106', 'sentinel2_b2_20161116', 'sentinel2_b3_20161116', 'sentinel2_b4_20161116', 'sentinel2_b5_20161116', 'sentinel2_b6_20161116', 'sentinel2_b7_20161116', 'sentinel2_b8_20161116', 'sentinel2_b8a_20161116', 'sentinel2_b11_20161116', 'sentinel2_b12_20161116', 'sentinel2_b2_20161126', 'sentinel2_b3_20161126', 'sentinel2_b4_20161126', 'sentinel2_b5_20161126', 'sentinel2_b6_20161126', 'sentinel2_b7_20161126', 'sentinel2_b8_20161126', 'sentinel2_b8a_20161126', 'sentinel2_b11_20161126', 'sentinel2_b12_20161126', 'sentinel2_b2_20161206', 'sentinel2_b3_20161206', 'sentinel2_b4_20161206', 'sentinel2_b5_20161206', 'sentinel2_b6_20161206', 'sentinel2_b7_20161206', 'sentinel2_b8_20161206', 'sentinel2_b8a_20161206', 'sentinel2_b11_20161206', 'sentinel2_b12_20161206', 'sentinel2_b2_20161216', 'sentinel2_b3_20161216', 'sentinel2_b4_20161216', 'sentinel2_b5_20161216', 'sentinel2_b6_20161216', 'sentinel2_b7_20161216', 'sentinel2_b8_20161216', 'sentinel2_b8a_20161216', 'sentinel2_b11_20161216', 'sentinel2_b12_20161216', 'sentinel2_b2_20161226', 'sentinel2_b3_20161226', 'sentinel2_b4_20161226', 'sentinel2_b5_20161226', 'sentinel2_b6_20161226', 'sentinel2_b7_20161226', 'sentinel2_b8_20161226', 'sentinel2_b8a_20161226', 'sentinel2_b11_20161226', 'sentinel2_b12_20161226', 'sentinel2_b2_20170101', 'sentinel2_b3_20170101', 'sentinel2_b4_20170101', 'sentinel2_b5_20170101', 'sentinel2_b6_20170101', 'sentinel2_b7_20170101', 'sentinel2_b8_20170101', 'sentinel2_b8a_20170101', 'sentinel2_b11_20170101', 'sentinel2_b12_20170101', 'sentinel2_b2_20170111', 'sentinel2_b3_20170111', 'sentinel2_b4_20170111', 'sentinel2_b5_20170111', 'sentinel2_b6_20170111', 'sentinel2_b7_20170111', 'sentinel2_b8_20170111', 'sentinel2_b8a_20170111', 'sentinel2_b11_20170111', 'sentinel2_b12_20170111', 'sentinel2_b2_20170121', 'sentinel2_b3_20170121', 'sentinel2_b4_20170121', 'sentinel2_b5_20170121', 'sentinel2_b6_20170121', 'sentinel2_b7_20170121', 'sentinel2_b8_20170121', 'sentinel2_b8a_20170121', 'sentinel2_b11_20170121', 'sentinel2_b12_20170121', 'sentinel2_b2_20170131', 'sentinel2_b3_20170131', 'sentinel2_b4_20170131', 'sentinel2_b5_20170131', 'sentinel2_b6_20170131', 'sentinel2_b7_20170131', 'sentinel2_b8_20170131', 'sentinel2_b8a_20170131', 'sentinel2_b11_20170131', 'sentinel2_b12_20170131', 'sentinel2_b2_20170210', 'sentinel2_b3_20170210', 'sentinel2_b4_20170210', 'sentinel2_b5_20170210', 'sentinel2_b6_20170210', 'sentinel2_b7_20170210', 'sentinel2_b8_20170210', 'sentinel2_b8a_20170210', 'sentinel2_b11_20170210', 'sentinel2_b12_20170210', 'sentinel2_b2_20170220', 'sentinel2_b3_20170220', 'sentinel2_b4_20170220', 'sentinel2_b5_20170220', 'sentinel2_b6_20170220', 'sentinel2_b7_20170220', 'sentinel2_b8_20170220', 'sentinel2_b8a_20170220', 'sentinel2_b11_20170220', 'sentinel2_b12_20170220', 'sentinel2_b2_20170302', 'sentinel2_b3_20170302', 'sentinel2_b4_20170302', 'sentinel2_b5_20170302', 'sentinel2_b6_20170302', 'sentinel2_b7_20170302', 'sentinel2_b8_20170302', 'sentinel2_b8a_20170302', 'sentinel2_b11_20170302', 'sentinel2_b12_20170302', 'sentinel2_b2_20170312', 'sentinel2_b3_20170312', 'sentinel2_b4_20170312', 'sentinel2_b5_20170312', 'sentinel2_b6_20170312', 'sentinel2_b7_20170312', 'sentinel2_b8_20170312', 'sentinel2_b8a_20170312', 'sentinel2_b11_20170312', 'sentinel2_b12_20170312', 'sentinel2_b2_20170322', 'sentinel2_b3_20170322', 'sentinel2_b4_20170322', 'sentinel2_b5_20170322', 'sentinel2_b6_20170322', 'sentinel2_b7_20170322', 'sentinel2_b8_20170322', 'sentinel2_b8a_20170322', 'sentinel2_b11_20170322', 'sentinel2_b12_20170322', 'sentinel2_b2_20170401', 'sentinel2_b3_20170401', 'sentinel2_b4_20170401', 'sentinel2_b5_20170401', 'sentinel2_b6_20170401', 'sentinel2_b7_20170401', 'sentinel2_b8_20170401', 'sentinel2_b8a_20170401', 'sentinel2_b11_20170401', 'sentinel2_b12_20170401', 'sentinel2_b2_20170411', 'sentinel2_b3_20170411', 'sentinel2_b4_20170411', 'sentinel2_b5_20170411', 'sentinel2_b6_20170411', 'sentinel2_b7_20170411', 'sentinel2_b8_20170411', 'sentinel2_b8a_20170411', 'sentinel2_b11_20170411', 'sentinel2_b12_20170411', 'sentinel2_b2_20170421', 'sentinel2_b3_20170421', 'sentinel2_b4_20170421', 'sentinel2_b5_20170421', 'sentinel2_b6_20170421', 'sentinel2_b7_20170421', 'sentinel2_b8_20170421', 'sentinel2_b8a_20170421', 'sentinel2_b11_20170421', 'sentinel2_b12_20170421', 'sentinel2_b2_20170501', 'sentinel2_b3_20170501', 'sentinel2_b4_20170501', 'sentinel2_b5_20170501', 'sentinel2_b6_20170501', 'sentinel2_b7_20170501', 'sentinel2_b8_20170501', 'sentinel2_b8a_20170501', 'sentinel2_b11_20170501', 'sentinel2_b12_20170501', 'sentinel2_b2_20170511', 'sentinel2_b3_20170511', 'sentinel2_b4_20170511', 'sentinel2_b5_20170511', 'sentinel2_b6_20170511', 'sentinel2_b7_20170511', 'sentinel2_b8_20170511', 'sentinel2_b8a_20170511', 'sentinel2_b11_20170511', 'sentinel2_b12_20170511', 'sentinel2_b2_20170521', 'sentinel2_b3_20170521', 'sentinel2_b4_20170521', 'sentinel2_b5_20170521', 'sentinel2_b6_20170521', 'sentinel2_b7_20170521', 'sentinel2_b8_20170521', 'sentinel2_b8a_20170521', 'sentinel2_b11_20170521', 'sentinel2_b12_20170521', 'sentinel2_b2_20170531', 'sentinel2_b3_20170531', 'sentinel2_b4_20170531', 'sentinel2_b5_20170531', 'sentinel2_b6_20170531', 'sentinel2_b7_20170531', 'sentinel2_b8_20170531', 'sentinel2_b8a_20170531', 'sentinel2_b11_20170531', 'sentinel2_b12_20170531', 'sentinel2_b2_20170610', 'sentinel2_b3_20170610', 'sentinel2_b4_20170610', 'sentinel2_b5_20170610', 'sentinel2_b6_20170610', 'sentinel2_b7_20170610', 'sentinel2_b8_20170610', 'sentinel2_b8a_20170610', 'sentinel2_b11_20170610', 'sentinel2_b12_20170610', 'sentinel2_b2_20170620', 'sentinel2_b3_20170620', 'sentinel2_b4_20170620', 'sentinel2_b5_20170620', 'sentinel2_b6_20170620', 'sentinel2_b7_20170620', 'sentinel2_b8_20170620', 'sentinel2_b8a_20170620', 'sentinel2_b11_20170620', 'sentinel2_b12_20170620', 'sentinel2_b2_20170630', 'sentinel2_b3_20170630', 'sentinel2_b4_20170630', 'sentinel2_b5_20170630', 'sentinel2_b6_20170630', 'sentinel2_b7_20170630', 'sentinel2_b8_20170630', 'sentinel2_b8a_20170630', 'sentinel2_b11_20170630', 'sentinel2_b12_20170630', 'sentinel2_b2_20170710', 'sentinel2_b3_20170710', 'sentinel2_b4_20170710', 'sentinel2_b5_20170710', 'sentinel2_b6_20170710', 'sentinel2_b7_20170710', 'sentinel2_b8_20170710', 'sentinel2_b8a_20170710', 'sentinel2_b11_20170710', 'sentinel2_b12_20170710', 'sentinel2_b2_20170720', 'sentinel2_b3_20170720', 'sentinel2_b4_20170720', 'sentinel2_b5_20170720', 'sentinel2_b6_20170720', 'sentinel2_b7_20170720', 'sentinel2_b8_20170720', 'sentinel2_b8a_20170720', 'sentinel2_b11_20170720', 'sentinel2_b12_20170720', 'sentinel2_b2_20170730', 'sentinel2_b3_20170730', 'sentinel2_b4_20170730', 'sentinel2_b5_20170730', 'sentinel2_b6_20170730', 'sentinel2_b7_20170730', 'sentinel2_b8_20170730', 'sentinel2_b8a_20170730', 'sentinel2_b11_20170730', 'sentinel2_b12_20170730', 'sentinel2_b2_20170809', 'sentinel2_b3_20170809', 'sentinel2_b4_20170809', 'sentinel2_b5_20170809', 'sentinel2_b6_20170809', 'sentinel2_b7_20170809', 'sentinel2_b8_20170809', 'sentinel2_b8a_20170809', 'sentinel2_b11_20170809', 'sentinel2_b12_20170809', 'sentinel2_b2_20170819', 'sentinel2_b3_20170819', 'sentinel2_b4_20170819', 'sentinel2_b5_20170819', 'sentinel2_b6_20170819', 'sentinel2_b7_20170819', 'sentinel2_b8_20170819', 'sentinel2_b8a_20170819', 'sentinel2_b11_20170819', 'sentinel2_b12_20170819', 'sentinel2_b2_20170829', 'sentinel2_b3_20170829', 'sentinel2_b4_20170829', 'sentinel2_b5_20170829', 'sentinel2_b6_20170829', 'sentinel2_b7_20170829', 'sentinel2_b8_20170829', 'sentinel2_b8a_20170829', 'sentinel2_b11_20170829', 'sentinel2_b12_20170829', 'sentinel2_b2_20170908', 'sentinel2_b3_20170908', 'sentinel2_b4_20170908', 'sentinel2_b5_20170908', 'sentinel2_b6_20170908', 'sentinel2_b7_20170908', 'sentinel2_b8_20170908', 'sentinel2_b8a_20170908', 'sentinel2_b11_20170908', 'sentinel2_b12_20170908', 'sentinel2_b2_20170918', 'sentinel2_b3_20170918', 'sentinel2_b4_20170918', 'sentinel2_b5_20170918', 'sentinel2_b6_20170918', 'sentinel2_b7_20170918', 'sentinel2_b8_20170918', 'sentinel2_b8a_20170918', 'sentinel2_b11_20170918', 'sentinel2_b12_20170918', 'sentinel2_b2_20170928', 'sentinel2_b3_20170928', 'sentinel2_b4_20170928', 'sentinel2_b5_20170928', 'sentinel2_b6_20170928', 'sentinel2_b7_20170928', 'sentinel2_b8_20170928', 'sentinel2_b8a_20170928', 'sentinel2_b11_20170928', 'sentinel2_b12_20170928', 'sentinel2_b2_20171008', 'sentinel2_b3_20171008', 'sentinel2_b4_20171008', 'sentinel2_b5_20171008', 'sentinel2_b6_20171008', 'sentinel2_b7_20171008', 'sentinel2_b8_20171008', 'sentinel2_b8a_20171008', 'sentinel2_b11_20171008', 'sentinel2_b12_20171008', 'sentinel2_b2_20171018', 'sentinel2_b3_20171018', 'sentinel2_b4_20171018', 'sentinel2_b5_20171018', 'sentinel2_b6_20171018', 'sentinel2_b7_20171018', 'sentinel2_b8_20171018', 'sentinel2_b8a_20171018', 'sentinel2_b11_20171018', 'sentinel2_b12_20171018', 'sentinel2_b2_20171028', 'sentinel2_b3_20171028', 'sentinel2_b4_20171028', 'sentinel2_b5_20171028', 'sentinel2_b6_20171028', 'sentinel2_b7_20171028', 'sentinel2_b8_20171028', 'sentinel2_b8a_20171028', 'sentinel2_b11_20171028', 'sentinel2_b12_20171028', 'sentinel2_b2_20171107', 'sentinel2_b3_20171107', 'sentinel2_b4_20171107', 'sentinel2_b5_20171107', 'sentinel2_b6_20171107', 'sentinel2_b7_20171107', 'sentinel2_b8_20171107', 'sentinel2_b8a_20171107', 'sentinel2_b11_20171107', 'sentinel2_b12_20171107', 'sentinel2_b2_20171117', 'sentinel2_b3_20171117', 'sentinel2_b4_20171117', 'sentinel2_b5_20171117', 'sentinel2_b6_20171117', 'sentinel2_b7_20171117', 'sentinel2_b8_20171117', 'sentinel2_b8a_20171117', 'sentinel2_b11_20171117', 'sentinel2_b12_20171117', 'sentinel2_b2_20171127', 'sentinel2_b3_20171127', 'sentinel2_b4_20171127', 'sentinel2_b5_20171127', 'sentinel2_b6_20171127', 'sentinel2_b7_20171127', 'sentinel2_b8_20171127', 'sentinel2_b8a_20171127', 'sentinel2_b11_20171127', 'sentinel2_b12_20171127', 'sentinel2_b2_20171207', 'sentinel2_b3_20171207', 'sentinel2_b4_20171207', 'sentinel2_b5_20171207', 'sentinel2_b6_20171207', 'sentinel2_b7_20171207', 'sentinel2_b8_20171207', 'sentinel2_b8a_20171207', 'sentinel2_b11_20171207', 'sentinel2_b12_20171207', 'sentinel2_b2_20171217', 'sentinel2_b3_20171217', 'sentinel2_b4_20171217', 'sentinel2_b5_20171217', 'sentinel2_b6_20171217', 'sentinel2_b7_20171217', 'sentinel2_b8_20171217', 'sentinel2_b8a_20171217', 'sentinel2_b11_20171217', 'sentinel2_b12_20171217', 'sentinel2_b2_20171227', 'sentinel2_b3_20171227', 'sentinel2_b4_20171227', 'sentinel2_b5_20171227', 'sentinel2_b6_20171227', 'sentinel2_b7_20171227', 'sentinel2_b8_20171227', 'sentinel2_b8a_20171227', 'sentinel2_b11_20171227', 'sentinel2_b12_20171227', 'sentinel2_b2_20180101', 'sentinel2_b3_20180101', 'sentinel2_b4_20180101', 'sentinel2_b5_20180101', 'sentinel2_b6_20180101', 'sentinel2_b7_20180101', 'sentinel2_b8_20180101', 'sentinel2_b8a_20180101', 'sentinel2_b11_20180101', 'sentinel2_b12_20180101', 'sentinel2_b2_20180111', 'sentinel2_b3_20180111', 'sentinel2_b4_20180111', 'sentinel2_b5_20180111', 'sentinel2_b6_20180111', 'sentinel2_b7_20180111', 'sentinel2_b8_20180111', 'sentinel2_b8a_20180111', 'sentinel2_b11_20180111', 'sentinel2_b12_20180111', 'sentinel2_b2_20180121', 'sentinel2_b3_20180121', 'sentinel2_b4_20180121', 'sentinel2_b5_20180121', 'sentinel2_b6_20180121', 'sentinel2_b7_20180121', 'sentinel2_b8_20180121', 'sentinel2_b8a_20180121', 'sentinel2_b11_20180121', 'sentinel2_b12_20180121', 'sentinel2_b2_20180131', 'sentinel2_b3_20180131', 'sentinel2_b4_20180131', 'sentinel2_b5_20180131', 'sentinel2_b6_20180131', 'sentinel2_b7_20180131', 'sentinel2_b8_20180131', 'sentinel2_b8a_20180131', 'sentinel2_b11_20180131', 'sentinel2_b12_20180131', 'sentinel2_b2_20180210', 'sentinel2_b3_20180210', 'sentinel2_b4_20180210', 'sentinel2_b5_20180210', 'sentinel2_b6_20180210', 'sentinel2_b7_20180210', 'sentinel2_b8_20180210', 'sentinel2_b8a_20180210', 'sentinel2_b11_20180210', 'sentinel2_b12_20180210', 'sentinel2_b2_20180220', 'sentinel2_b3_20180220', 'sentinel2_b4_20180220', 'sentinel2_b5_20180220', 'sentinel2_b6_20180220', 'sentinel2_b7_20180220', 'sentinel2_b8_20180220', 'sentinel2_b8a_20180220', 'sentinel2_b11_20180220', 'sentinel2_b12_20180220', 'sentinel2_b2_20180302', 'sentinel2_b3_20180302', 'sentinel2_b4_20180302', 'sentinel2_b5_20180302', 'sentinel2_b6_20180302', 'sentinel2_b7_20180302', 'sentinel2_b8_20180302', 'sentinel2_b8a_20180302', 'sentinel2_b11_20180302', 'sentinel2_b12_20180302', 'sentinel2_b2_20180312', 'sentinel2_b3_20180312', 'sentinel2_b4_20180312', 'sentinel2_b5_20180312', 'sentinel2_b6_20180312', 'sentinel2_b7_20180312', 'sentinel2_b8_20180312', 'sentinel2_b8a_20180312', 'sentinel2_b11_20180312', 'sentinel2_b12_20180312', 'sentinel2_b2_20180322', 'sentinel2_b3_20180322', 'sentinel2_b4_20180322', 'sentinel2_b5_20180322', 'sentinel2_b6_20180322', 'sentinel2_b7_20180322', 'sentinel2_b8_20180322', 'sentinel2_b8a_20180322', 'sentinel2_b11_20180322', 'sentinel2_b12_20180322', 'sentinel2_b2_20180401', 'sentinel2_b3_20180401', 'sentinel2_b4_20180401', 'sentinel2_b5_20180401', 'sentinel2_b6_20180401', 'sentinel2_b7_20180401', 'sentinel2_b8_20180401', 'sentinel2_b8a_20180401', 'sentinel2_b11_20180401', 'sentinel2_b12_20180401', 'sentinel2_b2_20180411', 'sentinel2_b3_20180411', 'sentinel2_b4_20180411', 'sentinel2_b5_20180411', 'sentinel2_b6_20180411', 'sentinel2_b7_20180411', 'sentinel2_b8_20180411', 'sentinel2_b8a_20180411', 'sentinel2_b11_20180411', 'sentinel2_b12_20180411', 'sentinel2_b2_20180421', 'sentinel2_b3_20180421', 'sentinel2_b4_20180421', 'sentinel2_b5_20180421', 'sentinel2_b6_20180421', 'sentinel2_b7_20180421', 'sentinel2_b8_20180421', 'sentinel2_b8a_20180421', 'sentinel2_b11_20180421', 'sentinel2_b12_20180421', 'sentinel2_b2_20180501', 'sentinel2_b3_20180501', 'sentinel2_b4_20180501', 'sentinel2_b5_20180501', 'sentinel2_b6_20180501', 'sentinel2_b7_20180501', 'sentinel2_b8_20180501', 'sentinel2_b8a_20180501', 'sentinel2_b11_20180501', 'sentinel2_b12_20180501', 'sentinel2_b2_20180511', 'sentinel2_b3_20180511', 'sentinel2_b4_20180511', 'sentinel2_b5_20180511', 'sentinel2_b6_20180511', 'sentinel2_b7_20180511', 'sentinel2_b8_20180511', 'sentinel2_b8a_20180511', 'sentinel2_b11_20180511', 'sentinel2_b12_20180511', 'sentinel2_b2_20180521', 'sentinel2_b3_20180521', 'sentinel2_b4_20180521', 'sentinel2_b5_20180521', 'sentinel2_b6_20180521', 'sentinel2_b7_20180521', 'sentinel2_b8_20180521', 'sentinel2_b8a_20180521', 'sentinel2_b11_20180521', 'sentinel2_b12_20180521', 'sentinel2_b2_20180531', 'sentinel2_b3_20180531', 'sentinel2_b4_20180531', 'sentinel2_b5_20180531', 'sentinel2_b6_20180531', 'sentinel2_b7_20180531', 'sentinel2_b8_20180531', 'sentinel2_b8a_20180531', 'sentinel2_b11_20180531', 'sentinel2_b12_20180531', 'sentinel2_b2_20180610', 'sentinel2_b3_20180610', 'sentinel2_b4_20180610', 'sentinel2_b5_20180610', 'sentinel2_b6_20180610', 'sentinel2_b7_20180610', 'sentinel2_b8_20180610', 'sentinel2_b8a_20180610', 'sentinel2_b11_20180610', 'sentinel2_b12_20180610', 'sentinel2_b2_20180620', 'sentinel2_b3_20180620', 'sentinel2_b4_20180620', 'sentinel2_b5_20180620', 'sentinel2_b6_20180620', 'sentinel2_b7_20180620', 'sentinel2_b8_20180620', 'sentinel2_b8a_20180620', 'sentinel2_b11_20180620', 'sentinel2_b12_20180620', 'sentinel2_b2_20180630', 'sentinel2_b3_20180630', 'sentinel2_b4_20180630', 'sentinel2_b5_20180630', 'sentinel2_b6_20180630', 'sentinel2_b7_20180630', 'sentinel2_b8_20180630', 'sentinel2_b8a_20180630', 'sentinel2_b11_20180630', 'sentinel2_b12_20180630', 'sentinel2_b2_20180710', 'sentinel2_b3_20180710', 'sentinel2_b4_20180710', 'sentinel2_b5_20180710', 'sentinel2_b6_20180710', 'sentinel2_b7_20180710', 'sentinel2_b8_20180710', 'sentinel2_b8a_20180710', 'sentinel2_b11_20180710', 'sentinel2_b12_20180710', 'sentinel2_b2_20180720', 'sentinel2_b3_20180720', 'sentinel2_b4_20180720', 'sentinel2_b5_20180720', 'sentinel2_b6_20180720', 'sentinel2_b7_20180720', 'sentinel2_b8_20180720', 'sentinel2_b8a_20180720', 'sentinel2_b11_20180720', 'sentinel2_b12_20180720', 'sentinel2_b2_20180730', 'sentinel2_b3_20180730', 'sentinel2_b4_20180730', 'sentinel2_b5_20180730', 'sentinel2_b6_20180730', 'sentinel2_b7_20180730', 'sentinel2_b8_20180730', 'sentinel2_b8a_20180730', 'sentinel2_b11_20180730', 'sentinel2_b12_20180730', 'sentinel2_b2_20180809', 'sentinel2_b3_20180809', 'sentinel2_b4_20180809', 'sentinel2_b5_20180809', 'sentinel2_b6_20180809', 'sentinel2_b7_20180809', 'sentinel2_b8_20180809', 'sentinel2_b8a_20180809', 'sentinel2_b11_20180809', 'sentinel2_b12_20180809', 'sentinel2_b2_20180819', 'sentinel2_b3_20180819', 'sentinel2_b4_20180819', 'sentinel2_b5_20180819', 'sentinel2_b6_20180819', 'sentinel2_b7_20180819', 'sentinel2_b8_20180819', 'sentinel2_b8a_20180819', 'sentinel2_b11_20180819', 'sentinel2_b12_20180819', 'sentinel2_b2_20180829', 'sentinel2_b3_20180829', 'sentinel2_b4_20180829', 'sentinel2_b5_20180829', 'sentinel2_b6_20180829', 'sentinel2_b7_20180829', 'sentinel2_b8_20180829', 'sentinel2_b8a_20180829', 'sentinel2_b11_20180829', 'sentinel2_b12_20180829', 'sentinel2_b2_20180908', 'sentinel2_b3_20180908', 'sentinel2_b4_20180908', 'sentinel2_b5_20180908', 'sentinel2_b6_20180908', 'sentinel2_b7_20180908', 'sentinel2_b8_20180908', 'sentinel2_b8a_20180908', 'sentinel2_b11_20180908', 'sentinel2_b12_20180908', 'sentinel2_b2_20180918', 'sentinel2_b3_20180918', 'sentinel2_b4_20180918', 'sentinel2_b5_20180918', 'sentinel2_b6_20180918', 'sentinel2_b7_20180918', 'sentinel2_b8_20180918', 'sentinel2_b8a_20180918', 'sentinel2_b11_20180918', 'sentinel2_b12_20180918', 'sentinel2_b2_20180928', 'sentinel2_b3_20180928', 'sentinel2_b4_20180928', 'sentinel2_b5_20180928', 'sentinel2_b6_20180928', 'sentinel2_b7_20180928', 'sentinel2_b8_20180928', 'sentinel2_b8a_20180928', 'sentinel2_b11_20180928', 'sentinel2_b12_20180928', 'sentinel2_b2_20181008', 'sentinel2_b3_20181008', 'sentinel2_b4_20181008', 'sentinel2_b5_20181008', 'sentinel2_b6_20181008', 'sentinel2_b7_20181008', 'sentinel2_b8_20181008', 'sentinel2_b8a_20181008', 'sentinel2_b11_20181008', 'sentinel2_b12_20181008', 'sentinel2_b2_20181018', 'sentinel2_b3_20181018', 'sentinel2_b4_20181018', 'sentinel2_b5_20181018', 'sentinel2_b6_20181018', 'sentinel2_b7_20181018', 'sentinel2_b8_20181018', 'sentinel2_b8a_20181018', 'sentinel2_b11_20181018', 'sentinel2_b12_20181018', 'sentinel2_b2_20181028', 'sentinel2_b3_20181028', 'sentinel2_b4_20181028', 'sentinel2_b5_20181028', 'sentinel2_b6_20181028', 'sentinel2_b7_20181028', 'sentinel2_b8_20181028', 'sentinel2_b8a_20181028', 'sentinel2_b11_20181028', 'sentinel2_b12_20181028', 'sentinel2_b2_20181107', 'sentinel2_b3_20181107', 'sentinel2_b4_20181107', 'sentinel2_b5_20181107', 'sentinel2_b6_20181107', 'sentinel2_b7_20181107', 'sentinel2_b8_20181107', 'sentinel2_b8a_20181107', 'sentinel2_b11_20181107', 'sentinel2_b12_20181107', 'sentinel2_b2_20181117', 'sentinel2_b3_20181117', 'sentinel2_b4_20181117', 'sentinel2_b5_20181117', 'sentinel2_b6_20181117', 'sentinel2_b7_20181117', 'sentinel2_b8_20181117', 'sentinel2_b8a_20181117', 'sentinel2_b11_20181117', 'sentinel2_b12_20181117', 'sentinel2_b2_20181127', 'sentinel2_b3_20181127', 'sentinel2_b4_20181127', 'sentinel2_b5_20181127', 'sentinel2_b6_20181127', 'sentinel2_b7_20181127', 'sentinel2_b8_20181127', 'sentinel2_b8a_20181127', 'sentinel2_b11_20181127', 'sentinel2_b12_20181127', 'sentinel2_b2_20181207', 'sentinel2_b3_20181207', 'sentinel2_b4_20181207', 'sentinel2_b5_20181207', 'sentinel2_b6_20181207', 'sentinel2_b7_20181207', 'sentinel2_b8_20181207', 'sentinel2_b8a_20181207', 'sentinel2_b11_20181207', 'sentinel2_b12_20181207', 'sentinel2_b2_20181217', 'sentinel2_b3_20181217', 'sentinel2_b4_20181217', 'sentinel2_b5_20181217', 'sentinel2_b6_20181217', 'sentinel2_b7_20181217', 'sentinel2_b8_20181217', 'sentinel2_b8a_20181217', 'sentinel2_b11_20181217', 'sentinel2_b12_20181217', 'sentinel2_b2_20181227', 'sentinel2_b3_20181227', 'sentinel2_b4_20181227', 'sentinel2_b5_20181227', 'sentinel2_b6_20181227', 'sentinel2_b7_20181227', 'sentinel2_b8_20181227', 'sentinel2_b8a_20181227', 'sentinel2_b11_20181227', 'sentinel2_b12_20181227', 'sentinel2_b2_20190101', 'sentinel2_b3_20190101', 'sentinel2_b4_20190101', 'sentinel2_b5_20190101', 'sentinel2_b6_20190101', 'sentinel2_b7_20190101', 'sentinel2_b8_20190101', 'sentinel2_b8a_20190101', 'sentinel2_b11_20190101', 'sentinel2_b12_20190101', 'sentinel2_b2_20190111', 'sentinel2_b3_20190111', 'sentinel2_b4_20190111', 'sentinel2_b5_20190111', 'sentinel2_b6_20190111', 'sentinel2_b7_20190111', 'sentinel2_b8_20190111', 'sentinel2_b8a_20190111', 'sentinel2_b11_20190111', 'sentinel2_b12_20190111', 'sentinel2_b2_20190121', 'sentinel2_b3_20190121', 'sentinel2_b4_20190121', 'sentinel2_b5_20190121', 'sentinel2_b6_20190121', 'sentinel2_b7_20190121', 'sentinel2_b8_20190121', 'sentinel2_b8a_20190121', 'sentinel2_b11_20190121', 'sentinel2_b12_20190121', 'sentinel2_b2_20190131', 'sentinel2_b3_20190131', 'sentinel2_b4_20190131', 'sentinel2_b5_20190131', 'sentinel2_b6_20190131', 'sentinel2_b7_20190131', 'sentinel2_b8_20190131', 'sentinel2_b8a_20190131', 'sentinel2_b11_20190131', 'sentinel2_b12_20190131', 'sentinel2_b2_20190210', 'sentinel2_b3_20190210', 'sentinel2_b4_20190210', 'sentinel2_b5_20190210', 'sentinel2_b6_20190210', 'sentinel2_b7_20190210', 'sentinel2_b8_20190210', 'sentinel2_b8a_20190210', 'sentinel2_b11_20190210', 'sentinel2_b12_20190210', 'sentinel2_b2_20190220', 'sentinel2_b3_20190220', 'sentinel2_b4_20190220', 'sentinel2_b5_20190220', 'sentinel2_b6_20190220', 'sentinel2_b7_20190220', 'sentinel2_b8_20190220', 'sentinel2_b8a_20190220', 'sentinel2_b11_20190220', 'sentinel2_b12_20190220', 'sentinel2_b2_20190302', 'sentinel2_b3_20190302', 'sentinel2_b4_20190302', 'sentinel2_b5_20190302', 'sentinel2_b6_20190302', 'sentinel2_b7_20190302', 'sentinel2_b8_20190302', 'sentinel2_b8a_20190302', 'sentinel2_b11_20190302', 'sentinel2_b12_20190302', 'sentinel2_b2_20190312', 'sentinel2_b3_20190312', 'sentinel2_b4_20190312', 'sentinel2_b5_20190312', 'sentinel2_b6_20190312', 'sentinel2_b7_20190312', 'sentinel2_b8_20190312', 'sentinel2_b8a_20190312', 'sentinel2_b11_20190312', 'sentinel2_b12_20190312', 'sentinel2_b2_20190322', 'sentinel2_b3_20190322', 'sentinel2_b4_20190322', 'sentinel2_b5_20190322', 'sentinel2_b6_20190322', 'sentinel2_b7_20190322', 'sentinel2_b8_20190322', 'sentinel2_b8a_20190322', 'sentinel2_b11_20190322', 'sentinel2_b12_20190322', 'sentinel2_b2_20190401', 'sentinel2_b3_20190401', 'sentinel2_b4_20190401', 'sentinel2_b5_20190401', 'sentinel2_b6_20190401', 'sentinel2_b7_20190401', 'sentinel2_b8_20190401', 'sentinel2_b8a_20190401', 'sentinel2_b11_20190401', 'sentinel2_b12_20190401', 'sentinel2_b2_20190411', 'sentinel2_b3_20190411', 'sentinel2_b4_20190411', 'sentinel2_b5_20190411', 'sentinel2_b6_20190411', 'sentinel2_b7_20190411', 'sentinel2_b8_20190411', 'sentinel2_b8a_20190411', 'sentinel2_b11_20190411', 'sentinel2_b12_20190411', 'sentinel2_b2_20190421', 'sentinel2_b3_20190421', 'sentinel2_b4_20190421', 'sentinel2_b5_20190421', 'sentinel2_b6_20190421', 'sentinel2_b7_20190421', 'sentinel2_b8_20190421', 'sentinel2_b8a_20190421', 'sentinel2_b11_20190421', 'sentinel2_b12_20190421', 'sentinel2_b2_20190501', 'sentinel2_b3_20190501', 'sentinel2_b4_20190501', 'sentinel2_b5_20190501', 'sentinel2_b6_20190501', 'sentinel2_b7_20190501', 'sentinel2_b8_20190501', 'sentinel2_b8a_20190501', 'sentinel2_b11_20190501', 'sentinel2_b12_20190501', 'sentinel2_b2_20190511', 'sentinel2_b3_20190511', 'sentinel2_b4_20190511', 'sentinel2_b5_20190511', 'sentinel2_b6_20190511', 'sentinel2_b7_20190511', 'sentinel2_b8_20190511', 'sentinel2_b8a_20190511', 'sentinel2_b11_20190511', 'sentinel2_b12_20190511', 'sentinel2_b2_20190521', 'sentinel2_b3_20190521', 'sentinel2_b4_20190521', 'sentinel2_b5_20190521', 'sentinel2_b6_20190521', 'sentinel2_b7_20190521', 'sentinel2_b8_20190521', 'sentinel2_b8a_20190521', 'sentinel2_b11_20190521', 'sentinel2_b12_20190521', 'sentinel2_b2_20190531', 'sentinel2_b3_20190531', 'sentinel2_b4_20190531', 'sentinel2_b5_20190531', 'sentinel2_b6_20190531', 'sentinel2_b7_20190531', 'sentinel2_b8_20190531', 'sentinel2_b8a_20190531', 'sentinel2_b11_20190531', 'sentinel2_b12_20190531', 'sentinel2_b2_20190610', 'sentinel2_b3_20190610', 'sentinel2_b4_20190610', 'sentinel2_b5_20190610', 'sentinel2_b6_20190610', 'sentinel2_b7_20190610', 'sentinel2_b8_20190610', 'sentinel2_b8a_20190610', 'sentinel2_b11_20190610', 'sentinel2_b12_20190610', 'sentinel2_b2_20190620', 'sentinel2_b3_20190620', 'sentinel2_b4_20190620', 'sentinel2_b5_20190620', 'sentinel2_b6_20190620', 'sentinel2_b7_20190620', 'sentinel2_b8_20190620', 'sentinel2_b8a_20190620', 'sentinel2_b11_20190620', 'sentinel2_b12_20190620', 'sentinel2_b2_20190630', 'sentinel2_b3_20190630', 'sentinel2_b4_20190630', 'sentinel2_b5_20190630', 'sentinel2_b6_20190630', 'sentinel2_b7_20190630', 'sentinel2_b8_20190630', 'sentinel2_b8a_20190630', 'sentinel2_b11_20190630', 'sentinel2_b12_20190630', 'sentinel2_b2_20190710', 'sentinel2_b3_20190710', 'sentinel2_b4_20190710', 'sentinel2_b5_20190710', 'sentinel2_b6_20190710', 'sentinel2_b7_20190710', 'sentinel2_b8_20190710', 'sentinel2_b8a_20190710', 'sentinel2_b11_20190710', 'sentinel2_b12_20190710', 'sentinel2_b2_20190720', 'sentinel2_b3_20190720', 'sentinel2_b4_20190720', 'sentinel2_b5_20190720', 'sentinel2_b6_20190720', 'sentinel2_b7_20190720', 'sentinel2_b8_20190720', 'sentinel2_b8a_20190720', 'sentinel2_b11_20190720', 'sentinel2_b12_20190720', 'sentinel2_b2_20190730', 'sentinel2_b3_20190730', 'sentinel2_b4_20190730', 'sentinel2_b5_20190730', 'sentinel2_b6_20190730', 'sentinel2_b7_20190730', 'sentinel2_b8_20190730', 'sentinel2_b8a_20190730', 'sentinel2_b11_20190730', 'sentinel2_b12_20190730', 'sentinel2_b2_20190809', 'sentinel2_b3_20190809', 'sentinel2_b4_20190809', 'sentinel2_b5_20190809', 'sentinel2_b6_20190809', 'sentinel2_b7_20190809', 'sentinel2_b8_20190809', 'sentinel2_b8a_20190809', 'sentinel2_b11_20190809', 'sentinel2_b12_20190809', 'sentinel2_b2_20190819', 'sentinel2_b3_20190819', 'sentinel2_b4_20190819', 'sentinel2_b5_20190819', 'sentinel2_b6_20190819', 'sentinel2_b7_20190819', 'sentinel2_b8_20190819', 'sentinel2_b8a_20190819', 'sentinel2_b11_20190819', 'sentinel2_b12_20190819', 'sentinel2_b2_20190829', 'sentinel2_b3_20190829', 'sentinel2_b4_20190829', 'sentinel2_b5_20190829', 'sentinel2_b6_20190829', 'sentinel2_b7_20190829', 'sentinel2_b8_20190829', 'sentinel2_b8a_20190829', 'sentinel2_b11_20190829', 'sentinel2_b12_20190829', 'sentinel2_b2_20190908', 'sentinel2_b3_20190908', 'sentinel2_b4_20190908', 'sentinel2_b5_20190908', 'sentinel2_b6_20190908', 'sentinel2_b7_20190908', 'sentinel2_b8_20190908', 'sentinel2_b8a_20190908', 'sentinel2_b11_20190908', 'sentinel2_b12_20190908', 'sentinel2_b2_20190918', 'sentinel2_b3_20190918', 'sentinel2_b4_20190918', 'sentinel2_b5_20190918', 'sentinel2_b6_20190918', 'sentinel2_b7_20190918', 'sentinel2_b8_20190918', 'sentinel2_b8a_20190918', 'sentinel2_b11_20190918', 'sentinel2_b12_20190918', 'sentinel2_b2_20190928', 'sentinel2_b3_20190928', 'sentinel2_b4_20190928', 'sentinel2_b5_20190928', 'sentinel2_b6_20190928', 'sentinel2_b7_20190928', 'sentinel2_b8_20190928', 'sentinel2_b8a_20190928', 'sentinel2_b11_20190928', 'sentinel2_b12_20190928', 'sentinel2_b2_20191008', 'sentinel2_b3_20191008', 'sentinel2_b4_20191008', 'sentinel2_b5_20191008', 'sentinel2_b6_20191008', 'sentinel2_b7_20191008', 'sentinel2_b8_20191008', 'sentinel2_b8a_20191008', 'sentinel2_b11_20191008', 'sentinel2_b12_20191008', 'sentinel2_b2_20191018', 'sentinel2_b3_20191018', 'sentinel2_b4_20191018', 'sentinel2_b5_20191018', 'sentinel2_b6_20191018', 'sentinel2_b7_20191018', 'sentinel2_b8_20191018', 'sentinel2_b8a_20191018', 'sentinel2_b11_20191018', 'sentinel2_b12_20191018', 'sentinel2_b2_20191028', 'sentinel2_b3_20191028', 'sentinel2_b4_20191028', 'sentinel2_b5_20191028', 'sentinel2_b6_20191028', 'sentinel2_b7_20191028', 'sentinel2_b8_20191028', 'sentinel2_b8a_20191028', 'sentinel2_b11_20191028', 'sentinel2_b12_20191028', 'sentinel2_b2_20191107', 'sentinel2_b3_20191107', 'sentinel2_b4_20191107', 'sentinel2_b5_20191107', 'sentinel2_b6_20191107', 'sentinel2_b7_20191107', 'sentinel2_b8_20191107', 'sentinel2_b8a_20191107', 'sentinel2_b11_20191107', 'sentinel2_b12_20191107', 'sentinel2_b2_20191117', 'sentinel2_b3_20191117', 'sentinel2_b4_20191117', 'sentinel2_b5_20191117', 'sentinel2_b6_20191117', 'sentinel2_b7_20191117', 'sentinel2_b8_20191117', 'sentinel2_b8a_20191117', 'sentinel2_b11_20191117', 'sentinel2_b12_20191117', 'sentinel2_b2_20191127', 'sentinel2_b3_20191127', 'sentinel2_b4_20191127', 'sentinel2_b5_20191127', 'sentinel2_b6_20191127', 'sentinel2_b7_20191127', 'sentinel2_b8_20191127', 'sentinel2_b8a_20191127', 'sentinel2_b11_20191127', 'sentinel2_b12_20191127', 'sentinel2_b2_20191207', 'sentinel2_b3_20191207', 'sentinel2_b4_20191207', 'sentinel2_b5_20191207', 'sentinel2_b6_20191207', 'sentinel2_b7_20191207', 'sentinel2_b8_20191207', 'sentinel2_b8a_20191207', 'sentinel2_b11_20191207', 'sentinel2_b12_20191207', 'sentinel2_b2_20191217', 'sentinel2_b3_20191217', 'sentinel2_b4_20191217', 'sentinel2_b5_20191217', 'sentinel2_b6_20191217', 'sentinel2_b7_20191217', 'sentinel2_b8_20191217', 'sentinel2_b8a_20191217', 'sentinel2_b11_20191217', 'sentinel2_b12_20191217', 'sentinel2_b2_20191227', 'sentinel2_b3_20191227', 'sentinel2_b4_20191227', 'sentinel2_b5_20191227', 'sentinel2_b6_20191227', 'sentinel2_b7_20191227', 'sentinel2_b8_20191227', 'sentinel2_b8a_20191227', 'sentinel2_b11_20191227', 'sentinel2_b12_20191227', 'sentinel2_b2_20200101', 'sentinel2_b3_20200101', 'sentinel2_b4_20200101', 'sentinel2_b5_20200101', 'sentinel2_b6_20200101', 'sentinel2_b7_20200101', 'sentinel2_b8_20200101', 'sentinel2_b8a_20200101', 'sentinel2_b11_20200101', 'sentinel2_b12_20200101', 'sentinel2_b2_20200111', 'sentinel2_b3_20200111', 'sentinel2_b4_20200111', 'sentinel2_b5_20200111', 'sentinel2_b6_20200111', 'sentinel2_b7_20200111', 'sentinel2_b8_20200111', 'sentinel2_b8a_20200111', 'sentinel2_b11_20200111', 'sentinel2_b12_20200111', 'sentinel2_b2_20200121', 'sentinel2_b3_20200121', 'sentinel2_b4_20200121', 'sentinel2_b5_20200121', 'sentinel2_b6_20200121', 'sentinel2_b7_20200121', 'sentinel2_b8_20200121', 'sentinel2_b8a_20200121', 'sentinel2_b11_20200121', 'sentinel2_b12_20200121', 'sentinel2_b2_20200131', 'sentinel2_b3_20200131', 'sentinel2_b4_20200131', 'sentinel2_b5_20200131', 'sentinel2_b6_20200131', 'sentinel2_b7_20200131', 'sentinel2_b8_20200131', 'sentinel2_b8a_20200131', 'sentinel2_b11_20200131', 'sentinel2_b12_20200131', 'sentinel2_b2_20200210', 'sentinel2_b3_20200210', 'sentinel2_b4_20200210', 'sentinel2_b5_20200210', 'sentinel2_b6_20200210', 'sentinel2_b7_20200210', 'sentinel2_b8_20200210', 'sentinel2_b8a_20200210', 'sentinel2_b11_20200210', 'sentinel2_b12_20200210', 'sentinel2_b2_20200220', 'sentinel2_b3_20200220', 'sentinel2_b4_20200220', 'sentinel2_b5_20200220', 'sentinel2_b6_20200220', 'sentinel2_b7_20200220', 'sentinel2_b8_20200220', 'sentinel2_b8a_20200220', 'sentinel2_b11_20200220', 'sentinel2_b12_20200220', 'sentinel2_b2_20200301', 'sentinel2_b3_20200301', 'sentinel2_b4_20200301', 'sentinel2_b5_20200301', 'sentinel2_b6_20200301', 'sentinel2_b7_20200301', 'sentinel2_b8_20200301', 'sentinel2_b8a_20200301', 'sentinel2_b11_20200301', 'sentinel2_b12_20200301', 'sentinel2_b2_20200311', 'sentinel2_b3_20200311', 'sentinel2_b4_20200311', 'sentinel2_b5_20200311', 'sentinel2_b6_20200311', 'sentinel2_b7_20200311', 'sentinel2_b8_20200311', 'sentinel2_b8a_20200311', 'sentinel2_b11_20200311', 'sentinel2_b12_20200311', 'sentinel2_b2_20200321', 'sentinel2_b3_20200321', 'sentinel2_b4_20200321', 'sentinel2_b5_20200321', 'sentinel2_b6_20200321', 'sentinel2_b7_20200321', 'sentinel2_b8_20200321', 'sentinel2_b8a_20200321', 'sentinel2_b11_20200321', 'sentinel2_b12_20200321', 'sentinel2_b2_20200331', 'sentinel2_b3_20200331', 'sentinel2_b4_20200331', 'sentinel2_b5_20200331', 'sentinel2_b6_20200331', 'sentinel2_b7_20200331', 'sentinel2_b8_20200331', 'sentinel2_b8a_20200331', 'sentinel2_b11_20200331', 'sentinel2_b12_20200331', 'sentinel2_b2_20200410', 'sentinel2_b3_20200410', 'sentinel2_b4_20200410', 'sentinel2_b5_20200410', 'sentinel2_b6_20200410', 'sentinel2_b7_20200410', 'sentinel2_b8_20200410', 'sentinel2_b8a_20200410', 'sentinel2_b11_20200410', 'sentinel2_b12_20200410', 'sentinel2_b2_20200420', 'sentinel2_b3_20200420', 'sentinel2_b4_20200420', 'sentinel2_b5_20200420', 'sentinel2_b6_20200420', 'sentinel2_b7_20200420', 'sentinel2_b8_20200420', 'sentinel2_b8a_20200420', 'sentinel2_b11_20200420', 'sentinel2_b12_20200420', 'sentinel2_b2_20200430', 'sentinel2_b3_20200430', 'sentinel2_b4_20200430', 'sentinel2_b5_20200430', 'sentinel2_b6_20200430', 'sentinel2_b7_20200430', 'sentinel2_b8_20200430', 'sentinel2_b8a_20200430', 'sentinel2_b11_20200430', 'sentinel2_b12_20200430', 'sentinel2_b2_20200510', 'sentinel2_b3_20200510', 'sentinel2_b4_20200510', 'sentinel2_b5_20200510', 'sentinel2_b6_20200510', 'sentinel2_b7_20200510', 'sentinel2_b8_20200510', 'sentinel2_b8a_20200510', 'sentinel2_b11_20200510', 'sentinel2_b12_20200510', 'sentinel2_b2_20200520', 'sentinel2_b3_20200520', 'sentinel2_b4_20200520', 'sentinel2_b5_20200520', 'sentinel2_b6_20200520', 'sentinel2_b7_20200520', 'sentinel2_b8_20200520', 'sentinel2_b8a_20200520', 'sentinel2_b11_20200520', 'sentinel2_b12_20200520', 'sentinel2_b2_20200530', 'sentinel2_b3_20200530', 'sentinel2_b4_20200530', 'sentinel2_b5_20200530', 'sentinel2_b6_20200530', 'sentinel2_b7_20200530', 'sentinel2_b8_20200530', 'sentinel2_b8a_20200530', 'sentinel2_b11_20200530', 'sentinel2_b12_20200530', 'sentinel2_b2_20200609', 'sentinel2_b3_20200609', 'sentinel2_b4_20200609', 'sentinel2_b5_20200609', 'sentinel2_b6_20200609', 'sentinel2_b7_20200609', 'sentinel2_b8_20200609', 'sentinel2_b8a_20200609', 'sentinel2_b11_20200609', 'sentinel2_b12_20200609', 'sentinel2_b2_20200619', 'sentinel2_b3_20200619', 'sentinel2_b4_20200619', 'sentinel2_b5_20200619', 'sentinel2_b6_20200619', 'sentinel2_b7_20200619', 'sentinel2_b8_20200619', 'sentinel2_b8a_20200619', 'sentinel2_b11_20200619', 'sentinel2_b12_20200619', 'sentinel2_b2_20200629', 'sentinel2_b3_20200629', 'sentinel2_b4_20200629', 'sentinel2_b5_20200629', 'sentinel2_b6_20200629', 'sentinel2_b7_20200629', 'sentinel2_b8_20200629', 'sentinel2_b8a_20200629', 'sentinel2_b11_20200629', 'sentinel2_b12_20200629', 'sentinel2_b2_20200709', 'sentinel2_b3_20200709', 'sentinel2_b4_20200709', 'sentinel2_b5_20200709', 'sentinel2_b6_20200709', 'sentinel2_b7_20200709', 'sentinel2_b8_20200709', 'sentinel2_b8a_20200709', 'sentinel2_b11_20200709', 'sentinel2_b12_20200709', 'sentinel2_b2_20200719', 'sentinel2_b3_20200719', 'sentinel2_b4_20200719', 'sentinel2_b5_20200719', 'sentinel2_b6_20200719', 'sentinel2_b7_20200719', 'sentinel2_b8_20200719', 'sentinel2_b8a_20200719', 'sentinel2_b11_20200719', 'sentinel2_b12_20200719', 'sentinel2_b2_20200729', 'sentinel2_b3_20200729', 'sentinel2_b4_20200729', 'sentinel2_b5_20200729', 'sentinel2_b6_20200729', 'sentinel2_b7_20200729', 'sentinel2_b8_20200729', 'sentinel2_b8a_20200729', 'sentinel2_b11_20200729', 'sentinel2_b12_20200729', 'sentinel2_b2_20200808', 'sentinel2_b3_20200808', 'sentinel2_b4_20200808', 'sentinel2_b5_20200808', 'sentinel2_b6_20200808', 'sentinel2_b7_20200808', 'sentinel2_b8_20200808', 'sentinel2_b8a_20200808', 'sentinel2_b11_20200808', 'sentinel2_b12_20200808', 'sentinel2_b2_20200818', 'sentinel2_b3_20200818', 'sentinel2_b4_20200818', 'sentinel2_b5_20200818', 'sentinel2_b6_20200818', 'sentinel2_b7_20200818', 'sentinel2_b8_20200818', 'sentinel2_b8a_20200818', 'sentinel2_b11_20200818', 'sentinel2_b12_20200818', 'sentinel2_b2_20200828', 'sentinel2_b3_20200828', 'sentinel2_b4_20200828', 'sentinel2_b5_20200828', 'sentinel2_b6_20200828', 'sentinel2_b7_20200828', 'sentinel2_b8_20200828', 'sentinel2_b8a_20200828', 'sentinel2_b11_20200828', 'sentinel2_b12_20200828', 'sentinel2_b2_20200907', 'sentinel2_b3_20200907', 'sentinel2_b4_20200907', 'sentinel2_b5_20200907', 'sentinel2_b6_20200907', 'sentinel2_b7_20200907', 'sentinel2_b8_20200907', 'sentinel2_b8a_20200907', 'sentinel2_b11_20200907', 'sentinel2_b12_20200907', 'sentinel2_b2_20200917', 'sentinel2_b3_20200917', 'sentinel2_b4_20200917', 'sentinel2_b5_20200917', 'sentinel2_b6_20200917', 'sentinel2_b7_20200917', 'sentinel2_b8_20200917', 'sentinel2_b8a_20200917', 'sentinel2_b11_20200917', 'sentinel2_b12_20200917', 'sentinel2_b2_20200927', 'sentinel2_b3_20200927', 'sentinel2_b4_20200927', 'sentinel2_b5_20200927', 'sentinel2_b6_20200927', 'sentinel2_b7_20200927', 'sentinel2_b8_20200927', 'sentinel2_b8a_20200927', 'sentinel2_b11_20200927', 'sentinel2_b12_20200927', 'sentinel2_b2_20201007', 'sentinel2_b3_20201007', 'sentinel2_b4_20201007', 'sentinel2_b5_20201007', 'sentinel2_b6_20201007', 'sentinel2_b7_20201007', 'sentinel2_b8_20201007', 'sentinel2_b8a_20201007', 'sentinel2_b11_20201007', 'sentinel2_b12_20201007', 'sentinel2_b2_20201017', 'sentinel2_b3_20201017', 'sentinel2_b4_20201017', 'sentinel2_b5_20201017', 'sentinel2_b6_20201017', 'sentinel2_b7_20201017', 'sentinel2_b8_20201017', 'sentinel2_b8a_20201017', 'sentinel2_b11_20201017', 'sentinel2_b12_20201017', 'sentinel2_b2_20201027', 'sentinel2_b3_20201027', 'sentinel2_b4_20201027', 'sentinel2_b5_20201027', 'sentinel2_b6_20201027', 'sentinel2_b7_20201027', 'sentinel2_b8_20201027', 'sentinel2_b8a_20201027', 'sentinel2_b11_20201027', 'sentinel2_b12_20201027', 'sentinel2_b2_20201106', 'sentinel2_b3_20201106', 'sentinel2_b4_20201106', 'sentinel2_b5_20201106', 'sentinel2_b6_20201106', 'sentinel2_b7_20201106', 'sentinel2_b8_20201106', 'sentinel2_b8a_20201106', 'sentinel2_b11_20201106', 'sentinel2_b12_20201106', 'sentinel2_b2_20201116', 'sentinel2_b3_20201116', 'sentinel2_b4_20201116', 'sentinel2_b5_20201116', 'sentinel2_b6_20201116', 'sentinel2_b7_20201116', 'sentinel2_b8_20201116', 'sentinel2_b8a_20201116', 'sentinel2_b11_20201116', 'sentinel2_b12_20201116', 'sentinel2_b2_20201126', 'sentinel2_b3_20201126', 'sentinel2_b4_20201126', 'sentinel2_b5_20201126', 'sentinel2_b6_20201126', 'sentinel2_b7_20201126', 'sentinel2_b8_20201126', 'sentinel2_b8a_20201126', 'sentinel2_b11_20201126', 'sentinel2_b12_20201126', 'sentinel2_b2_20201206', 'sentinel2_b3_20201206', 'sentinel2_b4_20201206', 'sentinel2_b5_20201206', 'sentinel2_b6_20201206', 'sentinel2_b7_20201206', 'sentinel2_b8_20201206', 'sentinel2_b8a_20201206', 'sentinel2_b11_20201206', 'sentinel2_b12_20201206', 'sentinel2_b2_20201216', 'sentinel2_b3_20201216', 'sentinel2_b4_20201216', 'sentinel2_b5_20201216', 'sentinel2_b6_20201216', 'sentinel2_b7_20201216', 'sentinel2_b8_20201216', 'sentinel2_b8a_20201216', 'sentinel2_b11_20201216', 'sentinel2_b12_20201216', 'sentinel2_b2_20201226', 'sentinel2_b3_20201226', 'sentinel2_b4_20201226', 'sentinel2_b5_20201226', 'sentinel2_b6_20201226', 'sentinel2_b7_20201226', 'sentinel2_b8_20201226', 'sentinel2_b8a_20201226', 'sentinel2_b11_20201226', 'sentinel2_b12_20201226', 'sentinel2_b2_20210101', 'sentinel2_b3_20210101', 'sentinel2_b4_20210101', 'sentinel2_b5_20210101', 'sentinel2_b6_20210101', 'sentinel2_b7_20210101', 'sentinel2_b8_20210101', 'sentinel2_b8a_20210101', 'sentinel2_b11_20210101', 'sentinel2_b12_20210101', 'sentinel2_b2_20210111', 'sentinel2_b3_20210111', 'sentinel2_b4_20210111', 'sentinel2_b5_20210111', 'sentinel2_b6_20210111', 'sentinel2_b7_20210111', 'sentinel2_b8_20210111', 'sentinel2_b8a_20210111', 'sentinel2_b11_20210111', 'sentinel2_b12_20210111', 'sentinel2_b2_20210121', 'sentinel2_b3_20210121', 'sentinel2_b4_20210121', 'sentinel2_b5_20210121', 'sentinel2_b6_20210121', 'sentinel2_b7_20210121', 'sentinel2_b8_20210121', 'sentinel2_b8a_20210121', 'sentinel2_b11_20210121', 'sentinel2_b12_20210121', 'sentinel2_b2_20210131', 'sentinel2_b3_20210131', 'sentinel2_b4_20210131', 'sentinel2_b5_20210131', 'sentinel2_b6_20210131', 'sentinel2_b7_20210131', 'sentinel2_b8_20210131', 'sentinel2_b8a_20210131', 'sentinel2_b11_20210131', 'sentinel2_b12_20210131', 'sentinel2_b2_20210210', 'sentinel2_b3_20210210', 'sentinel2_b4_20210210', 'sentinel2_b5_20210210', 'sentinel2_b6_20210210', 'sentinel2_b7_20210210', 'sentinel2_b8_20210210', 'sentinel2_b8a_20210210', 'sentinel2_b11_20210210', 'sentinel2_b12_20210210', 'sentinel2_b2_20210220', 'sentinel2_b3_20210220', 'sentinel2_b4_20210220', 'sentinel2_b5_20210220', 'sentinel2_b6_20210220', 'sentinel2_b7_20210220', 'sentinel2_b8_20210220', 'sentinel2_b8a_20210220', 'sentinel2_b11_20210220', 'sentinel2_b12_20210220', 'sentinel2_b2_20210302', 'sentinel2_b3_20210302', 'sentinel2_b4_20210302', 'sentinel2_b5_20210302', 'sentinel2_b6_20210302', 'sentinel2_b7_20210302', 'sentinel2_b8_20210302', 'sentinel2_b8a_20210302', 'sentinel2_b11_20210302', 'sentinel2_b12_20210302', 'sentinel2_b2_20210312', 'sentinel2_b3_20210312', 'sentinel2_b4_20210312', 'sentinel2_b5_20210312', 'sentinel2_b6_20210312', 'sentinel2_b7_20210312', 'sentinel2_b8_20210312', 'sentinel2_b8a_20210312', 'sentinel2_b11_20210312', 'sentinel2_b12_20210312', 'sentinel2_b2_20210322', 'sentinel2_b3_20210322', 'sentinel2_b4_20210322', 'sentinel2_b5_20210322', 'sentinel2_b6_20210322', 'sentinel2_b7_20210322', 'sentinel2_b8_20210322', 'sentinel2_b8a_20210322', 'sentinel2_b11_20210322', 'sentinel2_b12_20210322', 'sentinel2_b2_20210401', 'sentinel2_b3_20210401', 'sentinel2_b4_20210401', 'sentinel2_b5_20210401', 'sentinel2_b6_20210401', 'sentinel2_b7_20210401', 'sentinel2_b8_20210401', 'sentinel2_b8a_20210401', 'sentinel2_b11_20210401', 'sentinel2_b12_20210401', 'sentinel2_b2_20210411', 'sentinel2_b3_20210411', 'sentinel2_b4_20210411', 'sentinel2_b5_20210411', 'sentinel2_b6_20210411', 'sentinel2_b7_20210411', 'sentinel2_b8_20210411', 'sentinel2_b8a_20210411', 'sentinel2_b11_20210411', 'sentinel2_b12_20210411', 'sentinel2_b2_20210421', 'sentinel2_b3_20210421', 'sentinel2_b4_20210421', 'sentinel2_b5_20210421', 'sentinel2_b6_20210421', 'sentinel2_b7_20210421', 'sentinel2_b8_20210421', 'sentinel2_b8a_20210421', 'sentinel2_b11_20210421', 'sentinel2_b12_20210421', 'sentinel2_b2_20210501', 'sentinel2_b3_20210501', 'sentinel2_b4_20210501', 'sentinel2_b5_20210501', 'sentinel2_b6_20210501', 'sentinel2_b7_20210501', 'sentinel2_b8_20210501', 'sentinel2_b8a_20210501', 'sentinel2_b11_20210501', 'sentinel2_b12_20210501', 'sentinel2_b2_20210511', 'sentinel2_b3_20210511', 'sentinel2_b4_20210511', 'sentinel2_b5_20210511', 'sentinel2_b6_20210511', 'sentinel2_b7_20210511', 'sentinel2_b8_20210511', 'sentinel2_b8a_20210511', 'sentinel2_b11_20210511', 'sentinel2_b12_20210511', 'sentinel2_b2_20210521', 'sentinel2_b3_20210521', 'sentinel2_b4_20210521', 'sentinel2_b5_20210521', 'sentinel2_b6_20210521', 'sentinel2_b7_20210521', 'sentinel2_b8_20210521', 'sentinel2_b8a_20210521', 'sentinel2_b11_20210521', 'sentinel2_b12_20210521', 'sentinel2_b2_20210531', 'sentinel2_b3_20210531', 'sentinel2_b4_20210531', 'sentinel2_b5_20210531', 'sentinel2_b6_20210531', 'sentinel2_b7_20210531', 'sentinel2_b8_20210531', 'sentinel2_b8a_20210531', 'sentinel2_b11_20210531', 'sentinel2_b12_20210531', 'sentinel2_b2_20210610', 'sentinel2_b3_20210610', 'sentinel2_b4_20210610', 'sentinel2_b5_20210610', 'sentinel2_b6_20210610', 'sentinel2_b7_20210610', 'sentinel2_b8_20210610', 'sentinel2_b8a_20210610', 'sentinel2_b11_20210610', 'sentinel2_b12_20210610', 'sentinel2_b2_20210620', 'sentinel2_b3_20210620', 'sentinel2_b4_20210620', 'sentinel2_b5_20210620', 'sentinel2_b6_20210620', 'sentinel2_b7_20210620', 'sentinel2_b8_20210620', 'sentinel2_b8a_20210620', 'sentinel2_b11_20210620', 'sentinel2_b12_20210620', 'sentinel2_b2_20210630', 'sentinel2_b3_20210630', 'sentinel2_b4_20210630', 'sentinel2_b5_20210630', 'sentinel2_b6_20210630', 'sentinel2_b7_20210630', 'sentinel2_b8_20210630', 'sentinel2_b8a_20210630', 'sentinel2_b11_20210630', 'sentinel2_b12_20210630', 'sentinel2_b2_20210710', 'sentinel2_b3_20210710', 'sentinel2_b4_20210710', 'sentinel2_b5_20210710', 'sentinel2_b6_20210710', 'sentinel2_b7_20210710', 'sentinel2_b8_20210710', 'sentinel2_b8a_20210710', 'sentinel2_b11_20210710', 'sentinel2_b12_20210710', 'sentinel2_b2_20210720', 'sentinel2_b3_20210720', 'sentinel2_b4_20210720', 'sentinel2_b5_20210720', 'sentinel2_b6_20210720', 'sentinel2_b7_20210720', 'sentinel2_b8_20210720', 'sentinel2_b8a_20210720', 'sentinel2_b11_20210720', 'sentinel2_b12_20210720', 'sentinel2_b2_20210730', 'sentinel2_b3_20210730', 'sentinel2_b4_20210730', 'sentinel2_b5_20210730', 'sentinel2_b6_20210730', 'sentinel2_b7_20210730', 'sentinel2_b8_20210730', 'sentinel2_b8a_20210730', 'sentinel2_b11_20210730', 'sentinel2_b12_20210730', 'sentinel2_b2_20210809', 'sentinel2_b3_20210809', 'sentinel2_b4_20210809', 'sentinel2_b5_20210809', 'sentinel2_b6_20210809', 'sentinel2_b7_20210809', 'sentinel2_b8_20210809', 'sentinel2_b8a_20210809', 'sentinel2_b11_20210809', 'sentinel2_b12_20210809', 'sentinel2_b2_20210819', 'sentinel2_b3_20210819', 'sentinel2_b4_20210819', 'sentinel2_b5_20210819', 'sentinel2_b6_20210819', 'sentinel2_b7_20210819', 'sentinel2_b8_20210819', 'sentinel2_b8a_20210819', 'sentinel2_b11_20210819', 'sentinel2_b12_20210819', 'sentinel2_b2_20210829', 'sentinel2_b3_20210829', 'sentinel2_b4_20210829', 'sentinel2_b5_20210829', 'sentinel2_b6_20210829', 'sentinel2_b7_20210829', 'sentinel2_b8_20210829', 'sentinel2_b8a_20210829', 'sentinel2_b11_20210829', 'sentinel2_b12_20210829', 'sentinel2_b2_20210908', 'sentinel2_b3_20210908', 'sentinel2_b4_20210908', 'sentinel2_b5_20210908', 'sentinel2_b6_20210908', 'sentinel2_b7_20210908', 'sentinel2_b8_20210908', 'sentinel2_b8a_20210908', 'sentinel2_b11_20210908', 'sentinel2_b12_20210908', 'sentinel2_b2_20210918', 'sentinel2_b3_20210918', 'sentinel2_b4_20210918', 'sentinel2_b5_20210918', 'sentinel2_b6_20210918', 'sentinel2_b7_20210918', 'sentinel2_b8_20210918', 'sentinel2_b8a_20210918', 'sentinel2_b11_20210918', 'sentinel2_b12_20210918', 'sentinel2_b2_20210928', 'sentinel2_b3_20210928', 'sentinel2_b4_20210928', 'sentinel2_b5_20210928', 'sentinel2_b6_20210928', 'sentinel2_b7_20210928', 'sentinel2_b8_20210928', 'sentinel2_b8a_20210928', 'sentinel2_b11_20210928', 'sentinel2_b12_20210928', 'sentinel2_b2_20211008', 'sentinel2_b3_20211008', 'sentinel2_b4_20211008', 'sentinel2_b5_20211008', 'sentinel2_b6_20211008', 'sentinel2_b7_20211008', 'sentinel2_b8_20211008', 'sentinel2_b8a_20211008', 'sentinel2_b11_20211008', 'sentinel2_b12_20211008', 'sentinel2_b2_20211018', 'sentinel2_b3_20211018', 'sentinel2_b4_20211018', 'sentinel2_b5_20211018', 'sentinel2_b6_20211018', 'sentinel2_b7_20211018', 'sentinel2_b8_20211018', 'sentinel2_b8a_20211018', 'sentinel2_b11_20211018', 'sentinel2_b12_20211018', 'sentinel2_b2_20211028', 'sentinel2_b3_20211028', 'sentinel2_b4_20211028', 'sentinel2_b5_20211028', 'sentinel2_b6_20211028', 'sentinel2_b7_20211028', 'sentinel2_b8_20211028', 'sentinel2_b8a_20211028', 'sentinel2_b11_20211028', 'sentinel2_b12_20211028', 'sentinel2_b2_20211107', 'sentinel2_b3_20211107', 'sentinel2_b4_20211107', 'sentinel2_b5_20211107', 'sentinel2_b6_20211107', 'sentinel2_b7_20211107', 'sentinel2_b8_20211107', 'sentinel2_b8a_20211107', 'sentinel2_b11_20211107', 'sentinel2_b12_20211107', 'sentinel2_b2_20211117', 'sentinel2_b3_20211117', 'sentinel2_b4_20211117', 'sentinel2_b5_20211117', 'sentinel2_b6_20211117', 'sentinel2_b7_20211117', 'sentinel2_b8_20211117', 'sentinel2_b8a_20211117', 'sentinel2_b11_20211117', 'sentinel2_b12_20211117', 'sentinel2_b2_20211127', 'sentinel2_b3_20211127', 'sentinel2_b4_20211127', 'sentinel2_b5_20211127', 'sentinel2_b6_20211127', 'sentinel2_b7_20211127', 'sentinel2_b8_20211127', 'sentinel2_b8a_20211127', 'sentinel2_b11_20211127', 'sentinel2_b12_20211127', 'sentinel2_b2_20211207', 'sentinel2_b3_20211207', 'sentinel2_b4_20211207', 'sentinel2_b5_20211207', 'sentinel2_b6_20211207', 'sentinel2_b7_20211207', 'sentinel2_b8_20211207', 'sentinel2_b8a_20211207', 'sentinel2_b11_20211207', 'sentinel2_b12_20211207', 'sentinel2_b2_20211217', 'sentinel2_b3_20211217', 'sentinel2_b4_20211217', 'sentinel2_b5_20211217', 'sentinel2_b6_20211217', 'sentinel2_b7_20211217', 'sentinel2_b8_20211217', 'sentinel2_b8a_20211217', 'sentinel2_b11_20211217', 'sentinel2_b12_20211217', 'sentinel2_b2_20211227', 'sentinel2_b3_20211227', 'sentinel2_b4_20211227', 'sentinel2_b5_20211227', 'sentinel2_b6_20211227', 'sentinel2_b7_20211227', 'sentinel2_b8_20211227', 'sentinel2_b8a_20211227', 'sentinel2_b11_20211227', 'sentinel2_b12_20211227', 'sentinel2_b2_20220101', 'sentinel2_b3_20220101', 'sentinel2_b4_20220101', 'sentinel2_b5_20220101', 'sentinel2_b6_20220101', 'sentinel2_b7_20220101', 'sentinel2_b8_20220101', 'sentinel2_b8a_20220101', 'sentinel2_b11_20220101', 'sentinel2_b12_20220101', 'sentinel2_b2_20220111', 'sentinel2_b3_20220111', 'sentinel2_b4_20220111', 'sentinel2_b5_20220111', 'sentinel2_b6_20220111', 'sentinel2_b7_20220111', 'sentinel2_b8_20220111', 'sentinel2_b8a_20220111', 'sentinel2_b11_20220111', 'sentinel2_b12_20220111', 'sentinel2_b2_20220121', 'sentinel2_b3_20220121', 'sentinel2_b4_20220121', 'sentinel2_b5_20220121', 'sentinel2_b6_20220121', 'sentinel2_b7_20220121', 'sentinel2_b8_20220121', 'sentinel2_b8a_20220121', 'sentinel2_b11_20220121', 'sentinel2_b12_20220121', 'sentinel2_b2_20220131', 'sentinel2_b3_20220131', 'sentinel2_b4_20220131', 'sentinel2_b5_20220131', 'sentinel2_b6_20220131', 'sentinel2_b7_20220131', 'sentinel2_b8_20220131', 'sentinel2_b8a_20220131', 'sentinel2_b11_20220131', 'sentinel2_b12_20220131', 'sentinel2_b2_20220210', 'sentinel2_b3_20220210', 'sentinel2_b4_20220210', 'sentinel2_b5_20220210', 'sentinel2_b6_20220210', 'sentinel2_b7_20220210', 'sentinel2_b8_20220210', 'sentinel2_b8a_20220210', 'sentinel2_b11_20220210', 'sentinel2_b12_20220210', 'sentinel2_b2_20220220', 'sentinel2_b3_20220220', 'sentinel2_b4_20220220', 'sentinel2_b5_20220220', 'sentinel2_b6_20220220', 'sentinel2_b7_20220220', 'sentinel2_b8_20220220', 'sentinel2_b8a_20220220', 'sentinel2_b11_20220220', 'sentinel2_b12_20220220', 'sentinel2_b2_20220302', 'sentinel2_b3_20220302', 'sentinel2_b4_20220302', 'sentinel2_b5_20220302', 'sentinel2_b6_20220302', 'sentinel2_b7_20220302', 'sentinel2_b8_20220302', 'sentinel2_b8a_20220302', 'sentinel2_b11_20220302', 'sentinel2_b12_20220302', 'sentinel2_b2_20220312', 'sentinel2_b3_20220312', 'sentinel2_b4_20220312', 'sentinel2_b5_20220312', 'sentinel2_b6_20220312', 'sentinel2_b7_20220312', 'sentinel2_b8_20220312', 'sentinel2_b8a_20220312', 'sentinel2_b11_20220312', 'sentinel2_b12_20220312', 'sentinel2_b2_20220322', 'sentinel2_b3_20220322', 'sentinel2_b4_20220322', 'sentinel2_b5_20220322', 'sentinel2_b6_20220322', 'sentinel2_b7_20220322', 'sentinel2_b8_20220322', 'sentinel2_b8a_20220322', 'sentinel2_b11_20220322', 'sentinel2_b12_20220322', 'sentinel2_b2_20220401', 'sentinel2_b3_20220401', 'sentinel2_b4_20220401', 'sentinel2_b5_20220401', 'sentinel2_b6_20220401', 'sentinel2_b7_20220401', 'sentinel2_b8_20220401', 'sentinel2_b8a_20220401', 'sentinel2_b11_20220401', 'sentinel2_b12_20220401', 'sentinel2_b2_20220411', 'sentinel2_b3_20220411', 'sentinel2_b4_20220411', 'sentinel2_b5_20220411', 'sentinel2_b6_20220411', 'sentinel2_b7_20220411', 'sentinel2_b8_20220411', 'sentinel2_b8a_20220411', 'sentinel2_b11_20220411', 'sentinel2_b12_20220411', 'sentinel2_b2_20220421', 'sentinel2_b3_20220421', 'sentinel2_b4_20220421', 'sentinel2_b5_20220421', 'sentinel2_b6_20220421', 'sentinel2_b7_20220421', 'sentinel2_b8_20220421', 'sentinel2_b8a_20220421', 'sentinel2_b11_20220421', 'sentinel2_b12_20220421', 'sentinel2_b2_20220501', 'sentinel2_b3_20220501', 'sentinel2_b4_20220501', 'sentinel2_b5_20220501', 'sentinel2_b6_20220501', 'sentinel2_b7_20220501', 'sentinel2_b8_20220501', 'sentinel2_b8a_20220501', 'sentinel2_b11_20220501', 'sentinel2_b12_20220501', 'sentinel2_b2_20220511', 'sentinel2_b3_20220511', 'sentinel2_b4_20220511', 'sentinel2_b5_20220511', 'sentinel2_b6_20220511', 'sentinel2_b7_20220511', 'sentinel2_b8_20220511', 'sentinel2_b8a_20220511', 'sentinel2_b11_20220511', 'sentinel2_b12_20220511', 'sentinel2_b2_20220521', 'sentinel2_b3_20220521', 'sentinel2_b4_20220521', 'sentinel2_b5_20220521', 'sentinel2_b6_20220521', 'sentinel2_b7_20220521', 'sentinel2_b8_20220521', 'sentinel2_b8a_20220521', 'sentinel2_b11_20220521', 'sentinel2_b12_20220521', 'sentinel2_b2_20220531', 'sentinel2_b3_20220531', 'sentinel2_b4_20220531', 'sentinel2_b5_20220531', 'sentinel2_b6_20220531', 'sentinel2_b7_20220531', 'sentinel2_b8_20220531', 'sentinel2_b8a_20220531', 'sentinel2_b11_20220531', 'sentinel2_b12_20220531', 'sentinel2_b2_20220610', 'sentinel2_b3_20220610', 'sentinel2_b4_20220610', 'sentinel2_b5_20220610', 'sentinel2_b6_20220610', 'sentinel2_b7_20220610', 'sentinel2_b8_20220610', 'sentinel2_b8a_20220610', 'sentinel2_b11_20220610', 'sentinel2_b12_20220610', 'sentinel2_b2_20220620', 'sentinel2_b3_20220620', 'sentinel2_b4_20220620', 'sentinel2_b5_20220620', 'sentinel2_b6_20220620', 'sentinel2_b7_20220620', 'sentinel2_b8_20220620', 'sentinel2_b8a_20220620', 'sentinel2_b11_20220620', 'sentinel2_b12_20220620', 'sentinel2_b2_20220630', 'sentinel2_b3_20220630', 'sentinel2_b4_20220630', 'sentinel2_b5_20220630', 'sentinel2_b6_20220630', 'sentinel2_b7_20220630', 'sentinel2_b8_20220630', 'sentinel2_b8a_20220630', 'sentinel2_b11_20220630', 'sentinel2_b12_20220630', 'sentinel2_b2_20220710', 'sentinel2_b3_20220710', 'sentinel2_b4_20220710', 'sentinel2_b5_20220710', 'sentinel2_b6_20220710', 'sentinel2_b7_20220710', 'sentinel2_b8_20220710', 'sentinel2_b8a_20220710', 'sentinel2_b11_20220710', 'sentinel2_b12_20220710', 'sentinel2_b2_20220720', 'sentinel2_b3_20220720', 'sentinel2_b4_20220720', 'sentinel2_b5_20220720', 'sentinel2_b6_20220720', 'sentinel2_b7_20220720', 'sentinel2_b8_20220720', 'sentinel2_b8a_20220720', 'sentinel2_b11_20220720', 'sentinel2_b12_20220720', 'sentinel2_b2_20220730', 'sentinel2_b3_20220730', 'sentinel2_b4_20220730', 'sentinel2_b5_20220730', 'sentinel2_b6_20220730', 'sentinel2_b7_20220730', 'sentinel2_b8_20220730', 'sentinel2_b8a_20220730', 'sentinel2_b11_20220730', 'sentinel2_b12_20220730', 'sentinel2_b2_20220809', 'sentinel2_b3_20220809', 'sentinel2_b4_20220809', 'sentinel2_b5_20220809', 'sentinel2_b6_20220809', 'sentinel2_b7_20220809', 'sentinel2_b8_20220809', 'sentinel2_b8a_20220809', 'sentinel2_b11_20220809', 'sentinel2_b12_20220809', 'sentinel2_b2_20220819', 'sentinel2_b3_20220819', 'sentinel2_b4_20220819', 'sentinel2_b5_20220819', 'sentinel2_b6_20220819', 'sentinel2_b7_20220819', 'sentinel2_b8_20220819', 'sentinel2_b8a_20220819', 'sentinel2_b11_20220819', 'sentinel2_b12_20220819', 'sentinel2_b2_20220829', 'sentinel2_b3_20220829', 'sentinel2_b4_20220829', 'sentinel2_b5_20220829', 'sentinel2_b6_20220829', 'sentinel2_b7_20220829', 'sentinel2_b8_20220829', 'sentinel2_b8a_20220829', 'sentinel2_b11_20220829', 'sentinel2_b12_20220829', 'sentinel2_b2_20220908', 'sentinel2_b3_20220908', 'sentinel2_b4_20220908', 'sentinel2_b5_20220908', 'sentinel2_b6_20220908', 'sentinel2_b7_20220908', 'sentinel2_b8_20220908', 'sentinel2_b8a_20220908', 'sentinel2_b11_20220908', 'sentinel2_b12_20220908', 'sentinel2_b2_20220918', 'sentinel2_b3_20220918', 'sentinel2_b4_20220918', 'sentinel2_b5_20220918', 'sentinel2_b6_20220918', 'sentinel2_b7_20220918', 'sentinel2_b8_20220918', 'sentinel2_b8a_20220918', 'sentinel2_b11_20220918', 'sentinel2_b12_20220918', 'sentinel2_b2_20220928', 'sentinel2_b3_20220928', 'sentinel2_b4_20220928', 'sentinel2_b5_20220928', 'sentinel2_b6_20220928', 'sentinel2_b7_20220928', 'sentinel2_b8_20220928', 'sentinel2_b8a_20220928', 'sentinel2_b11_20220928', 'sentinel2_b12_20220928', 'sentinel2_b2_20221008', 'sentinel2_b3_20221008', 'sentinel2_b4_20221008', 'sentinel2_b5_20221008', 'sentinel2_b6_20221008', 'sentinel2_b7_20221008', 'sentinel2_b8_20221008', 'sentinel2_b8a_20221008', 'sentinel2_b11_20221008', 'sentinel2_b12_20221008', 'sentinel2_b2_20221018', 'sentinel2_b3_20221018', 'sentinel2_b4_20221018', 'sentinel2_b5_20221018', 'sentinel2_b6_20221018', 'sentinel2_b7_20221018', 'sentinel2_b8_20221018', 'sentinel2_b8a_20221018', 'sentinel2_b11_20221018', 'sentinel2_b12_20221018', 'sentinel2_b2_20221028', 'sentinel2_b3_20221028', 'sentinel2_b4_20221028', 'sentinel2_b5_20221028', 'sentinel2_b6_20221028', 'sentinel2_b7_20221028', 'sentinel2_b8_20221028', 'sentinel2_b8a_20221028', 'sentinel2_b11_20221028', 'sentinel2_b12_20221028', 'sentinel2_b2_20221107', 'sentinel2_b3_20221107', 'sentinel2_b4_20221107', 'sentinel2_b5_20221107', 'sentinel2_b6_20221107', 'sentinel2_b7_20221107', 'sentinel2_b8_20221107', 'sentinel2_b8a_20221107', 'sentinel2_b11_20221107', 'sentinel2_b12_20221107', 'sentinel2_b2_20221117', 'sentinel2_b3_20221117', 'sentinel2_b4_20221117', 'sentinel2_b5_20221117', 'sentinel2_b6_20221117', 'sentinel2_b7_20221117', 'sentinel2_b8_20221117', 'sentinel2_b8a_20221117', 'sentinel2_b11_20221117', 'sentinel2_b12_20221117', 'sentinel2_b2_20221127', 'sentinel2_b3_20221127', 'sentinel2_b4_20221127', 'sentinel2_b5_20221127', 'sentinel2_b6_20221127', 'sentinel2_b7_20221127', 'sentinel2_b8_20221127', 'sentinel2_b8a_20221127', 'sentinel2_b11_20221127', 'sentinel2_b12_20221127', 'sentinel2_b2_20221207', 'sentinel2_b3_20221207', 'sentinel2_b4_20221207', 'sentinel2_b5_20221207', 'sentinel2_b6_20221207', 'sentinel2_b7_20221207', 'sentinel2_b8_20221207', 'sentinel2_b8a_20221207', 'sentinel2_b11_20221207', 'sentinel2_b12_20221207', 'sentinel2_b2_20221217', 'sentinel2_b3_20221217', 'sentinel2_b4_20221217', 'sentinel2_b5_20221217', 'sentinel2_b6_20221217', 'sentinel2_b7_20221217', 'sentinel2_b8_20221217', 'sentinel2_b8a_20221217', 'sentinel2_b11_20221217', 'sentinel2_b12_20221217', 'sentinel2_b2_20221227', 'sentinel2_b3_20221227', 'sentinel2_b4_20221227', 'sentinel2_b5_20221227', 'sentinel2_b6_20221227', 'sentinel2_b7_20221227', 'sentinel2_b8_20221227', 'sentinel2_b8a_20221227', 'sentinel2_b11_20221227', 'sentinel2_b12_20221227', 'sentinel2_b2_20230101', 'sentinel2_b3_20230101', 'sentinel2_b4_20230101', 'sentinel2_b5_20230101', 'sentinel2_b6_20230101', 'sentinel2_b7_20230101', 'sentinel2_b8_20230101', 'sentinel2_b8a_20230101', 'sentinel2_b11_20230101', 'sentinel2_b12_20230101', 'sentinel2_b2_20230111', 'sentinel2_b3_20230111', 'sentinel2_b4_20230111', 'sentinel2_b5_20230111', 'sentinel2_b6_20230111', 'sentinel2_b7_20230111', 'sentinel2_b8_20230111', 'sentinel2_b8a_20230111', 'sentinel2_b11_20230111', 'sentinel2_b12_20230111', 'sentinel2_b2_20230121', 'sentinel2_b3_20230121', 'sentinel2_b4_20230121', 'sentinel2_b5_20230121', 'sentinel2_b6_20230121', 'sentinel2_b7_20230121', 'sentinel2_b8_20230121', 'sentinel2_b8a_20230121', 'sentinel2_b11_20230121', 'sentinel2_b12_20230121', 'sentinel2_b2_20230131', 'sentinel2_b3_20230131', 'sentinel2_b4_20230131', 'sentinel2_b5_20230131', 'sentinel2_b6_20230131', 'sentinel2_b7_20230131', 'sentinel2_b8_20230131', 'sentinel2_b8a_20230131', 'sentinel2_b11_20230131', 'sentinel2_b12_20230131', 'sentinel2_b2_20230210', 'sentinel2_b3_20230210', 'sentinel2_b4_20230210', 'sentinel2_b5_20230210', 'sentinel2_b6_20230210', 'sentinel2_b7_20230210', 'sentinel2_b8_20230210', 'sentinel2_b8a_20230210', 'sentinel2_b11_20230210', 'sentinel2_b12_20230210', 'sentinel2_b2_20230220', 'sentinel2_b3_20230220', 'sentinel2_b4_20230220', 'sentinel2_b5_20230220', 'sentinel2_b6_20230220', 'sentinel2_b7_20230220', 'sentinel2_b8_20230220', 'sentinel2_b8a_20230220', 'sentinel2_b11_20230220', 'sentinel2_b12_20230220', 'sentinel2_b2_20230302', 'sentinel2_b3_20230302', 'sentinel2_b4_20230302', 'sentinel2_b5_20230302', 'sentinel2_b6_20230302', 'sentinel2_b7_20230302', 'sentinel2_b8_20230302', 'sentinel2_b8a_20230302', 'sentinel2_b11_20230302', 'sentinel2_b12_20230302', 'sentinel2_b2_20230312', 'sentinel2_b3_20230312', 'sentinel2_b4_20230312', 'sentinel2_b5_20230312', 'sentinel2_b6_20230312', 'sentinel2_b7_20230312', 'sentinel2_b8_20230312', 'sentinel2_b8a_20230312', 'sentinel2_b11_20230312', 'sentinel2_b12_20230312', 'sentinel2_b2_20230322', 'sentinel2_b3_20230322', 'sentinel2_b4_20230322', 'sentinel2_b5_20230322', 'sentinel2_b6_20230322', 'sentinel2_b7_20230322', 'sentinel2_b8_20230322', 'sentinel2_b8a_20230322', 'sentinel2_b11_20230322', 'sentinel2_b12_20230322', 'sentinel2_b2_20230401', 'sentinel2_b3_20230401', 'sentinel2_b4_20230401', 'sentinel2_b5_20230401', 'sentinel2_b6_20230401', 'sentinel2_b7_20230401', 'sentinel2_b8_20230401', 'sentinel2_b8a_20230401', 'sentinel2_b11_20230401', 'sentinel2_b12_20230401', 'sentinel2_b2_20230411', 'sentinel2_b3_20230411', 'sentinel2_b4_20230411', 'sentinel2_b5_20230411', 'sentinel2_b6_20230411', 'sentinel2_b7_20230411', 'sentinel2_b8_20230411', 'sentinel2_b8a_20230411', 'sentinel2_b11_20230411', 'sentinel2_b12_20230411', 'sentinel2_b2_20230421', 'sentinel2_b3_20230421', 'sentinel2_b4_20230421', 'sentinel2_b5_20230421', 'sentinel2_b6_20230421', 'sentinel2_b7_20230421', 'sentinel2_b8_20230421', 'sentinel2_b8a_20230421', 'sentinel2_b11_20230421', 'sentinel2_b12_20230421', 'sentinel2_b2_20230501', 'sentinel2_b3_20230501', 'sentinel2_b4_20230501', 'sentinel2_b5_20230501', 'sentinel2_b6_20230501', 'sentinel2_b7_20230501', 'sentinel2_b8_20230501', 'sentinel2_b8a_20230501', 'sentinel2_b11_20230501', 'sentinel2_b12_20230501', 'sentinel2_b2_20230511', 'sentinel2_b3_20230511', 'sentinel2_b4_20230511', 'sentinel2_b5_20230511', 'sentinel2_b6_20230511', 'sentinel2_b7_20230511', 'sentinel2_b8_20230511', 'sentinel2_b8a_20230511', 'sentinel2_b11_20230511', 'sentinel2_b12_20230511', 'sentinel2_b2_20230521', 'sentinel2_b3_20230521', 'sentinel2_b4_20230521', 'sentinel2_b5_20230521', 'sentinel2_b6_20230521', 'sentinel2_b7_20230521', 'sentinel2_b8_20230521', 'sentinel2_b8a_20230521', 'sentinel2_b11_20230521', 'sentinel2_b12_20230521', 'sentinel2_b2_20230531', 'sentinel2_b3_20230531', 'sentinel2_b4_20230531', 'sentinel2_b5_20230531', 'sentinel2_b6_20230531', 'sentinel2_b7_20230531', 'sentinel2_b8_20230531', 'sentinel2_b8a_20230531', 'sentinel2_b11_20230531', 'sentinel2_b12_20230531', 'sentinel2_b2_20230610', 'sentinel2_b3_20230610', 'sentinel2_b4_20230610', 'sentinel2_b5_20230610', 'sentinel2_b6_20230610', 'sentinel2_b7_20230610', 'sentinel2_b8_20230610', 'sentinel2_b8a_20230610', 'sentinel2_b11_20230610', 'sentinel2_b12_20230610', 'sentinel2_b2_20230620', 'sentinel2_b3_20230620', 'sentinel2_b4_20230620', 'sentinel2_b5_20230620', 'sentinel2_b6_20230620', 'sentinel2_b7_20230620', 'sentinel2_b8_20230620', 'sentinel2_b8a_20230620', 'sentinel2_b11_20230620', 'sentinel2_b12_20230620', 'sentinel2_b2_20230630', 'sentinel2_b3_20230630', 'sentinel2_b4_20230630', 'sentinel2_b5_20230630', 'sentinel2_b6_20230630', 'sentinel2_b7_20230630', 'sentinel2_b8_20230630', 'sentinel2_b8a_20230630', 'sentinel2_b11_20230630', 'sentinel2_b12_20230630', 'sentinel2_b2_20230710', 'sentinel2_b3_20230710', 'sentinel2_b4_20230710', 'sentinel2_b5_20230710', 'sentinel2_b6_20230710', 'sentinel2_b7_20230710', 'sentinel2_b8_20230710', 'sentinel2_b8a_20230710', 'sentinel2_b11_20230710', 'sentinel2_b12_20230710', 'sentinel2_b2_20230720', 'sentinel2_b3_20230720', 'sentinel2_b4_20230720', 'sentinel2_b5_20230720', 'sentinel2_b6_20230720', 'sentinel2_b7_20230720', 'sentinel2_b8_20230720', 'sentinel2_b8a_20230720', 'sentinel2_b11_20230720', 'sentinel2_b12_20230720', 'sentinel2_b2_20230730', 'sentinel2_b3_20230730', 'sentinel2_b4_20230730', 'sentinel2_b5_20230730', 'sentinel2_b6_20230730', 'sentinel2_b7_20230730', 'sentinel2_b8_20230730', 'sentinel2_b8a_20230730', 'sentinel2_b11_20230730', 'sentinel2_b12_20230730', 'sentinel2_b2_20230809', 'sentinel2_b3_20230809', 'sentinel2_b4_20230809', 'sentinel2_b5_20230809', 'sentinel2_b6_20230809', 'sentinel2_b7_20230809', 'sentinel2_b8_20230809', 'sentinel2_b8a_20230809', 'sentinel2_b11_20230809', 'sentinel2_b12_20230809', 'sentinel2_b2_20230819', 'sentinel2_b3_20230819', 'sentinel2_b4_20230819', 'sentinel2_b5_20230819', 'sentinel2_b6_20230819', 'sentinel2_b7_20230819', 'sentinel2_b8_20230819', 'sentinel2_b8a_20230819', 'sentinel2_b11_20230819', 'sentinel2_b12_20230819', 'sentinel2_b2_20230829', 'sentinel2_b3_20230829', 'sentinel2_b4_20230829', 'sentinel2_b5_20230829', 'sentinel2_b6_20230829', 'sentinel2_b7_20230829', 'sentinel2_b8_20230829', 'sentinel2_b8a_20230829', 'sentinel2_b11_20230829', 'sentinel2_b12_20230829', 'sentinel2_b2_20230908', 'sentinel2_b3_20230908', 'sentinel2_b4_20230908', 'sentinel2_b5_20230908', 'sentinel2_b6_20230908', 'sentinel2_b7_20230908', 'sentinel2_b8_20230908', 'sentinel2_b8a_20230908', 'sentinel2_b11_20230908', 'sentinel2_b12_20230908', 'sentinel2_b2_20230918', 'sentinel2_b3_20230918', 'sentinel2_b4_20230918', 'sentinel2_b5_20230918', 'sentinel2_b6_20230918', 'sentinel2_b7_20230918', 'sentinel2_b8_20230918', 'sentinel2_b8a_20230918', 'sentinel2_b11_20230918', 'sentinel2_b12_20230918', 'sentinel2_b2_20230928', 'sentinel2_b3_20230928', 'sentinel2_b4_20230928', 'sentinel2_b5_20230928', 'sentinel2_b6_20230928', 'sentinel2_b7_20230928', 'sentinel2_b8_20230928', 'sentinel2_b8a_20230928', 'sentinel2_b11_20230928', 'sentinel2_b12_20230928', 'sentinel2_b2_20231008', 'sentinel2_b3_20231008', 'sentinel2_b4_20231008', 'sentinel2_b5_20231008', 'sentinel2_b6_20231008', 'sentinel2_b7_20231008', 'sentinel2_b8_20231008', 'sentinel2_b8a_20231008', 'sentinel2_b11_20231008', 'sentinel2_b12_20231008', 'sentinel2_b2_20231018', 'sentinel2_b3_20231018', 'sentinel2_b4_20231018', 'sentinel2_b5_20231018', 'sentinel2_b6_20231018', 'sentinel2_b7_20231018', 'sentinel2_b8_20231018', 'sentinel2_b8a_20231018', 'sentinel2_b11_20231018', 'sentinel2_b12_20231018', 'sentinel2_b2_20231028', 'sentinel2_b3_20231028', 'sentinel2_b4_20231028', 'sentinel2_b5_20231028', 'sentinel2_b6_20231028', 'sentinel2_b7_20231028', 'sentinel2_b8_20231028', 'sentinel2_b8a_20231028', 'sentinel2_b11_20231028', 'sentinel2_b12_20231028', 'sentinel2_b2_20231107', 'sentinel2_b3_20231107', 'sentinel2_b4_20231107', 'sentinel2_b5_20231107', 'sentinel2_b6_20231107', 'sentinel2_b7_20231107', 'sentinel2_b8_20231107', 'sentinel2_b8a_20231107', 'sentinel2_b11_20231107', 'sentinel2_b12_20231107', 'sentinel2_b2_20231117', 'sentinel2_b3_20231117', 'sentinel2_b4_20231117', 'sentinel2_b5_20231117', 'sentinel2_b6_20231117', 'sentinel2_b7_20231117', 'sentinel2_b8_20231117', 'sentinel2_b8a_20231117', 'sentinel2_b11_20231117', 'sentinel2_b12_20231117', 'sentinel2_b2_20231127', 'sentinel2_b3_20231127', 'sentinel2_b4_20231127', 'sentinel2_b5_20231127', 'sentinel2_b6_20231127', 'sentinel2_b7_20231127', 'sentinel2_b8_20231127', 'sentinel2_b8a_20231127', 'sentinel2_b11_20231127', 'sentinel2_b12_20231127', 'sentinel2_b2_20231207', 'sentinel2_b3_20231207', 'sentinel2_b4_20231207', 'sentinel2_b5_20231207', 'sentinel2_b6_20231207', 'sentinel2_b7_20231207', 'sentinel2_b8_20231207', 'sentinel2_b8a_20231207', 'sentinel2_b11_20231207', 'sentinel2_b12_20231207', 'sentinel2_b2_20231217', 'sentinel2_b3_20231217', 'sentinel2_b4_20231217', 'sentinel2_b5_20231217', 'sentinel2_b6_20231217', 'sentinel2_b7_20231217', 'sentinel2_b8_20231217', 'sentinel2_b8a_20231217', 'sentinel2_b11_20231217', 'sentinel2_b12_20231217', 'sentinel2_b2_20231227', 'sentinel2_b3_20231227', 'sentinel2_b4_20231227', 'sentinel2_b5_20231227', 'sentinel2_b6_20231227', 'sentinel2_b7_20231227', 'sentinel2_b8_20231227', 'sentinel2_b8a_20231227', 'sentinel2_b11_20231227', 'sentinel2_b12_20231227', 'geometry']
['id', 'date', 'ref', 'x', 'y', 'MASSIF', 'DEPERIS_pe', 'DEPERIS_sc', 'dist_max', 'month', 'id_unique', 'DEPERIS_cl', 'dep_cor', 'layer', 'path', 'geometry']
(4311, 2977)
[2024-06-06 14:34:33.512030039+00:00] reconfort/beaudol/14583609:  Account (env) = reconfort
[2024-06-06 14:34:33.513407220+00:00] reconfort/beaudol/14583609:     User (env) = beaudol
[2024-06-06 14:34:33.514686101+00:00] reconfort/beaudol/14583609:        GroupId = reconfort(9573)
[2024-06-06 14:34:33.515964653+00:00] reconfort/beaudol/14583609:         UserId = beaudol(125549)
[2024-06-06 14:34:33.517124776+00:00] reconfort/beaudol/14583609:        Account = reconfort
[2024-06-06 14:34:33.518273048+00:00] reconfort/beaudol/14583609:        Account = reconfort
[2024-06-06 14:34:33.519470911+00:00] reconfort/beaudol/14583609:      Partition = cpu2022
[2024-06-06 14:34:33.520663213+00:00] reconfort/beaudol/14583609:            QOS = cpu_2022_1280
[2024-06-06 14:34:33.521833355+00:00] reconfort/beaudol/14583609:        JobName = processing_reconfort
[2024-06-06 14:34:33.522951658+00:00] reconfort/beaudol/14583609:     SubmitTime = 2024-06-06T14:32:43
[2024-06-06 14:34:33.524111691+00:00] reconfort/beaudol/14583609:        RunTime = 00:01:48
[2024-06-06 14:34:33.525252143+00:00] reconfort/beaudol/14583609:      TimeLimit = 02:59:00
[2024-06-06 14:34:33.526380306+00:00] reconfort/beaudol/14583609:   EligibleTime = 2024-06-06T14:32:43
[2024-06-06 14:34:33.527543409+00:00] reconfort/beaudol/14583609:      StartTime = 2024-06-06T14:32:43
[2024-06-06 14:34:33.528712071+00:00] reconfort/beaudol/14583609:        EndTime = 2024-06-06T14:34:31
[2024-06-06 14:34:33.529939983+00:00] reconfort/beaudol/14583609:       ExitCode = 0:15
[2024-06-06 14:34:33.531277345+00:00] reconfort/beaudol/14583609:       NodeList = trex035
[2024-06-06 14:34:33.532705955+00:00] reconfort/beaudol/14583609:      BatchHost = trex035
[2024-06-06 14:34:33.533849518+00:00] reconfort/beaudol/14583609:           TRES = 
[2024-06-06 14:34:33.534966771+00:00] reconfort/beaudol/14583609:        Command = /work/RECONFORT/Louise/learning/run_slurm_merge_and_interpolate_dataset.slurm
[2024-06-06 14:34:33.536078704+00:00] reconfort/beaudol/14583609:        WorkDir = /home/ad/beaudol
[2024-06-06 14:34:33.537155587+00:00] reconfort/beaudol/14583609:         StdErr = /work/RECONFORT/reconfort_package/reconfort_learning/logs/preprocessing_T31UDP.err
[2024-06-06 14:34:33.538201580+00:00] reconfort/beaudol/14583609:         StdOut = /work/RECONFORT/reconfort_package/reconfort_learning/logs/preprocessing_T31UDP.out

#########################################
#        EVIDEN - CNES                  #
#        Job Accounting                 #
#########################################
Cluster              : trex
JobIDRaw             : 14583609
JobID                : 14583609
JobName              : processing_reconfort
Account              : reconfort
User                 : beaudol(125549), reconfort(9573)
Partition            : cpu2022
QOS                  : cpu_2022_1280
Nodelist             : trex035 (1)
State                : CANCELLED  (Exitcode=0:0, DerivedExitCode=0:0, Restarts=0)
Submit date          : 2024-06-06T14:32:43
Start time           : 2024-06-06T14:32:43
End time             : 2024-06-06T14:34:31
Elapsed time         : 00:01:48  (Timelimit=02:59:00, Suspended=00:00:00)
TEI                  : 0:54:00
Command              : /work/RECONFORT/Louise/learning/run_slurm_merge_and_interpolate_dataset.slurm
StdOut               : /work/RECONFORT/reconfort_package/reconfort_learning/logs/preprocessing_T31UDP.out
StdErr               : /work/RECONFORT/reconfort_package/reconfort_learning/logs/preprocessing_T31UDP.err

STEP(s) : 2
--------- 
   StepID  | JobName      State       Exit   Start               End                 Elapsed   TotalCPU   CPUTime    ConsumedEnergy MaxDiskRead MaxDiskWrite     MaxRSS MaxRSSTask MaxRSSNode NNodes UserCPU    NodeList
   ---------------------------------------------------------------------------------------------------------------------------------------------------------------------------------------------------------------------------- 
   batch   | batch        CANCELLED   0:15   2024-06-06T14:32:43 2024-06-06T14:34:32 00:01:49  00:18.848  00:54:30      2.75390625K    1432.20M        0.09M    933396K          0    trex035      1 00:14.823  trex035
   extern  | extern       COMPLETED   0:0    2024-06-06T14:32:43 2024-06-06T14:34:31 00:01:48  00:00:00   00:54:00      2.75390625K       0.00M        0.00M      1708K          0    trex035      1 00:00:00   trex035

