<svg xmlns="http://www.w3.org/2000/svg" xmlns:xlink="http://www.w3.org/1999/xlink" width="0" height="0" style="display:none;" class="icons-definition">
  <!-- UI -->
  <symbol id="icon-caret-down" viewBox="0 0 256 256">
    <path d="M128,184a8.5,8.5,0,0,1-5.7-2.3l-80-80A8.1,8.1,0,0,1,53.7,90.3L128,164.7l74.3-74.4a8.1,8.1,0,0,1,11.4,11.4l-80,80A8.5,8.5,0,0,1,128,184Z"/>
  </symbol>
  <symbol id="icon-caret-left" viewBox="0 0 256 256">
    <path d="M160,216a8.5,8.5,0,0,1-5.7-2.3l-80-80a8.1,8.1,0,0,1,0-11.4l80-80a8.1,8.1,0,0,1,11.4,11.4L91.3,128l74.4,74.3a8.1,8.1,0,0,1,0,11.4A8.5,8.5,0,0,1,160,216Z"/>
  </symbol>
  <symbol id="icon-caret-right" viewBox="0 0 256 256">
    <path d="M96,216a8.5,8.5,0,0,1-5.7-2.3,8.1,8.1,0,0,1,0-11.4L164.7,128,90.3,53.7a8.1,8.1,0,0,1,11.4-11.4l80,80a8.1,8.1,0,0,1,0,11.4l-80,80A8.5,8.5,0,0,1,96,216Z"/>
  </symbol>
  <symbol id="icon-hourglass" viewBox="0 0 256 256">
    <path d="M200,75.6V40a16,16,0,0,0-16-16H72A16,16,0,0,0,56,40V76a16.1,16.1,0,0,0,6.4,12.8L114.7,128,62.4,167.2A16.1,16.1,0,0,0,56,180v36a16,16,0,0,0,16,16H184a16,16,0,0,0,16-16V180.4a16.1,16.1,0,0,0-6.4-12.8L141.3,128l52.3-39.6A16.1,16.1,0,0,0,200,75.6ZM184,216H72V180l56-42,56,42.4Zm0-140.4L128,118,72,76V40H184Z"/>
  </symbol>
  <symbol id="icon-floppy-disk" viewBox="0 0 256 256">
    <path d="M219.3,80,176,36.7A15.9,15.9,0,0,0,164.7,32H48A16,16,0,0,0,32,48V208a16,16,0,0,0,16,16H208a16,16,0,0,0,16-16V91.3A15.9,15.9,0,0,0,219.3,80ZM168,208H88V152h80ZM208,91.3V208H184V152a16,16,0,0,0-16-16H88a16,16,0,0,0-16,16v56H48V48H164.7L208,91.3ZM160,72a8,8,0,0,1-8,8H96a8,8,0,0,1,0-16h56A8,8,0,0,1,160,72Z"/>
  </symbol>
  <symbol id="icon-help" viewBox="0 0 256 256">
    <path d="M128,24A104,104,0,1,0,232,128,104.1,104.1,0,0,0,128,24Zm0,192a88,88,0,1,1,88-88A88.1,88.1,0,0,1,128,216Zm12-36a12,12,0,1,1-12-12A12,12,0,0,1,140,180Zm24-72a36,36,0,0,1-28,35.1v.9a8,8,0,0,1-16,0v-8a8,8,0,0,1,8-8,20,20,0,1,0-20-20,8,8,0,0,1-16,0,36,36,0,0,1,72,0Z"/>
  </symbol>
  <symbol id="icon-magnifying-glass" viewBox="0 0 256 256">
    <path d="M229.7,218.3l-43.3-43.2a92.2,92.2,0,1,0-11.3,11.3l43.2,43.3a8.2,8.2,0,0,0,11.4,0A8.1,8.1,0,0,0,229.7,218.3ZM40,116a76,76,0,1,1,76,76A76.1,76.1,0,0,1,40,116Z"/>
  </symbol>
  <symbol id="icon-more-dots" viewBox="0 0 256 256">
    <path d="M128,96a32,32,0,1,0,32,32A32.1,32.1,0,0,0,128,96Zm0,48a16,16,0,1,1,16-16A16,16,0,0,1,128,144Zm0-64A32,32,0,1,0,96,48,32.1,32.1,0,0,0,128,80Zm0-48a16,16,0,1,1-16,16A16,16,0,0,1,128,32Zm0,144a32,32,0,1,0,32,32A32.1,32.1,0,0,0,128,176Zm0,48a16,16,0,1,1,16-16A16,16,0,0,1,128,224Z"/>
  </symbol>
  <symbol id="icon-skip-back" viewBox="0 0 256 256">
    <path d="M199.8,40.3a16,16,0,0,0-16.1.3L64,113.7V40a8,8,0,0,0-16,0V216a8,8,0,0,0,16,0V142.3l119.7,73.1a16.2,16.2,0,0,0,8.3,2.3,15.4,15.4,0,0,0,7.8-2,15.9,15.9,0,0,0,8.2-14V54.3A15.9,15.9,0,0,0,199.8,40.3ZM192,201.7,71.3,128h0L192,54.3Z"/>
  </symbol>
  <symbol id="icon-skip-forward" viewBox="0 0 256 256">
    <path d="M200,32a8,8,0,0,0-8,8v73.7L72.3,40.6A16,16,0,0,0,48,54.3V201.7a15.9,15.9,0,0,0,8.2,14,15.4,15.4,0,0,0,7.8,2,16.2,16.2,0,0,0,8.3-2.3L192,142.3V216a8,8,0,0,0,16,0V40A8,8,0,0,0,200,32ZM64,201.7V54.3L184.7,128Z"/>
  </symbol>
  <symbol id="icon-x-bold" viewBox="0 0 256 256">
    <path d="M208.5,191.5a12,12,0,0,1,0,17,12.1,12.1,0,0,1-17,0L128,145,64.5,208.5a12.1,12.1,0,0,1-17,0,12,12,0,0,1,0-17L111,128,47.5,64.5a12,12,0,0,1,17-17L128,111l63.5-63.5a12,12,0,0,1,17,17L145,128Z"/>
  </symbol>
  <symbol id="icon-x-square" viewBox="0 0 256 256">
    <path d="M165.7,154.3a8.1,8.1,0,0,1,0,11.4,8.2,8.2,0,0,1-11.4,0L128,139.3l-26.3,26.4a8.2,8.2,0,0,1-11.4,0,8.1,8.1,0,0,1,0-11.4L116.7,128,90.3,101.7a8.1,8.1,0,0,1,11.4-11.4L128,116.7l26.3-26.4a8.1,8.1,0,0,1,11.4,11.4L139.3,128ZM224,48V208a16,16,0,0,1-16,16H48a16,16,0,0,1-16-16V48A16,16,0,0,1,48,32H208A16,16,0,0,1,224,48ZM208,208V48H48V208Z"/>
  </symbol>
  <symbol id="icon-asterisk" viewBox="0 0 256 256">
    <path d="M211.1,176a7.7,7.7,0,0,1-6.9,4,7.3,7.3,0,0,1-4-1.1l-64.2-37V216a8,8,0,0,1-16,0V141.9l-64.2,37a7.3,7.3,0,0,1-4,1.1,7.7,7.7,0,0,1-6.9-4,8,8,0,0,1,2.9-10.9L112,128,47.8,90.9a8,8,0,0,1,8-13.8l64.2,37V40a8,8,0,0,1,16,0v74.1l64.2-37a8,8,0,1,1,8,13.8L144,128l64.2,37.1A8,8,0,0,1,211.1,176Z"/>
  </symbol>

  <!-- Documentation and examples -->
  <symbol id="icon-blank" viewBox="0 0 256 256"/>
  <symbol id="icon-checks" viewBox="0 0 256 256">
    <path d="M153.7,89.7l-88,88a8.2,8.2,0,0,1-11.4,0l-44-44a8.1,8.1,0,0,1,11.4-11.4L60,160.7l82.3-82.4a8.1,8.1,0,0,1,11.4,11.4Zm92-11.4a8.1,8.1,0,0,0-11.4,0L152,160.7,134.3,143A8,8,0,0,0,123,154.3l23.3,23.4a8.2,8.2,0,0,0,11.4,0l88-88A8.1,8.1,0,0,0,245.7,78.3Z"/>
  </symbol>
  <symbol id="icon-forum" viewBox="0 0 256 256">
    <path d="M216,48H40A16,16,0,0,0,24,64V222.8a15.7,15.7,0,0,0,9.2,14.5,16.5,16.5,0,0,0,6.8,1.6,16,16,0,0,0,10.3-3.8l31.8-26.7,1-.4H216a16,16,0,0,0,16-16V64A16,16,0,0,0,216,48Zm0,144H81.7a8.7,8.7,0,0,0-2.8.5l-3.7,1.3a10,10,0,0,0-2.4,1.4L40,222.8V64H216ZM88,112a8,8,0,0,1,8-8h64a8,8,0,0,1,0,16H96A8,8,0,0,1,88,112Zm0,32a8,8,0,0,1,8-8h64a8,8,0,0,1,0,16H96A8,8,0,0,1,88,144Z"/>
  </symbol>
  <symbol id="icon-home" viewBox="0 0 256 256">
    <path d="M208,224H160a16,16,0,0,1-16-16V160H112v48a16,16,0,0,1-16,16H48a16,16,0,0,1-16-16V115.5a16,16,0,0,1,5.2-11.8l80-72.7a16,16,0,0,1,21.6,0l80,72.7a16,16,0,0,1,5.2,11.8V208a16,16,0,0,1-16,16Zm-96-80h32a16,16,0,0,1,16,16v48h48V115.5L128,42.8,48,115.5V208H96V160A16,16,0,0,1,112,144Z"/>
  </symbol>
  <symbol id="icon-image" viewBox="0 0 256 256">
    <path d="M232,184V56a16,16,0,0,0-16-16H40A16,16,0,0,0,24,56V168h0v32a16,16,0,0,0,16,16H216a16,16,0,0,0,16-16V184ZM216,56V164.7L187.3,136a16.1,16.1,0,0,0-22.6,0L144,156.7,99.3,112a16.1,16.1,0,0,0-22.6,0L40,148.7V56Zm0,144H40V171.3l48-48L132.7,168a15.9,15.9,0,0,0,22.6,0L176,147.3l40,40V200Zm-68.5-91.5A11.9,11.9,0,0,1,144,100a12,12,0,0,1,24,0h0a12,12,0,0,1-12,12A12.3,12.3,0,0,1,147.5,108.5Z"/>
  </symbol>
  <symbol id="icon-info" viewBox="0 0 256 256">
    <path d="M128,24A104,104,0,1,0,232,128,104.1,104.1,0,0,0,128,24Zm0,192a88,88,0,1,1,88-88A88.1,88.1,0,0,1,128,216Zm16-40a8,8,0,0,1-8,8h-8a8,8,0,0,1-8-8V128a8,8,0,0,1,0-16h8a8,8,0,0,1,8,8v48A8,8,0,0,1,144,176ZM114,84a12,12,0,1,1,12,12A12,12,0,0,1,114,84Z"/>
  </symbol>
  <symbol id="icon-map-pin" viewBox="0 0 256 256">
    <path d="M128.1,64a40,40,0,1,0,40,40A40.1,40.1,0,0,0,128.1,64Zm0,64a24,24,0,1,1,24-24A24.1,24.1,0,0,1,128.1,128Zm0-112a88.1,88.1,0,0,0-88,88c0,31.4,14.5,64.7,42,96.2a259.4,259.4,0,0,0,41.4,38.4,8.3,8.3,0,0,0,9.2,0,257.6,257.6,0,0,0,41.5-38.4c27.4-31.5,41.9-64.8,41.9-96.2A88.1,88.1,0,0,0,128.1,16Zm0,206c-16.5-13-72-60.8-72-118a72,72,0,0,1,144,0C200.1,161.2,144.6,209,128.1,222Z"/>
  </symbol>
  <symbol id="icon-pencil" viewBox="0 0 256 256">
    <path d="M224,76.7,179.3,32a15.9,15.9,0,0,0-22.6,0L36.7,152A15.9,15.9,0,0,0,32,163.3V208a16,16,0,0,0,16,16H92.7a15.9,15.9,0,0,0,11.3-4.7l120-120A16.1,16.1,0,0,0,224,76.7ZM51.3,160,136,75.3,152.7,92,68,176.7ZM48,179.3,76.7,208H48Zm48,25.4L79.3,188,164,103.3,180.7,120Zm96-96L147.3,64,168,43.3,212.7,88Z"/>
  </symbol>
  <symbol id="icon-sign-out" viewBox="0 0 256 256">
    <path d="M221.7,133.7l-42,42A8.3,8.3,0,0,1,174,178a8,8,0,0,1-5.6-13.7L196.7,136H104a8,8,0,0,1,0-16h92.7L168.4,91.7a8,8,0,0,1,11.3-11.4l42,42A8.1,8.1,0,0,1,221.7,133.7ZM104,208H48V48h56a8,8,0,0,0,0-16H48A16,16,0,0,0,32,48V208a16,16,0,0,0,16,16h56a8,8,0,0,0,0-16Z"/>
  </symbol>
  <symbol id="icon-table" viewBox="0 0 256 256">
    <path d="M224,48H32a8,8,0,0,0-8,8V192a16,16,0,0,0,16,16H216a16,16,0,0,0,16-16V56A8,8,0,0,0,224,48ZM40,112H80v32H40Zm56,0H216v32H96ZM216,64V96H40V64ZM40,160H80v32H40Zm176,32H96V160H216v32Z"/>
  </symbol>
  <symbol id="icon-trash" viewBox="0 0 256 256">
    <path d="M216,48H176V40a24.1,24.1,0,0,0-24-24H104A24.1,24.1,0,0,0,80,40v8H40a8,8,0,0,0,0,16h8V208a16,16,0,0,0,16,16H192a16,16,0,0,0,16-16V64h8a8,8,0,0,0,0-16ZM96,40a8,8,0,0,1,8-8h48a8,8,0,0,1,8,8v8H96Zm96,168H64V64H192ZM112,104v64a8,8,0,0,1-16,0V104a8,8,0,0,1,16,0Zm48,0v64a8,8,0,0,1-16,0V104a8,8,0,0,1,16,0Z"/>
  </symbol>
  <symbol id="icon-user" viewBox="0 0 256 256">
    <path d="M231.9,212a120.7,120.7,0,0,0-67.1-54.2,72,72,0,1,0-73.6,0A120.7,120.7,0,0,0,24.1,212a8,8,0,1,0,13.8,8,104.1,104.1,0,0,1,180.2,0,8,8,0,1,0,13.8-8ZM72,96a56,56,0,1,1,56,56A56,56,0,0,1,72,96Z"/>
  </symbol>
  <symbol id="icon-user-minus" viewBox="0 0 256 256">
    <path d="M256,136a8,8,0,0,1-8,8H200a8,8,0,0,1,0-16h48A8,8,0,0,1,256,136Zm-56.1,58.9a7.9,7.9,0,0,1-1,11.2,7.8,7.8,0,0,1-11.2-1,104.2,104.2,0,0,0-159.4,0,8,8,0,0,1-12.2-10.2,118.4,118.4,0,0,1,55.8-37.3,68,68,0,1,1,72.2,0A118.4,118.4,0,0,1,199.9,194.9ZM108,152a52,52,0,1,0-52-52A52,52,0,0,0,108,152Z"/>
  </symbol>
  <symbol id="icon-user-plus" viewBox="0 0 256 256">
    <path d="M256,136a8,8,0,0,1-8,8H232v16a8,8,0,0,1-16,0V144H200a8,8,0,0,1,0-16h16V112a8,8,0,0,1,16,0v16h16A8,8,0,0,1,256,136Zm-56.1,58.9a7.9,7.9,0,0,1-1,11.2,7.8,7.8,0,0,1-11.2-1,104.2,104.2,0,0,0-159.4,0,8,8,0,0,1-12.2-10.2,118.4,118.4,0,0,1,55.8-37.3,68,68,0,1,1,72.2,0A118.4,118.4,0,0,1,199.9,194.9ZM108,152a52,52,0,1,0-52-52A52,52,0,0,0,108,152Z"/>
  </symbol>
  <symbol id="icon-users" viewBox="0 0 256 256">
    <path d="M121.2,157.9a60,60,0,1,0-66.4,0A95.5,95.5,0,0,0,9.5,192.8a8,8,0,1,0,13,9.2,80.1,80.1,0,0,1,131,0,8,8,0,1,0,13-9.2A95.5,95.5,0,0,0,121.2,157.9ZM44,108a44,44,0,1,1,44,44A44,44,0,0,1,44,108Zm202.1,95.9A7.9,7.9,0,0,1,235,202a80.2,80.2,0,0,0-65.5-34,8,8,0,0,1,0-16,44,44,0,0,0,0-88,47.4,47.4,0,0,0-11.9,1.6,8,8,0,0,1-9.9-5.5,8.1,8.1,0,0,1,5.5-9.9A64,64,0,0,1,169.5,48a59.9,59.9,0,0,1,33.2,109.9,96.3,96.3,0,0,1,45.4,34.9A8,8,0,0,1,246.1,203.9Z"/>
  </symbol>
  <symbol id="icon-warning" viewBox="0 0 256 256">
    <path d="M120,144V104a8,8,0,0,1,16,0v40a8,8,0,0,1-16,0Zm116.8,68A23.9,23.9,0,0,1,216,224H40a23.9,23.9,0,0,1-20.7-36L107.2,36a24,24,0,0,1,41.6,0l87.9,152A23.7,23.7,0,0,1,236.8,212Zm-13.9-16-88-152a8,8,0,0,0-13.8,0h0l-88,152a7.8,7.8,0,0,0,0,8,7.9,7.9,0,0,0,6.9,4H216a7.9,7.9,0,0,0,6.9-4A7.8,7.8,0,0,0,222.9,196ZM128,168a12,12,0,1,0,12,12A12,12,0,0,0,128,168Z"/>
  </symbol>
  <symbol id="icon-world" viewBox="0 0 256 256">
    <path d="M223.5,169.2a6.1,6.1,0,0,0,.5-1.2A103.9,103.9,0,0,0,187.8,43l-1.2-.9a104,104,0,0,0-144,145.2v.2l.8,1.1a104,104,0,0,0,147.8,21.9l1.4-1.1A105.3,105.3,0,0,0,223.5,169.2Zm-36,23.6-5.5-5.5a15.8,15.8,0,0,0-7.3-4.2l-21.4-5.6,2.4-16.2,30.4-12.7,20.6,18.8A90.6,90.6,0,0,1,187.5,192.8ZM128,40a87.5,87.5,0,0,1,46.9,13.6l1,20.2L153.7,99.4l-31.5,4.2L102.6,89.4a16.2,16.2,0,0,0-12.4-2.8,16.3,16.3,0,0,0-10.5,7.2l-19.9,31a16.3,16.3,0,0,0-2.5,8.6l-.2,36.1-5,3A87.2,87.2,0,0,1,40,128,88.1,88.1,0,0,1,128,40ZM61.5,185.6l3.9-2.4a16.2,16.2,0,0,0,7.7-13.6l.2-36.1,19.9-31.1,19.6,14.2a16.5,16.5,0,0,0,11.6,2.9l31.4-4.3a15.8,15.8,0,0,0,10-5.4L188,84.2A15.8,15.8,0,0,0,191.8,73l-.2-5.8A87.7,87.7,0,0,1,216,128a86.4,86.4,0,0,1-3.2,23.4l-15.9-14.6a16.1,16.1,0,0,0-16.9-3l-30.5,12.7a16.1,16.1,0,0,0-9.7,12.4l-2.4,16.2A16.2,16.2,0,0,0,149.2,193l21.5,5.6,4,4a88,88,0,0,1-113.2-17Z"/>
  </symbol>

  <!-- Documentation system -->
  <symbol id="icon-diamond" viewBox="0 0 256 256">
    <path d="M236,116.7,139.3,20a16.1,16.1,0,0,0-22.6,0L20,116.7a15.9,15.9,0,0,0,0,22.6L116.7,236h0a15.9,15.9,0,0,0,22.6,0L236,139.3a15.9,15.9,0,0,0,0-22.6Zm-108,108h0L31.3,128,128,31.3,224.7,128Z"/>
  </symbol>
  <symbol id="icon-duplicate" viewBox="0 0 256 256">
    <path d="M224,40V184a8,8,0,0,1-16,0V48H72a8,8,0,0,1,0-16H216A8,8,0,0,1,224,40ZM192,72V216a8,8,0,0,1-8,8H40a8,8,0,0,1-8-8V72a8,8,0,0,1,8-8H184A8,8,0,0,1,192,72Zm-16,8H48V208H176Z"/>
  </symbol>
  <symbol id="icon-cog" viewBox="0 0 256 256">
    <path d="M128,80a48,48,0,1,0,48,48A48.05,48.05,0,0,0,128,80Zm0,80a32,32,0,1,1,32-32A32,32,0,0,1,128,160Zm88-29.84q.06-2.16,0-4.32l14.92-18.64a8,8,0,0,0,1.48-7.06,107.21,107.21,0,0,0-10.88-26.25,8,8,0,0,0-6-3.93l-23.72-2.64q-1.48-1.56-3-3L186,40.54a8,8,0,0,0-3.94-6,107.71,107.71,0,0,0-26.25-10.87,8,8,0,0,0-7.06,1.49L130.16,40Q128,40,125.84,40L107.2,25.11a8,8,0,0,0-7.06-1.48A107.6,107.6,0,0,0,73.89,34.51a8,8,0,0,0-3.93,6L67.32,64.27q-1.56,1.49-3,3L40.54,70a8,8,0,0,0-6,3.94,107.71,107.71,0,0,0-10.87,26.25,8,8,0,0,0,1.49,7.06L40,125.84Q40,128,40,130.16L25.11,148.8a8,8,0,0,0-1.48,7.06,107.21,107.21,0,0,0,10.88,26.25,8,8,0,0,0,6,3.93l23.72,2.64q1.49,1.56,3,3L70,215.46a8,8,0,0,0,3.94,6,107.71,107.71,0,0,0,26.25,10.87,8,8,0,0,0,7.06-1.49L125.84,216q2.16.06,4.32,0l18.64,14.92a8,8,0,0,0,7.06,1.48,107.21,107.21,0,0,0,26.25-10.88,8,8,0,0,0,3.93-6l2.64-23.72q1.56-1.48,3-3L215.46,186a8,8,0,0,0,6-3.94,107.71,107.71,0,0,0,10.87-26.25,8,8,0,0,0-1.49-7.06Zm-16.1-6.5a73.93,73.93,0,0,1,0,8.68,8,8,0,0,0,1.74,5.48l14.19,17.73a91.57,91.57,0,0,1-6.23,15L187,173.11a8,8,0,0,0-5.1,2.64,74.11,74.11,0,0,1-6.14,6.14,8,8,0,0,0-2.64,5.1l-2.51,22.58a91.32,91.32,0,0,1-15,6.23l-17.74-14.19a8,8,0,0,0-5-1.75h-.48a73.93,73.93,0,0,1-8.68,0,8,8,0,0,0-5.48,1.74L100.45,215.8a91.57,91.57,0,0,1-15-6.23L82.89,187a8,8,0,0,0-2.64-5.1,74.11,74.11,0,0,1-6.14-6.14,8,8,0,0,0-5.1-2.64L46.43,170.6a91.32,91.32,0,0,1-6.23-15l14.19-17.74a8,8,0,0,0,1.74-5.48,73.93,73.93,0,0,1,0-8.68,8,8,0,0,0-1.74-5.48L40.2,100.45a91.57,91.57,0,0,1,6.23-15L69,82.89a8,8,0,0,0,5.1-2.64,74.11,74.11,0,0,1,6.14-6.14A8,8,0,0,0,82.89,69L85.4,46.43a91.32,91.32,0,0,1,15-6.23l17.74,14.19a8,8,0,0,0,5.48,1.74,73.93,73.93,0,0,1,8.68,0,8,8,0,0,0,5.48-1.74L155.55,40.2a91.57,91.57,0,0,1,15,6.23L173.11,69a8,8,0,0,0,2.64,5.1,74.11,74.11,0,0,1,6.14,6.14,8,8,0,0,0,5.1,2.64l22.58,2.51a91.32,91.32,0,0,1,6.23,15l-14.19,17.74A8,8,0,0,0,199.87,123.66Z"/>
  </symbol>
  <symbol id="icon-code" viewBox="0 0 256 256">
    <path d="M69.12,94.15,28.5,128l40.62,33.85a8,8,0,1,1-10.24,12.29l-48-40a8,8,0,0,1,0-12.29l48-40a8,8,0,0,1,10.24,12.3Zm176,27.7-48-40a8,8,0,1,0-10.24,12.3L227.5,128l-40.62,33.85a8,8,0,1,0,10.24,12.29l48-40a8,8,0,0,0,0-12.29ZM162.73,32.48a8,8,0,0,0-10.25,4.79l-64,176a8,8,0,0,0,4.79,10.26A8.14,8.14,0,0,0,96,224a8,8,0,0,0,7.52-5.27l64-176A8,8,0,0,0,162.73,32.48Z"/>
  </symbol>
  <symbol id="icon-file-html" viewBox="0 0 256 256">
    <path d="M128,152a8,8,0,0,1-8,8h-8v48a8,8,0,0,1-16,0V160H88a8,8,0,0,1,0-16h32A8,8,0,0,1,128,152Zm-64-8a8,8,0,0,0-8,8v20H40V152a8,8,0,0,0-16,0v56a8,8,0,0,0,16,0V188H56v20a8,8,0,0,0,16,0V152A8,8,0,0,0,64,144Zm176,56H228V152a8,8,0,0,0-16,0v56a8,8,0,0,0,8,8h20a8,8,0,0,0,0-16Zm-45.86-55.71a8,8,0,0,0-9,3.59L168,176.45l-17.14-28.57A8,8,0,0,0,136,152v56a8,8,0,0,0,16,0V180.88l9.14,15.24a8,8,0,0,0,13.72,0L184,180.88V208a8,8,0,0,0,16,0V152A8,8,0,0,0,194.14,144.29ZM208,120a8,8,0,0,1-8-8V96H152a8,8,0,0,1-8-8V40H56v72a8,8,0,0,1-16,0V40A16,16,0,0,1,56,24h96a8,8,0,0,1,5.66,2.34l56,56A8,8,0,0,1,216,88v24A8,8,0,0,1,208,120ZM188.69,80,160,51.31V80Z"/>
  </symbol>
  <symbol id="icon-file-vuejs" viewBox="0 0 256 256">
    <path d="M87.54,154.69l-20,56a8,8,0,0,1-15.07,0l-20-56a8,8,0,0,1,15.07-5.38L60,184.21l12.47-34.9a8,8,0,0,1,15.07,5.38ZM208,160a8,8,0,0,0,0-16H176a8,8,0,0,0-8,8v56a8,8,0,0,0,8,8h32a8,8,0,0,0,0-16H184V188h16a8,8,0,0,0,0-16H184V160Zm-64-16a8,8,0,0,0-8,8v38a10,10,0,0,1-20,0V152a8,8,0,0,0-16,0v38a26,26,0,0,0,52,0V152A8,8,0,0,0,144,144Zm72-56v24a8,8,0,0,1-16,0V96H152a8,8,0,0,1-8-8V40H56v72a8,8,0,0,1-16,0V40A16,16,0,0,1,56,24h96a8,8,0,0,1,5.66,2.34l56,56A8,8,0,0,1,216,88Zm-27.31-8L160,51.31V80Z"/>
  </symbol>
  <symbol id="icon-playground" viewBox="0 0 256 256">
    <path d="M221.69,199.77,160,96.92V40h8a8,8,0,0,0,0-16H88a8,8,0,0,0,0,16h8V96.92L34.31,199.77A16,16,0,0,0,48,224H208a16,16,0,0,0,13.72-24.23ZM110.86,103.25A7.93,7.93,0,0,0,112,99.14V40h32V99.14a7.93,7.93,0,0,0,1.14,4.11L183.36,167c-12,2.37-29.07,1.37-51.75-10.11-15.91-8.05-31.05-12.32-45.22-12.81ZM48,208l28.54-47.58c14.25-1.74,30.31,1.85,47.82,10.72,19,9.61,35,12.88,48,12.88a69.89,69.89,0,0,0,19.55-2.7L208,208Z"/>
  </symbol>
  <symbol id="icon-scroll-to-top" viewBox="0 0 256 256">
    <path d="M229.66,114.34l-96-96a8,8,0,0,0-11.32,0l-96,96A8,8,0,0,0,32,128H72v80a16,16,0,0,0,16,16h80a16,16,0,0,0,16-16V128h40a8,8,0,0,0,5.66-13.66ZM176,112a8,8,0,0,0-8,8v88H88V120a8,8,0,0,0-8-8H51.31L128,35.31,204.69,112Z"/>
  </symbol>
  <symbol id="icon-check" viewBox="0 0 256 256">
    <path d="M104,192a8.5,8.5,0,0,1-5.7-2.3l-56-56a8.1,8.1,0,0,1,11.4-11.4L104,172.7,210.3,66.3a8.1,8.1,0,0,1,11.4,11.4l-112,112A8.5,8.5,0,0,1,104,192Z"/>
  </symbol>
</svg>
