\relax 
\@writefile{toc}{\contentsline {part}{I\hspace  {1em}Contexte}{2}}
\@writefile{toc}{\contentsline {paragraph}{L'association Compagnie 7\IeC {\`e}me Acte est une association dont le but principal est de cr\IeC {\'e}er des spectacles. Ces sources d'inspiration sont la fragilit\IeC {\'e} humaine et ses travers. Elle travaille actuellement sur le projet d'un triptyque (3 spectacles), dont le th\IeC {\`e}me principal est la lutte contre le harc\IeC {\`e}lement et l'abus. Cette association compte quelques membres, ainsi que plusieurs partenariats comme la Belgique. Dans le cadre du second projet de ce Triptyque, le spectacle "Emballe-moi", l'association "Compagnie 7\IeC {\`e}me Acte" propose une mission \IeC {\`a} des \IeC {\'e}tudiants : d\IeC {\'e}velopper une application "smartphone/tablettes". Nous, \IeC {\'e}tudiants en BTS Malraux, acceptons ce stage sur deux ans.}{2}}
\@writefile{toc}{\contentsline {part}{II\hspace  {1em}Projet}{2}}
\@writefile{toc}{\contentsline {paragraph}{La mission consiste en concevoir un applicatif dans le cadre du spectacle afin que le public interagisse avec le-dit spectacle. Dans un premier temps, on imagine et on con\IeC {\c c}oit les possibles du cahier des charges. Dans un deuxi\IeC {\`e}me temps, en s'appuyant sur de la documentation, on \IeC {\'e}tablit ce cahier des charges.}{2}}
\@writefile{toc}{\contentsline {section}{\numberline {1}Besoin utilitaire}{3}}
\@writefile{toc}{\contentsline {subsection}{\numberline {1.1}Description des fonctionnalit\IeC {\'e}s}{3}}
\@writefile{toc}{\contentsline {paragraph}{Livr\IeC {\'e} un outil et un dispositif qui permet d'h\IeC {\'e}berger des utilisateurs afin qu'ils profitent des fonctionnalit\IeC {\'e}s suivantes : }{3}}
\@writefile{toc}{\contentsline {subsubsection}{\numberline {1.1.1}Aide}{4}}
\@writefile{toc}{\contentsline {paragraph}{A la fin du dossier il y a des prototypages graphiques et voici quelques liens URL pour tester certaines de nos fonctionnalit\IeC {\'e}s : }{4}}
\@writefile{toc}{\contentsline {paragraph}{Ne pas oublier une application qui comprenne les fonctionnalit\IeC {\'e}s Avatar et Applaudir / F\IeC {\'e}liciter / Huer a du \IeC {\^e}tre fourni.}{4}}
\@writefile{toc}{\contentsline {subsection}{\numberline {1.2}Contraintes}{5}}
\@writefile{toc}{\contentsline {subsubsection}{\numberline {1.2.1}Utilisations}{5}}
\@writefile{toc}{\contentsline {paragraph}{Le programme doit \IeC {\^e}tre libre et adopter la licence GNU GPL V3, au sens o\IeC {\`u} il doit offrir les libert\IeC {\'e}s suivantes : }{5}}
\@writefile{toc}{\contentsline {paragraph}{Le programme ne peut pas devenir non-libre.}{5}}
\@writefile{toc}{\contentsline {subsubsection}{\numberline {1.2.2}Documentations}{5}}
\@writefile{toc}{\contentsline {paragraph}{La r\IeC {\'e}alisation d'une documentation technique et d'une documentation utilisateur doit respecter les r\IeC {\`e}gles suivantes : }{5}}
\@writefile{toc}{\contentsline {subsubsection}{\numberline {1.2.3}Mat\IeC {\'e}riels technique}{5}}
\@writefile{toc}{\contentsline {paragraph}{Dans le cadre de cette mission on demande du mat\IeC {\'e}riel n\IeC {\'e}cessaire : }{5}}
\@writefile{toc}{\contentsline {subsubsection}{\numberline {1.2.4}Mat\IeC {\'e}riels/Technologies}{5}}
\@writefile{toc}{\contentsline {paragraph}{L'application doit utiliser les technologies suivantes : }{5}}
\@writefile{toc}{\contentsline {subsubsection}{\numberline {1.2.5}Temps accord\IeC {\'e} au projet et au budget}{6}}
\@writefile{toc}{\contentsline {paragraph}{La mise en production de l'application et du dispositif inter-connexion sera \IeC {\`a} la date suivante : }{6}}
\@writefile{toc}{\contentsline {paragraph}{Cela donne une mise \IeC {\`a} production de 8 semaines auxquels les t\IeC {\^a}ches seront divis\IeC {\'e}es en 3 parties : }{6}}
\@writefile{toc}{\contentsline {paragraph}{Le budget reste \IeC {\`a} d\IeC {\'e}finir}{6}}
\@writefile{toc}{\contentsline {section}{\numberline {2}Prototypage}{7}}
\@writefile{toc}{\contentsline {paragraph}{Prototype de l'interface principale : }{7}}
\@writefile{toc}{\contentsline {paragraph}{Prototype de l'interface joueur : }{8}}
\@writefile{toc}{\contentsline {paragraph}{Prototype de la fonctionnalit\IeC {\'e} dictionnaire : }{9}}
\@writefile{toc}{\contentsline {paragraph}{Prototype de la fonctionnalit\IeC {\'e} simulation de conversation par t\IeC {\'e}l\IeC {\'e}phone : }{10}}
\@writefile{toc}{\contentsline {section}{\numberline {3}Acronyme}{11}}
\@writefile{toc}{\contentsline {subparagraph}{HTML5 HyperText Markup Language 5 : \newline  Langage de programmation dit "langage interpr\IeC {\'e}t\IeC {\'e}" car celui-ci est iterpr\IeC {\'e}t\IeC {\'e} directementement sur l'ordinateur client}{11}}
