siret;dept;latitude;longitude
50153069500037;49;-1.269964;47.327632
31329655000194;35;-1.49305;47.951474
30887794300784;44;-1.194536;47.374165
30887794300545;44;-1.19078;47.371562
40303581900255;44;-1.19078;47.371562
39176072500070;64;-1.474858;43.490744
37842972400057;85;-1.08248;46.905694
53327874300026;44;-1.375778;47.262935
31329655000186;35;-1.49305;47.951474
40303581902319;53;-0.412571;48.382045
40303581902327;72;-0.31555;47.837488
43500090600030;56;-2.667763;47.699416
43500090600022;56;-2.75422;47.640511
51889996800110;56;-3.077711;47.867917
31329655000038;35;-1.498752;47.967179
40303581902301;53;-0.707429;47.820709
42970729202907;44;-1.202801;47.409024
39426084800020;86;0.363539;46.669119
34198573700038;14;-0.347222;49.183936
48855648100023;53;-0.856381;48.115384
83947802100075;85;-1.083313;46.383411
83947802100083;85;-1.083313;46.383411
83947802100109;85;-1.070035;46.39281
83947802100091;85;-1.094922;46.416477
77772311500047;35;-1.430162;48.102301
66548013300115;49;-0.106429;47.272283
43309003200023;32;0.362175;43.931701
40318412000018;44;-1.173743;47.372867
34896142600023;72;0.082906;47.696738
33153241600012;79;-0.65465;46.790401
34199403600018;35;-2.033679;48.197485
30937151600027;49;-1.209276;47.339959
05720093300042;49;-0.341275;47.597022
42970729202899;35;-2.061955;48.193547
40381719000016;29;-4.359809;48.546895
42970729202881;53;-0.409524;48.16604
42970729202873;18;2.964061;46.831671
42970729202865;72;0.312017;47.728883
34349961200129;72;0.312017;47.728883
38311741300013;49;-0.977493;47.209909
34297956400016;44;-1.175778;47.385711
30853035100045;85;-0.894003;46.958306
30853035100029;85;-1.023435;46.868468
37798828200044;35;-1.733705;48.107251
79531786600015;86;0.565999;46.8721
43791497100159;86;0.521762;46.475257
34349961200095;79;-0.267689;46.68481
42970729202857;79;-0.267689;46.68481
34349961200103;17;-0.928124;45.986807
42970729202840;17;-0.928124;45.986807
50400150400027;56;-3.077711;47.867917
52174347600017;40;-0.570053;43.771001
30249495000066;72;-0.31555;47.837488
31004661000013;26;4.920782;44.735771
30831939100014;86;0.727652;46.4829
51334356600024;29;-4.484691;48.397493
33053347200024;44;-1.175778;47.385711
40303581900735;35;-1.319052;47.827572
81411852700013;79;-0.604048;46.738036
30970721400156;44;-1.186872;47.407944
87380151800119;49;-0.549141;47.427003
87380151800010;44;-1.506556;47.154988
87380151800135;44;-1.474829;47.295886
87380151800143;85;-1.430992;46.711895
87380151800093;85;-1.87719;46.851494
87380151800036;85;-0.816967;46.468057
86880016000160;44;-1.59416;46.889196
86880016000319;49;-1.052638;47.121973
86880016000285;44;-2.110207;47.265606
86980234800035;44;-1.231333;47.218015
86880016000277;44;-1.349192;47.235935
86880016000111;44;-1.26254;47.178005
86880016000251;44;-1.733837;47.112621
86880016000061;44;-1.236178;47.43482
86880016000194;44;-1.594552;46.991794
86880016000210;44;-1.479604;47.1872
86880016000301;85;-1.192299;46.950543
86980234800027;44;-1.290033;47.07946
83049836600012;49;-0.106429;47.272283
83049836600020;18;2.840575;47.332273
82961416300014;49;-0.106429;47.272283
82247815200017;49;-0.233053;47.428279
82247815200025;49;-0.81971;47.60353
82247815200033;86;0.10309;46.426685
81763473600018;44;-1.60645;47.209262
81363106600020;49;-0.575231;47.661517
81363106600046;44;-1.202801;47.409024
81363106600038;14;-0.59321;49.110013
80969340100022;53;-0.731979;48.100765
80460693700022;37;0.855605;47.443649
80458560200027;37;0.855605;47.443649
80338472600029;22;-2.905209;48.383616
80196039400014;29;-4.023054;48.099792
79805367400015;49;-0.106429;47.272283
79804672800019;49;-0.106429;47.272283
78609585100022;49;-0.276373;47.192876
78609585100121;26;4.743147;44.517205
78609585100014;49;-0.543187;47.480738
78609585100071;28;1.659024;48.404153
78609585100089;49;-0.207547;47.70174
78609585100105;02;3.074555;49.249728
78609585100113;49;-0.349867;47.592009
78609585100030;49;-0.326081;47.614789
77571588100121;86;0.561679;46.563457
77571588100279;86;0.648803;46.223575
77571588100857;86;0.10309;46.426685
77571588101400;37;0.785117;46.858465
77571588100089;86;0.077777;46.663379
77571588100246;86;0.875851;46.41655
77571588101160;86;0.179239;46.786787
77571588101608;79;-0.760326;46.924862
77571588101053;86;0.861519;46.5632
77571588101491;79;-0.059044;46.787959
77571588101525;79;-0.299203;46.572982
77571588101533;79;-0.48779;47.028032
77571588101673;86;0.328715;46.820666
77571588100071;86;0.653242;46.116812
77571588101186;86;0.15603;46.957527
77571588101483;79;-0.228013;46.885291
77571588101657;86;0.759731;46.734826
77571588100501;86;0.122406;46.434037
77571588100691;86;0.24369;46.306702
77571588101111;86;0.08134;47.015872
77571588101038;86;-0.03402;47.086207
77571588101442;37;0.425035;47.037434
77571588101475;79;-0.144466;46.810497
77571588100337;86;0.753268;46.642607
77571588100394;86;0.091863;46.834505
77571588100410;86;0.205985;46.496842
77571588101319;86;0.021472;47.066576
77571588101566;79;-0.126714;46.883269
77571588101574;79;-0.403133;46.435265
77571588101590;79;-0.59712;46.949882
77571588101632;79;-0.448232;46.856409
77571588101699;86;0.565999;46.8721
77571588100196;86;0.097948;46.712456
77571588100949;86;0.247764;46.682461
77571588101087;86;0.407759;46.901234
77571588100261;86;0.363539;46.669119
77571588101202;86;1.036807;46.471814
77571588101236;86;0.978217;46.547223
77571588101509;79;-0.132955;46.383749
77571588101517;79;-0.587843;46.625802
77571588101327;86;0.307503;46.936081
77571588101707;79;-0.117711;46.995523
77561379700015;53;-0.762581;48.075605
74990522000028;79;-0.200965;46.995087
66920030500045;35;-1.719897;48.105596
66548013300123;41;1.195957;47.344573
66548013300107;49;-0.216651;47.127455
62632034500046;79;-0.200292;47.000007
62632034500186;37;0.322834;47.019788
62632034500145;49;-0.871257;47.071521
55675011500058;44;-1.280231;47.461887
55675011500033;53;-0.960005;47.849354
55625022300014;53;-0.762581;48.075605
55625022300279;53;-0.744352;47.84097
53468670400022;75;2.318954;48.837003
53429528200022;24;1.298008;45.128463
34911366200028;71;4.869495;46.385435
34757035000038;44;-1.175778;47.385711
34459235700042;79;-0.576867;46.931061
34447746800047;88;6.613243;48.071478
34447746800187;79;-0.498118;46.835114
34447746800195;53;-0.764761;48.051044
34447746800096;88;6.088039;48.307236
34447746800138;49;-0.708848;47.624228
34447746800039;49;-0.711173;47.623871
34447746800070;49;-0.492387;47.488918
34447746800146;49;-0.914967;47.0307
34447746800112;62;2.670656;50.486809
34447746800120;85;-1.027721;46.866864
34447746800153;72;0.179142;47.957029
34447746800062;14;-0.645847;49.0789
34447746800088;38;4.90097;45.329448
34447746800104;51;4.613013;48.72238
34447746800179;14;0.243548;48.983797
34447746800161;61;0.093082;48.449921
34426663000393;53;-0.74023;48.082806
34426663000260;76;0.161235;49.479009
34426663000385;29;-4.055565;48.221003
34426663000328;29;-4.45296;48.425697
34426663000062;35;-1.771866;48.121036
34426663000419;29;-4.051034;48.002389
34426663000336;29;-4.45296;48.425697
34426663000203;22;-3.46279;48.756607
34426663000237;56;-3.324661;47.748902
34426663000351;29;-4.449198;48.39245
34349961200079;35;-1.430162;48.102301
34349961200053;44;-1.202801;47.409024
34349961200087;85;-0.894003;46.958306
34349961200061;18;2.964061;46.831671
34349961200046;14;-0.59321;49.110013
34328375000010;29;-4.359809;48.546895
41436387900027;02;3.914895;49.838769
34288117400060;35;-1.243586;48.507962
34198573700020;49;-0.708848;47.624228
34082112300031;44;-1.492932;47.119386
34060895900029;86;0.161004;47.067739
33835510000011;44;-1.173743;47.372867
52495892300012;53;-0.762581;48.075605
33808520200012;49;-0.452469;47.279573
49319511900018;79;-0.747317;46.98387
40984903100029;35;-1.430162;48.102301
33470934200029;44;-1.425212;47.183146
33470934200037;35;-1.319052;47.827572
33431548800059;79;-0.591084;46.936597
33431548800018;79;-0.586361;46.934821
33421475600010;66;2.921573;42.545461
49272037000013;44;-1.016056;47.392806
52335840600016;53;-0.762581;48.075605
49161693400015;49;-0.916377;47.028899
33104646600032;85;-1.013093;46.549565
40303581900057;44;-1.465256;47.289133
40303581900149;44;-1.037083;47.470624
40303581900214;44;-1.628479;47.565232
40303581900438;49;-0.797816;47.503156
40303581900453;49;-1.028496;47.705931
40303581900495;49;-1.176563;47.747916
40303581900719;35;-1.936705;47.807106
40303581900867;49;-1.017169;47.355006
40303581901345;49;-1.105915;47.035005
40303581900263;44;-1.239929;47.641179
40303581900388;44;-2.038661;47.201893
40303581900610;44;-1.832874;47.635605
40303581901824;44;-1.949467;47.115171
40303581900107;44;-1.664175;47.658743
40303581900198;44;-1.369708;47.411567
40303581900628;44;-1.950109;47.357105
40303581900909;49;-0.982599;47.216102
40303581901311;49;-0.836166;47.313121
40303581900479;49;-0.656459;47.38999
40303581900800;53;-0.724315;47.836567
40303581901196;49;-0.725362;47.62106
40303581901469;85;-0.940884;46.992361
40303581901774;37;0.341029;47.56358
40303581901865;44;-1.416034;47.619962
40303581901873;79;-0.46228;46.982663
40303581900305;44;-1.813967;47.10522
40303581900404;49;-1.037765;47.563493
40303581900651;44;-2.04514;47.519208
40303581900677;53;-0.969042;47.847391
40303581900834;49;-1.301844;47.315382
40303581900875;49;-0.808992;47.134132
40303581900974;44;-2.398621;47.37497
40303581901881;49;-0.244184;47.661032
40303581900289;44;-1.178852;47.52059
40303581900891;85;-1.519985;46.985673
40303581900933;35;-1.686386;47.855299
40303581901238;49;-0.994083;47.108521
40303581901923;44;-1.41512;46.971499
40303581901147;49;0.038364;47.399612
40303581901287;49;-0.966136;47.197566
40303581901808;49;-0.380655;47.466445
40303581901907;44;-1.449739;47.787688
40303581900016;44;-1.173743;47.372867
40303581901261;49;-0.693656;47.023789
40303581901642;49;-0.523743;47.146769
40303581900412;49;-0.591722;47.668143
40303581900669;44;-1.887111;47.53956
40303581900966;44;-1.392193;47.70404
40303581901790;49;-0.357419;47.572685
40303581901832;49;0.118482;47.507097
40303581900370;44;-1.229736;47.438646
40303581900529;49;-0.591339;47.582662
40303581900750;35;-1.741391;47.736578
40303581900842;49;-1.12734;47.244201
40303581901121;49;-0.634598;47.364481
40247064500019;44;-1.387334;47.268775
40109722500031;27;1.419692;49.247446
40109722500049;76;1.10236;49.394772
32662493900020;49;-0.449339;47.354557
48902424000017;44;-1.17264;47.367818
48855648100031;44;-1.17264;47.367818
51889996800078;22;-2.971927;48.537975
51889996800102;49;-1.238792;47.267505
51889996800011;56;-3.074271;47.870616
51889996800052;29;-3.563754;48.27339
51889996800094;56;-2.461771;47.683647
51889996800029;35;-1.134392;48.485815
51889996800086;29;-3.649237;48.248542
51889996800037;29;-4.061242;48.147394
51889996800060;22;-3.177211;48.603761
44429095100037;44;-1.194625;47.411284
32370587100024;49;0.119975;47.508908
32370587100057;49;-0.573356;47.663481
32370587100032;49;-0.491355;47.756441
51805352500029;35;-1.481241;48.103936
32249907000017;85;-1.696309;46.88403
32153770600012;37;0.603884;47.362909
39775822800035;85;-1.065856;46.5587
31994909500016;53;-0.762581;48.075605
31981571800022;79;-0.199675;46.99235
44187572100025;49;-0.500346;47.678273
31909964400092;49;-0.812559;47.604975
31909964400043;44;-1.870375;47.419446
31909964400100;49;-0.779111;47.247362
31909964400134;49;-0.236986;47.439467
31909964400142;49;0.093024;47.488574
31909964400068;44;-1.392193;47.70404
31909964400076;44;-1.474973;47.437643
31909964400126;79;-0.744867;46.985367
31909964400118;49;-0.979642;47.213484
44142798600019;61;0.094345;48.448506
31805273500020;37;0.903668;47.217484
31725305200029;56;-3.016767;47.888569
31669474400020;29;-4.055565;48.221003
31669474400012;22;-2.961801;48.334776
31514583900033;53;-0.942987;47.841295
31514583900017;53;-0.823515;47.810324
31490197600014;85;-1.125604;46.800419
44003984000028;49;-0.495382;47.534719
44003984000010;49;-0.541314;47.484782
39176072500088;40;-0.910331;43.802271
39176072500013;40;-0.577218;43.768798
31030692300031;37;0.536943;47.305914
31030692300023;37;0.223088;47.406191
31004661000054;26;5.082394;45.035084
30970721400131;44;-1.188743;47.407687
51107270400022;22;-2.67881;48.487758
51107042700014;29;-4.359809;48.546895
51107113600010;29;-4.235186;48.452252
30887794300560;44;-1.392193;47.70404
30887794300578;44;-1.617833;47.329703
30887794300693;44;-1.275631;47.162172
30887794300214;37;0.32097;47.442596
30887794300305;49;-1.248097;47.273212
30887794300610;44;-1.374107;47.235454
30887794300685;86;0.10309;46.426685
30887794300750;49;-1.000889;47.304989
30887794300768;44;-2.122769;47.125268
30887794300826;49;-0.850135;47.051321
30887794300206;79;-0.198837;46.982807
30887794300453;44;-1.729246;47.245731
30887794300644;86;0.278787;46.532442
30887794300669;86;0.2549;46.681511
30887794300552;44;-1.709646;47.156951
30887794300602;44;-1.501003;47.447075
30887794300636;86;0.625001;46.557281
30887794300792;86;0.494802;46.559043
30887794300024;49;-0.541314;47.484782
30887794300040;49;-0.866761;47.672818
30887794300222;49;-0.779586;47.344755
30887794300503;37;0.166546;47.272493
30887794300529;49;-0.994083;47.108521
30887794300651;86;0.362557;46.647912
30887794300719;86;0.559188;46.824706
30887794300735;86;0.171559;46.785337
30887794300032;49;-0.063413;47.277757
30887794300446;49;-0.868369;47.072588
30887794300537;44;-1.285379;47.080546
30887794300776;44;-2.062711;47.425664
30887794300081;49;-0.223737;47.43545
30887794300354;49;-0.506392;47.43764
30887794300412;35;-1.690529;47.852183
30887794300057;49;-0.108485;47.544355
30887794300073;49;-0.464622;47.621563
30887794300123;49;-0.116011;47.3701
30887794300438;44;-1.756263;47.479715
30887794300487;44;-2.32698;47.443301
30887794300701;86;0.081833;47.014472
30887794300131;49;-0.54971;47.701727
30887794300511;49;-0.979642;47.213484
30887794300586;44;-1.51453;47.061714
30887794300727;86;0.481756;46.754118
30887794300743;86;0.284001;46.833653
30887794300834;86;0.795942;46.793505
30863634900034;85;-1.12698;46.801675
30831939100022;86;0.364293;46.669333
30831939100030;86;0.561679;46.563457
43791497100035;86;0.056476;46.368671
43791497100183;87;1.185653;46.208877
43791497100126;86;0.77718;46.578377
43791497100175;16;0.194739;45.767153
43791497100050;79;-0.040344;46.426315
43791497100142;86;0.589663;46.411178
43791497100027;79;0.120018;46.135043
43791497100118;86;0.357951;46.279358
43791497100134;86;0.726305;46.482792
43791497100076;16;0.305635;46.044035
51040823000025;53;-0.7628;48.05303
30591845000050;35;-1.319052;47.827572
30537565100026;56;-2.549651;47.699506
30249495000298;53;-0.828946;48.403626
30249495000249;53;-0.784242;47.984817
30249495000314;53;-0.757584;48.126463
30249495000488;72;0.023584;48.269179
30249495000116;49;-0.320424;47.503173
30249495000280;53;-0.556538;48.143805
30249495000082;49;-0.409281;47.744447
30249495000207;53;-0.998175;48.361619
30249495000231;53;-0.473274;48.043521
30249495000348;72;0.047612;47.943521
30249495000397;53;-0.429171;48.370096
30249495000439;61;-0.15029;48.50231
30249495000132;53;-0.438796;47.790334
30249495000157;49;-0.671784;47.556922
30249495000181;53;-0.722857;48.076587
30249495000108;72;-0.161839;47.920344
30249495000215;53;-0.785811;48.175757
30249495000322;53;-0.826582;48.403877
30249495000330;72;-0.097156;47.813244
30249495000058;53;-0.543268;47.809766
30249495000199;53;-0.414754;48.25587
30249495000264;53;-0.409524;48.16604
30249495000272;53;-0.62727;48.063455
30249495000421;61;0.019462;48.466317
30249495000470;72;-0.012614;48.12523
30249495000033;49;-0.545505;47.702659
30249495000165;49;-0.803422;47.483023
30249495000223;53;-1.031674;48.231833
30249495000355;53;-0.100607;48.398725
30249495000363;53;-0.329304;48.422317
30249495000413;53;-0.277119;48.340387
30249495000462;72;-0.132709;48.181745
30185935100027;29;-4.366757;48.541453
30124090900046;44;-1.34473;47.172011
30107363100055;86;0.056059;46.359357
30107363100014;86;0.281284;46.657637
47918095200034;03;2.604487;46.357947
47918095200026;61;0.093082;48.449921
47874746200024;49;-0.356913;47.572601
38453466500029;44;-1.188743;47.407687
38453466500011;44;-1.173743;47.372867
43309003200031;32;0.76362;43.525971
38332052000026;85;-0.845041;46.771582
38319595500018;29;-4.020705;47.980766
38311741300039;85;-0.894003;46.958306
38311741300021;44;-1.175778;47.385711
38279049100023;51;4.148536;49.313976
38203699400053;97;55.292571;-20.92968
42970729200216;44;-1.529568;47.553976
42970729200232;44;-1.285379;47.080546
42970729200927;49;-0.591722;47.668143
42970729200984;49;0.038364;47.399612
42970729201107;49;-0.886306;47.618714
42970729201305;79;-0.448232;46.856409
42970729201321;85;-0.951611;46.991834
42970729201784;44;-1.416034;47.619962
42970729200083;37;0.166546;47.272493
42970729200091;37;0.369297;47.515435
42970729200273;44;-1.832874;47.635605
42970729200281;44;-2.038661;47.201893
42970729200414;44;-1.229736;47.438646
42970729200588;49;-0.531086;47.528712
42970729200745;49;-0.120072;47.373651
42970729201297;79;-0.59712;46.949882
42970729201628;44;-1.949467;47.115171
42970729201701;49;-1.105915;47.035005
42970729201875;44;-1.630156;47.355795
42970729200141;44;-1.383448;47.717656
42970729200265;44;-1.730657;46.941917
42970729200349;44;-2.32698;47.443301
42970729200448;44;-1.047207;47.563621
42970729200489;44;-1.664175;47.658743
42970729200778;49;-0.81971;47.60353
42970729200802;49;-0.233053;47.428279
42970729201172;49;-0.359204;47.698846
42970729201685;49;-0.725362;47.62106
42970729201792;35;-1.936705;47.807106
42970729201818;35;-1.741391;47.736578
42970729200810;49;-0.153751;47.130508
42970729201123;49;-1.027633;47.719918
42970729200059;35;-1.389026;47.832793
42970729200190;44;-1.526282;47.081541
42970729200323;44;-1.037083;47.470624
42970729200596;49;-0.530124;47.53062
42970729200620;49;-1.03097;47.26454
42970729200760;49;-0.634598;47.364481
42970729200877;49;-0.836166;47.313121
42970729200976;49;-0.801943;47.502163
42970729201024;49;-1.176563;47.747916
42970729201339;85;-1.519985;46.985673
42970729201461;86;0.174785;46.967838
42970729201487;86;0.566753;46.873069
42970729201719;49;-0.438067;47.228686
42970729201727;49;-0.693656;47.023789
42970729201768;44;-1.465256;47.289133
42970729201842;44;-1.756263;47.479715
42970729200257;44;-1.950109;47.357105
42970729200521;44;-1.243396;47.641119
42970729200604;49;-0.541314;47.484782
42970729200851;49;-1.190768;47.288107
42970729200901;49;-0.533758;47.146554
42970729200919;49;-0.475066;47.3557
42970729200968;49;-0.887098;47.520981
42970729201016;49;-1.006111;47.360519
42970729201669;53;-0.969042;47.847391
42970729201693;49;-0.994083;47.108521
42970729201867;44;-1.449739;47.787688
42970729200224;44;-1.629983;47.564764
42970729200539;44;-1.813967;47.10522
42970729200653;49;-0.779111;47.247362
42970729200752;49;-0.763453;47.408788
42970729200836;49;-0.241976;47.145224
42970729201040;49;-1.037765;47.563493
42970729201743;49;-0.982599;47.216102
42970729200018;44;-1.173743;47.372867
42970729200026;86;0.363539;46.669119
42970729200570;44;-1.369708;47.411567
42970729200844;49;-1.301844;47.315382
42970729200935;49;-0.808992;47.134132
42970729201115;49;-0.888604;47.170913
42970729201156;49;-0.994964;47.201852
42970729201206;49;-0.264551;47.189664
42970729201644;49;-1.056716;47.154206
42970729201651;49;-0.380655;47.466445
42970729201834;44;-2.398621;47.37497
42970729200430;44;-2.04514;47.519208
42970729200737;49;-0.108485;47.544355
42970729201198;49;-0.055259;47.325953
42970729201313;79;-0.760326;46.924862
42970729201826;35;-1.392465;47.912609
42970729200505;44;-1.59301;46.882216
42970729200695;49;-0.357419;47.572685
42970729201065;49;0.118482;47.507097
42970729201180;49;-0.021717;47.301755
42970729201230;53;-0.724087;47.837045
42970729201800;35;-1.686386;47.855299
42970729201891;44;-1.375778;47.262935
50433211500014;44;-1.373981;47.261669
42934900400011;53;-0.764761;48.051044
42925216600013;72;0.179142;47.957029
42916294400012;26;5.065793;45.167645
38065643900102;29;-4.484691;48.397493
38061975900133;22;-2.321156;48.408146
38061975900083;85;-0.640624;46.547968
38061975900026;49;-1.224688;47.266871
38061975900018;44;-1.416034;47.619962
38061975900059;44;-1.280231;47.461887
38061975900075;49;-1.068918;47.14243
50393275800025;22;-3.160084;48.312546
38031761000042;49;-0.356913;47.572601
38030593800017;79;-0.395602;46.549645
38022515100022;49;-0.541314;47.484782
38022515100048;14;-0.59321;49.110013
38022515100063;17;-0.928124;45.986807
37881593000078;44;-1.375356;47.288138
37881593000086;49;-0.54534;47.432053
37881593000060;49;-0.021717;47.301755
37881593000052;44;-1.375778;47.262935
37842972400040;85;-1.048395;46.857198
37798828200028;35;-1.629816;48.18591
37798828200010;56;-3.093983;47.86141
37608048700022;56;-3.374029;48.140272
37608048700055;85;-1.038516;46.696134
37608048700139;29;-4.055565;48.221003
37608048700063;29;-4.055565;48.221003
42333505800016;49;0.050688;47.218501
44897853600085;22;-2.781161;48.543183
44897853600093;56;-2.823852;47.876195
44897853600010;29;-3.983449;48.220594
07120207100024;49;-0.181579;47.425721
06320025700028;49;-0.75482;47.40643
42161842200065;49;-0.648153;47.299392
42161842200107;44;-1.305657;47.210333
42161842200099;44;-1.275631;47.162172
42161842200032;49;-0.55292;47.35684
42161842200057;37;0.269986;47.180065
42161842200115;44;-1.386982;47.096728
42161842200081;49;-0.264551;47.189664
44534854300023;44;-1.26254;47.178005
44534854300031;44;-1.290033;47.07946
02555012000015;22;-2.203434;48.54283
50001490700025;44;-1.17264;47.367818
35029959000025;51;4.148536;49.313976
34171386500028;86;0.363539;46.669119
34447746800021;44;-1.173743;47.372867
34349961200038;49;-1.056716;47.154206
34082112300023;44;-1.173743;47.372867
66548013300248;18;2.840575;47.332273
39773019300018;44;-1.173743;47.372867
66548013300230;49;-0.448539;47.354794
83947802100026;85;-1.12698;46.801675
66548013300222;44;-1.324244;47.197626
30124090900053;44;-1.324244;47.197626
34426663000435;13;5.733173;43.691624
66548013300214;44;-1.274648;47.163662
35305397800014;44;-1.173743;47.372867
34073420100015;44;-1.173743;47.372867
86880016000368;44;-1.290033;47.07946
06620009800037;49;-0.541314;47.484782
31329655000160;22;-2.77701;48.543464
42339417000017;49;-0.541314;47.484782
37881593000094;49;-0.381539;47.466198
42970729201537;44;-2.103548;47.115734
79420362000016;56;-3.093983;47.86141
31329655000103;22;-2.086449;48.429262
31329655000152;22;-2.77809;48.543931
31329655000095;22;-2.781039;48.467437
35000963500011;86;0.281284;46.657637
39775822800027;85;-1.013093;46.549565
34426663000427;29;-4.45836;48.418559
34060895900037;86;0.363539;46.669119
40109722500064;27;1.14803;48.998341
44003984000044;49;-0.543943;47.448685
31329655000145;22;-2.733307;48.489587
31329655000129;22;-3.5155;48.297793
31329655000111;22;-2.679943;48.481944
31329655000137;22;-2.664711;48.499766
87380151800168;44;-1.61756;47.254638
30831939100055;49;-0.516163;47.502119
30646206000014;49;-0.543187;47.480738
34447746800211;49;-0.500346;47.678273
40303581901956;44;-1.298583;47.249239
33810563800021;44;-1.173743;47.372867
40303581900396;49;-0.886306;47.618714
42970729201222;49;-0.632759;47.302102
42970729200786;49;-0.319;47.412415
42970729200547;44;-1.386373;47.096957
42970729200307;44;-1.275631;47.162172
30831939100048;53;-0.762581;48.075605
42970729202816;35;-1.430162;48.102301
42970729202832;72;-0.159286;48.021638
77561379700734;72;-0.159286;48.021638
42970729202824;79;-0.353897;47.046788
40303581901386;79;-0.354432;47.045561
40303581901592;86;0.311935;46.739477
33427007100015;44;-1.173743;47.372867
40303581902293;35;-1.224403;48.132272
40303581902277;35;-1.279762;48.33997
40303581902285;35;-1.231102;47.938608
38030593800025;85;-1.313147;46.975748
30887794300859;49;-0.543943;47.448685
55625022300212;53;-0.915943;48.295863
55625022300030;35;-1.224403;48.132272
55625022300154;53;-0.839518;48.392286
55625022300238;35;-1.231102;47.938608
55625022300204;53;-0.948496;47.836347
55625022300220;53;-0.6122;48.289716
55625022300139;53;-0.489271;48.442119
55625022300113;53;-0.667168;48.089599
55625022300162;53;-0.272532;48.343471
55625022300188;53;-0.750897;48.087921
55625022300196;53;-0.967587;48.160585
55625022300253;50;-1.335784;48.519388
55625022300147;53;-0.388219;48.14039
55625022300170;53;-0.554184;47.953198
55625022300246;53;-0.166548;48.480208
55625022300121;53;-0.691517;47.830972
55625022300287;35;-1.279762;48.33997
40303581902269;53;-0.191164;48.464551
40303581902251;53;-0.691517;47.830972
40303581902244;53;-0.6122;48.289716
40303581902012;53;-0.663174;48.194041
40303581902004;53;-0.620374;48.39965
40303581902236;53;-1.031674;48.231833
40303581902228;53;-0.973556;48.471349
40303581902210;53;-1.035596;48.481652
40303581902202;53;-0.934537;48.059745
40303581902194;53;-0.762581;48.075605
40303581902186;53;-0.667168;48.089599
40303581902178;53;-0.839518;48.392286
40303581902160;53;-0.388219;48.14039
40303581902152;53;-0.489271;48.442119
40303581902145;53;-0.744352;47.84097
40303581902137;53;-1.028288;48.112492
40303581902129;53;-0.804085;47.91967
40303581902111;53;-0.313496;48.238854
40303581902103;53;-0.272532;48.343471
40303581902095;53;-0.905598;47.951404
40303581902087;53;-0.554184;47.953198
40303581902079;53;-0.750897;48.087921
40303581902061;53;-0.967587;48.160585
40303581902053;53;-0.946087;47.839149
40303581902046;53;-0.915943;48.295863
40303581902038;53;-0.525453;47.881523
40303581902020;53;-1.133705;47.841763
52495892300020;53;-0.166548;48.480208
30887794300347;79;-0.144466;46.810497
42970729201966;53;-0.691517;47.830972
77561379700353;53;-0.68221;47.823567
06620009800078;44;-1.175778;47.385711
86180035700035;44;-1.173743;47.372867
40318412000026;44;-1.179487;47.38415
30116925600023;44;-1.179487;47.38415
38517977500023;44;-1.17264;47.367818
41063044600012;44;-1.173743;47.372867
40318412000034;44;-1.179487;47.38415
40156878700022;44;-1.173743;47.372867
50393275800017;44;-1.175778;47.385711
50400150400035;44;-1.188743;47.407687
41451573400013;44;-1.173743;47.372867
40156878700014;44;-1.176764;47.368255
42462109200016;44;-1.173743;47.372867
42497962300032;44;-1.175778;47.385711
50400150400019;44;-1.175778;47.385711
34459235700067;44;-1.188743;47.407687
35091206900019;44;-1.176839;47.36624
34757035000012;44;-1.173743;47.372867
42497962300040;44;-1.188743;47.407687
38453466500037;44;-1.186872;47.407944
43309003200015;44;-1.173743;47.372867
38065643900029;44;-1.175778;47.385711
66548013300156;44;-1.17264;47.367818
66548013300164;44;-1.173743;47.372867
43500090600014;44;-1.173743;47.372867
50393275800033;44;-1.188743;47.407687
44464950300018;44;-1.173743;47.372867
30970721400040;44;-1.175778;47.385711
31909964400050;44;-1.19078;47.371562
44534854300015;49;-0.998873;47.308944
30887794300198;49;-0.264551;47.189664
40303581901998;49;-0.744115;47.523791
40303581901980;49;-0.843111;47.710508
44187572100017;49;-0.707108;47.618758
40303581901972;72;-0.191816;48.017705
40303581901964;50;-1.335784;48.519388
34288117400045;14;-0.88851;48.824043
34288117400029;50;-1.273111;48.573202
42970729202808;79;-0.403133;46.435265
77571588101012;86;0.205018;46.74089
66718018600039;78;2.102583;48.8778
42970729201636;86;0.246887;46.31122
81363106600061;49;-0.516163;47.502119
42970729201982;53;-0.388219;48.14039
77561379700163;53;-0.388219;48.14039
34349961200137;53;-0.409524;48.16604
77561379700684;53;-0.407888;48.163142
83947802100034;85;-1.100365;46.774239
83947802100042;85;-1.118249;46.76545
83947802100059;85;-1.116331;46.764641
83947802100067;85;-1.35455;46.761754
40318412000042;49;-0.500346;47.678273
40303581901188;49;-0.609255;47.664727
77571588100378;86;0.456605;46.718008
42970729202741;86;0.311935;46.739477
42970729202790;35;-1.191124;48.458903
42161842200123;49;-0.060656;47.208793
52210180700025;29;-4.484691;48.397493
77571588100451;86;0.139594;46.547679
77571588101343;86;0.139594;46.547679
77571588100816;86;0.201766;46.365186
40303581901857;79;-0.306892;46.571111
42970729202501;79;-0.299203;46.572982
62632034500103;79;-0.219155;46.962342
77561379700411;53;-0.547683;47.816202
30249495000090;53;-0.541703;47.809845
77772311500039;35;-2.061955;48.193547
33372278300052;79;-0.200292;47.000007
42970729202782;35;-1.205478;48.527106
42970729202774;14;-0.888617;48.822924
44897853600168;56;-2.867675;47.892657
42970729202766;50;-1.273111;48.573202
42772501500015;49;-0.754332;47.406691
66548013300206;49;-0.459528;47.349197
66548013300198;49;0.050688;47.218501
44897853600150;56;-2.829558;47.882226
77772311500021;35;-1.597307;48.013108
44897853600127;29;-4.067887;48.208775
44897853600143;22;-2.255909;48.318785
44897853600135;56;-2.754066;47.907839
38413501800016;49;-1.224688;47.266871
30358795000138;49;-0.541314;47.484782
44464950300026;49;-0.707108;47.618758
33835510000045;86;0.561679;46.563457
30887794300339;49;-0.926265;47.408413
30887794300313;49;-0.237702;47.330063
30887794300297;49;0.038364;47.399612
30887794300289;49;-0.381539;47.466198
30887794300255;49;-0.887092;47.524615
30887794300263;49;-0.634598;47.364481
30887794300248;49;-0.438261;47.388882
48216052000029;53;-0.762581;48.075605
30887794300230;49;-0.533101;47.432268
30887794300156;49;-0.319944;47.48538
30887794300065;49;-0.429991;47.501924
81363106600053;86;0.077777;46.663379
86880016000178;44;-1.611872;47.086231
86880016000202;44;-1.243785;47.237174
86880016000228;44;-1.630615;47.271634
86880016000137;44;-2.157654;47.418074
79951810500017;49;-0.543187;47.480738
79951810500025;02;3.081092;49.251522
78609585100063;49;-0.51166;47.513269
77571588101582;79;0.133996;46.333296
77571588101616;79;-0.598769;46.479259
77571588101558;79;-0.211015;46.959703
77571588101624;79;-0.353686;47.044755
77571588101418;37;0.491278;46.98142
77571588101350;86;0.663009;46.671848
77571588101095;86;0.215793;46.855603
77571588101384;86;0.364176;46.930886
77571588100725;86;0.363445;46.459342
77571588100964;86;0.858165;46.73183
77571588101020;86;0.498386;46.817931
77571588100873;86;0.241452;46.54258
77571588101293;86;0.079833;47.130658
77571588100568;86;0.47479;46.3808
77571588100741;79;0.158879;46.268376
77571588101269;86;0.15467;46.715063
77571588101392;37;0.443725;47.147092
77571588101210;86;0.007761;46.97727
77561379700791;50;-1.120796;49.090185
77561379700478;49;-0.867176;47.681364
77561379700742;50;-1.336759;48.519442
77561379700692;35;-1.231102;47.938608
55625022300261;61;0.09893;48.442621
55625022300063;35;-1.829553;48.081234
34917212200013;72;0.179142;47.957029
34426663000278;29;-4.005941;47.974551
41025064100033;49;-0.916377;47.028899
33458122000038;69;4.715587;45.942759
32667392800056;49;-0.236986;47.439467
39468609100015;53;-0.764761;48.051044
39325800900025;85;-1.12698;46.801675
39325413100021;29;-3.670446;47.910978
39044295200011;56;-2.549651;47.699506
47918095200059;49;-0.76384;47.017024
31855788100030;61;0.094345;48.448506
38907564900019;79;-0.498118;46.835114
31076443600013;14;0.152334;49.005907
42970729200158;44;-1.436697;46.973948
42970729200471;44;-1.592659;47.72792
42970729200174;44;-1.716405;47.382249
42970729200687;49;-0.319944;47.48538
42970729201057;49;-0.591339;47.582662
42970729201099;49;0.11426;47.514065
42970729200794;49;-0.319;47.412415
42970729201008;49;-0.146301;47.215693
42970729200943;49;-0.233667;47.34004
42970729202006;44;-1.433345;46.971138
42970729200166;44;-1.769361;47.420297
42970729200497;44;-1.887111;47.53956
30358795000021;47;0.692566;44.176993
30358795000054;49;-0.54534;47.432053
30358795000120;44;-1.375356;47.288138
30358795000062;49;-0.021717;47.301755
30245160400029;85;-1.027721;46.866864
38061975900158;35;-1.908192;48.640123
38031761000034;49;-0.612618;47.474792
37842972400024;85;-1.040977;46.849827
37842972400016;49;-1.045595;47.140399
35230370500037;49;-0.979642;47.213484
35230370500029;49;-0.775611;47.250034
06320025700077;49;-0.652929;47.307222
06320025700044;49;-1.317086;47.312906
42970729202048;72;0.179142;47.957029
42970729202758;72;-0.288168;47.982713
33835510000037;79;-0.200292;47.000007
80969340100014;62;1.953147;50.366514
44897853600028;29;-4.608176;48.422651
86880016000087;44;-1.364733;47.410118
86880016000095;44;-1.376461;47.413587
34895081700034;79;-0.747317;46.98387
42970729202584;86;0.093472;46.708124
42970729202733;86;0.561679;46.563457
42970729202725;86;0.091863;46.834505
42970729202717;86;0.759731;46.734826
42970729202709;86;0.207697;46.496797
42970729202691;86;0.077777;46.663379
42970729202683;86;0.861285;46.565079
42970729202675;86;0.844414;46.67986
42970729202667;86;0.445469;46.908272
42970729202659;86;0.247764;46.682461
42970729202642;86;0.875066;46.417116
42970729202634;86;0.105314;46.428815
42970729202626;86;0.689013;46.278841
42970729202618;86;1.036369;46.473016
42970729202592;86;0.978217;46.547223
42970729202519;79;-0.228013;46.885291
42970729202527;79;-0.132955;46.383749
86880016000327;79;-0.840428;46.977804
33372278300011;79;-0.840428;46.977804
86880016000244;44;-1.367939;47.235487
42970729202576;85;-0.705134;46.696694
42970729202568;36;1.049608;46.634
42970729202550;36;1.040229;46.691011
42970729200075;37;0.429023;47.041899
42970729200117;37;0.785117;46.858465
42970729202543;37;0.488195;46.980486
42970729202535;37;0.320211;47.015522
77571588101426;37;0.320211;47.015522
42970729202493;79;-0.126714;46.883269
42970729202485;79;-0.059044;46.787959
42970729202477;49;-0.843111;47.710508
77561379700494;49;-0.744115;47.523791
42970729202469;49;-0.744115;47.523791
42970729202451;49;-0.863763;47.688382
42970729202378;53;-0.272532;48.343471
42970729202360;53;-1.028288;48.112492
42970729202352;53;-1.058273;48.283412
42970729202345;53;-0.422305;47.86383
42970729202337;53;-1.133705;47.841763
42970729202329;53;-0.934537;48.059745
34349961200111;53;-0.762581;48.075605
42970729202287;53;-0.989994;48.390154
42970729202279;53;-0.554184;47.953198
42970729202261;53;-0.663174;48.194041
42970729202295;53;-0.677429;48.353933
42970729202311;53;-0.804085;47.91967
42970729202303;53;-0.204623;48.457369
42970729202253;53;-0.489271;48.442119
42970729202246;53;-1.035596;48.481652
42970729202238;53;-1.031674;48.231833
42970729202220;53;-0.313496;48.238854
42970729202444;35;-1.231102;47.938608
42970729202436;35;-1.224403;48.132272
42970729202428;35;-1.213464;47.966898
42970729202212;53;-0.525453;47.881523
42970729202204;53;-0.973556;48.471349
42970729202196;53;-0.705828;48.000173
42970729202188;53;-1.119057;47.971944
42970729202170;53;-0.948496;47.836347
42970729202162;53;-0.905598;47.951404
42970729202154;53;-0.772128;47.788072
42970729202147;53;-0.856381;48.115384
42970729202139;53;-0.583525;48.017865
42970729202121;53;-0.417197;47.932105
42970729202089;53;-1.04355;47.897199
42970729202113;53;-0.667168;48.089599
42970729202105;53;-0.620374;48.39965
42970729202386;53;-0.744382;48.079726
42970729202410;53;-0.740447;48.07942
77561379700452;53;-0.784411;48.061224
42970729202071;53;-0.743207;48.079418
42970729202063;53;-0.762581;48.075605
42970729202097;53;-0.753955;48.18569
77561379700809;50;-1.135101;48.998006
42970729202402;50;-1.135101;48.998006
42970729202394;50;-1.336759;48.519442
83950749800021;85;-1.12698;46.801675
32099178900050;49;-0.541314;47.484782
77571588100030;86;0.636573;46.507096
77571588101129;86;0.721527;46.398746
77571588101152;86;0.267462;46.844647
77571588101335;86;-0.022179;46.997002
77571588100055;86;0.718158;46.404867
77571588100329;86;0.736847;46.729448
77571588100345;86;0.682992;46.648331
77571588100535;86;0.776999;46.570905
77571588100659;86;0.917937;46.509264
77571588100808;86;0.28966;46.229624
77571588100956;86;0.521762;46.475257
77571588101277;86;0.607154;46.360808
77571588100097;86;0.881265;46.564002
77571588101004;86;0.508755;46.877012
77571588101145;86;0.281258;46.631533
77571588101178;86;0.484376;46.495612
77571588101244;86;0.161004;47.067739
77571588101079;86;0.242384;46.767658
77571588100881;86;0.054872;46.512723
77571588100931;86;0.231434;46.67886
77571588101061;86;0.619752;46.793375
77571588100105;86;0.593096;46.406121
77571588100253;86;0.785481;46.250499
77571588100428;86;0.023112;46.772997
77571588100865;86;0.521719;46.609082
77571588101301;86;0.242858;46.614278
77571588100022;86;0.1755;46.647975
77571588101103;86;0.207525;47.032311
77571588101137;86;-0.057219;47.011466
77571588101228;86;-0.088196;47.069644
77571588100162;86;0.861285;46.565079
77571588100519;86;-0.012207;46.888063
77571588101194;86;0.361261;46.776666
77571588101251;86;0.564034;46.683585
77571588101459;36;1.040229;46.691011
77571588101640;85;-0.705134;46.696694
77571588100386;86;0.11622;46.945657
77571588100782;86;0.507607;46.561387
77571588101376;86;0.075102;46.941316
77571588100287;86;0.256761;46.682639
77571588100352;86;0.746066;46.811119
77571588100642;86;1.087823;46.393883
77571588100832;86;0.416086;46.617957
77571588100923;86;0.224737;46.245306
77571588100972;86;0.260882;46.417581
77571588101046;86;0.407747;46.902737
77571588101368;86;0.385069;46.857762
77571588101467;36;1.024262;46.645056
55625022300022;35;-1.517977;48.135953
77561379700700;53;-0.272532;48.343471
77561379700320;53;-1.026294;48.114635
77561379700056;53;-1.133705;47.841763
77561379700650;53;-0.934537;48.059745
77561379700247;53;-0.804085;47.91967
77561379700221;53;-0.204623;48.457369
77561379700338;53;-0.989994;48.390154
77561379700106;53;-0.554184;47.953198
77561379700254;53;-0.663174;48.194041
77561379700312;53;-0.489271;48.442119
77561379700593;53;-1.033955;48.479238
77561379700379;53;-1.031674;48.231833
77561379700122;53;-0.313496;48.238854
77561379700130;53;-0.525453;47.881523
77561379700395;53;-0.973556;48.471349
77561379700643;53;-0.713843;47.995171
77561379700098;53;-1.119057;47.971944
77561379700023;53;-0.948496;47.836347
77561379700262;53;-0.772128;47.788072
77561379700510;53;-0.856381;48.115384
77561379700346;53;-0.417197;47.932105
77561379700064;53;-0.620374;48.39965
77561379700676;53;-0.735112;48.220612
77561379700528;53;-1.047073;47.894056
55625022300097;35;-1.918056;48.636909
55625022300089;35;-1.915166;48.527967
77561379700080;53;-0.743207;48.079418
83947802100018;72;0.173398;48.034167
83950749800013;72;0.173398;48.034167
87380151800150;85;-1.429276;46.684373
42161842200131;37;0.166546;47.272493
37608048700154;29;-4.020705;47.980766
32370587100099;72;-0.097427;47.760849
47918095200067;88;6.088039;48.307236
32370587100065;37;0.223088;47.406191
32370587100081;37;0.536943;47.305914
33104646600040;85;-1.065856;46.5587
42970729202030;14;-0.59321;49.110013
77561379700189;53;-0.857857;47.962414
77561379700296;53;-0.946087;47.839149
77561379700304;53;-0.817473;48.412938
77561379700551;53;-0.674435;48.355231
77561379700601;53;-0.912853;47.901719
77561379700783;35;-1.279762;48.33997
77561379700213;53;-0.994237;48.282811
77561379700486;49;-0.872474;47.686388
77561379700361;53;-0.532205;48.144876
77561379700668;53;-0.567035;48.313274
77561379700726;53;-0.967587;48.160585
77561379700536;72;-0.29171;47.983428
77561379700171;53;-0.569081;47.945895
77561379700627;53;-0.428851;47.86712
77561379700718;53;-0.915943;48.295863
77561379700775;35;-1.191124;48.458903
77561379700239;53;-0.614776;48.287155
77561379700759;49;-0.858524;47.640765
77561379700114;53;-0.48462;47.86803
77561379700429;53;-0.816008;47.842023
77561379700585;53;-0.316752;48.362298
77561379700767;35;-1.224403;48.132272
44003984000036;92;2.245492;48.890399
30887794300842;92;2.245492;48.890399
40303581901949;49;-0.516163;47.502119
39775822800019;85;-0.734997;46.537457
32370587100073;37;0.212884;47.388591
33458122000012;49;-0.233053;47.428279
40303581901691;49;-0.409748;47.320611
40303581901048;44;-1.092784;47.483373
40303581900503;49;-1.0674;47.553461
40303581900297;44;-1.106873;47.486836
31514583900058;49;-0.825144;47.600974
42970729202055;50;-1.120796;49.090185
30853035100037;49;-1.056716;47.154206
82290912300025;75;2.312912;48.873303
38065643900128;94;2.363114;48.760014
77571588101541;79;-0.227415;47.051672
40303581901931;86;0.10309;46.426685
50153069500011;49;-1.056716;47.154206
50153069500029;44;-1.202801;47.409024
66548013300180;18;2.771627;47.302148
42970729202022;49;-0.871257;47.071521
66548013300172;44;-1.34473;47.172011
42970729202014;35;-1.323652;47.832183
41102447400024;49;-0.449339;47.354557
38149842700016;49;-0.40574;47.318165
38065643900136;29;-4.438505;48.425789
86880016000350;44;-1.231333;47.218015
38065643900086;94;2.36079;48.763201
40303581900818;49;-0.779111;47.247362
66548013300149;49;-1.239703;47.266251
66548013300131;49;-0.75482;47.40643
62632034500053;49;-0.483223;47.175576
62632034500012;79;-0.477206;46.975936
62632034500111;79;-0.150875;47.059971
62632034500095;79;-0.336858;46.925639
62632034500137;79;-0.354432;47.045561
62632034500061;86;0.006853;47.025435
62632034500079;86;-0.013369;46.768951
62632034500087;86;0.061886;46.880314
55625022300048;35;-1.504329;47.954219
55625022300055;35;-2.095366;48.004424
55625022300105;35;-1.725414;48.551073
53468670400014;75;2.284114;48.844879
53327874300018;44;-1.336933;47.17913
52164805500023;51;4.615406;48.721768
52164802200023;62;2.670656;50.486809
52164824600028;88;6.088039;48.307236
41868254800023;26;4.743147;44.517205
41063044600020;49;-0.707108;47.618758
48928962900029;49;-0.471964;47.519677
34447746800054;14;-0.881077;48.844884
34349961200020;49;-0.541314;47.484782
34288117400052;14;-0.88851;48.824043
34288117400037;35;-1.238324;48.505985
40381719000032;29;-4.2922;48.48816
40303581900362;44;-1.436697;46.973948
44295780900027;38;4.886858;45.329882
33835510000029;44;-1.499665;47.445236
47918095200042;49;-0.916377;47.028899
38907564900027;79;-0.498202;46.834501
42970729200661;49;-0.43081;47.500173
42970729201354;86;0.215793;46.855603
42970729201214;49;-0.306182;47.236754
42970729200729;49;-0.081025;47.513814
42970729201917;49;-0.244184;47.661032
42970729200042;35;-2.079165;47.771233
42970729201776;44;-1.617833;47.329703
42970729200364;44;-1.289261;47.516226
30887794300677;86;0.763354;46.73389
30887794300818;49;-0.549673;47.476523
30245160400052;79;-0.498202;46.834501
44897853600044;56;-2.718807;47.658801
35133002200010;14;-0.645847;49.0789
35126672100015;02;3.074555;49.249728
35126672100023;49;-0.349867;47.592009
06320025700069;35;-1.643507;48.098232
02555012000049;22;-2.227744;48.527895
02555012000056;22;-2.198182;48.542174
80458560200019;49;-0.106429;47.272283
42970729200646;49;-0.885971;47.264515
40303581901436;49;-0.885971;47.264515
42970729201974;53;-0.551289;47.951659
42970729201990;53;-1.036348;48.228834
42970729201958;53;-0.567035;48.313274
42970729201941;53;-0.750897;48.087921
06320058800026;49;-0.96034;47.151619
51107135900026;29;-4.484691;48.397493
40318412000109;44;-1.474973;47.437643
40318412000091;86;0.142876;46.459306
40318412000075;86;0.174785;46.967838
40318412000083;86;0.565999;46.8721
40318412000059;49;-0.181579;47.425721
40318412000067;79;-0.041598;46.419794
41025064100058;49;-0.707108;47.618758
39325413100013;29;-4.055565;48.221003
39325800900017;29;-4.055565;48.221003
30245160400060;49;-0.707108;47.618758
42970729201750;56;-2.137208;47.770853
82290912300017;45;1.911008;47.854389
38907564900035;79;-0.498309;46.837481
34447746800203;79;-0.498309;46.837481
86880016000145;49;-0.998873;47.308944
40303581901659;49;-0.438067;47.228686
40303581900925;56;-2.137208;47.770853
40303581901451;49;-0.359204;47.698846
38203699400020;16;0.235315;45.924322
77571588100550;86;0.15467;46.715063
31514583900025;49;-0.872474;47.686388
77561379700502;49;-0.926639;47.700522
55675011500025;49;-0.829406;47.689305
40303581901113;49;-0.969028;47.673939
40303581901170;49;-0.866761;47.672818
40303581901097;49;-0.458164;47.363204
40303581900537;49;-0.841301;47.707668
40303581901154;49;0.053594;47.595819
41102447400016;49;-0.420326;47.384705
42970729201081;49;0.107431;47.512561
42970729200992;49;0.149018;47.405321
42970729201073;49;0.175014;47.553781
32667392800023;49;-0.435894;47.393579
39154994600021;49;-0.543187;47.480738
39154994600013;02;3.081092;49.251522
30358795000096;86;0.22638;46.644741
55625022300071;35;-1.758784;48.149373
30863634900042;29;-4.171621;47.962665
34426663000112;50;-1.660457;49.647002
39325413100039;56;-3.361565;47.733957
31329655000087;49;-0.283838;47.615405
30750010800039;49;-0.181579;47.425721
38065643900110;22;-2.765244;48.529778
86180035700043;49;-0.711173;47.623871
66920030500037;35;-1.63463;48.098757
52164819600025;88;6.613243;48.071478
40984903100011;35;-1.520006;48.106903
40303581901915;44;-1.630156;47.355795
44295780900019;49;-0.707108;47.618758
51040823000033;29;-4.023054;48.099792
48004201900020;56;-2.362821;47.756355
30358795000070;44;-1.298583;47.249239
30358795000112;69;4.770678;45.80006
30358795000047;71;5.178458;46.652989
42200658500026;49;-0.349867;47.592009
06320025700051;85;-1.437967;46.651439
06320025700036;72;0.181827;48.010629
42970729201933;44;-1.178852;47.52059
31855788100071;49;-0.431483;47.180083
40994264600038;49;-0.356913;47.572601
31329655000079;35;-1.543509;48.133348
31329655000061;35;-1.669382;48.230983
42970729201925;44;-1.387334;47.268775
42970729200703;49;-0.169748;47.602096
40303581901162;49;-0.169748;47.602096
40303581901063;49;-0.419125;47.464208
40303581900040;44;-1.026829;47.470964
42970729201586;44;-1.939675;47.115761
48216052000011;44;-1.068984;47.436596
42161842200073;49;-0.491916;47.269346
38517977500015;44;-1.091719;47.382797
40303581901006;44;-1.939675;47.115761
31076443600021;14;0.152334;49.005907
42970729201909;85;-1.931143;46.738319
42970729201735;49;-0.710096;47.113609
42970729201883;44;-1.375356;47.288138
40303581901295;49;-0.952796;47.167434
38413540600013;86;0.363539;46.669119
40303581901337;49;-1.164695;47.137324
81540438900018;29;-4.484691;48.397493
42970729200869;49;-1.137297;47.263378
42970729201149;49;-1.001092;47.197854
40303581901246;49;-1.26755;47.336374
38413501800040;35;-1.320404;48.403688
38061975900141;22;-2.409447;48.366021
38061975900125;53;-0.777786;48.108689
38061975900117;85;-1.250886;46.89283
38061975900109;49;-0.068499;47.250645
38061975900091;44;-1.383563;47.595722
38061975900067;35;-1.366924;48.409785
38061975900042;44;-1.439277;46.967451
38061975900034;44;-1.573937;46.970158
40303581901352;49;-1.26755;47.336374
40303581901428;49;-0.860484;47.355133
30887794300362;49;-0.952796;47.167434
42970729201131;49;-1.115066;47.333673
86880016000129;49;-1.281209;47.33204
40303581900883;49;-1.190768;47.288107
42970729200638;49;-1.04567;47.260488
34426663000401;76;0.150752;49.487436
48928962900011;49;-0.707108;47.618758
49001651600018;02;3.081092;49.251522
35133002200044;14;-0.881077;48.844884
80460693700014;49;-0.106429;47.272283
80338472600011;29;-4.450488;48.432049
30249495000538;72;-0.13219;48.182021
30249495000520;72;-0.128821;48.182467
42200658500018;02;3.073325;49.247064
30249495000512;53;-0.312904;48.231253
30249495000504;53;-0.57234;48.302541
87380151800051;85;-1.432143;46.73344
86880016000343;85;-0.73121;46.658804
86880016000335;49;-0.937702;47.031554
86180035700142;79;-0.498309;46.837481
55675011500041;53;-0.248601;48.310481
34426663000195;53;-0.809363;48.071266
51107042700022;22;-2.227744;48.527895
39176072500104;40;-0.908864;43.648592
31981571800030;56;-3.283574;48.032358
31329655000053;35;-1.725938;48.105679
42462109200024;59;2.541497;50.720171
30887794300396;49;-0.286982;47.188002
37881593000029;44;-1.555925;47.200748
30249495000496;72;0.148856;48.321784
30249495000405;53;-0.465085;48.397271
37608048700097;29;-4.463156;48.387187
06320058800018;49;-0.968286;47.19253
86180035700126;49;-0.721749;47.209971
77571588100600;86;0.530131;46.520277
77571588101285;86;0.114895;46.759519
77571588100915;86;0.185253;46.378068
86180035700092;85;-0.734253;46.641584
34066456400200;56;-2.54332;47.689375
86880016000236;44;-1.582678;47.119629
30801828200043;29;-4.056843;48.219051
30887794300800;49;-0.723083;47.23619
66920030500052;53;-0.750897;48.087921
42161842200024;44;-1.269776;47.166656
40303581900545;44;-1.965894;47.420954
66920030500011;35;-1.681574;48.112369
80320377700013;29;-4.484691;48.397493
40109722500023;76;0.352987;49.733897
62632034500152;44;-1.280231;47.461887
53429528200014;24;1.216755;44.889213
34539628700012;37;0.536943;47.305914
34426663000286;14;-0.309111;49.121911
51334356600016;29;-4.454607;48.432002
34066456400127;18;2.529493;47.53172
34066456400218;84;4.856693;43.9808
34066456400176;62;3.107203;50.147387
34066456400150;86;0.323521;46.319098
34066456400135;45;2.358619;48.114973
34066456400051;56;-2.369901;47.754159
34066456400093;53;-0.739627;48.086888
34066456400077;56;-2.510974;47.813728
34060895900011;86;0.566507;46.873484
38065643900052;29;-4.454607;48.432002
38022515100030;53;-0.452329;48.401488
30358795000104;91;2.291767;48.705493
30358795000088;69;4.730218;45.764416
37608048700147;29;-4.034804;47.983425
34066456400028;29;-4.055565;48.221003
44897853600036;22;-2.763278;48.183259
40303581901899;49;-0.725362;47.62106
31669474400087;45;2.786508;47.967689
30863634900026;18;2.305297;47.559505
34426663000377;29;-4.115469;48.260234
49239880500019;49;-0.356913;47.572601
40303581901782;37;0.166546;47.272493
42970729200711;49;-0.108668;47.536573
34426663000302;22;-2.746551;48.504264
34426663000229;29;-4.293269;48.077881
34288117400011;35;-1.242221;48.50844
34066456400036;56;-2.847832;47.880642
40109722500056;27;1.254164;49.247201
43791497100084;87;1.162414;46.215537
32099178900043;86;0.363451;46.608625
38065643900094;22;-2.67881;48.487758
38022515100055;79;-0.267877;46.684915
02555012000031;22;-2.67881;48.487758
48004201900012;29;-4.055565;48.221003
30887794300461;44;-1.950109;47.357105
34426663000369;29;-4.474864;48.3856
66548013300057;44;-1.339859;47.266645
77571588100238;86;0.634153;46.572253
77571588100709;86;0.158671;46.204671
77571588100139;86;0.772526;46.508249
77571588100717;86;0.40928;46.372237
42970729201677;49;-0.713572;47.627568
52210180700017;29;-4.467546;48.430282
34426663000153;22;-3.460196;48.724853
34426663000344;29;-4.487647;48.381763
51107135900018;29;-4.454607;48.432002
31364338900023;62;3.107203;50.147387
30970721400115;56;-2.772142;47.680961
32153770600020;91;2.375726;48.435833
44897853600051;29;-4.067489;48.50023
41868254800015;26;4.746062;44.535615
41025064100017;85;-0.894003;46.958306
34066456400119;18;2.283755;46.642042
32099178900035;44;-1.474829;47.295886
32099178900019;49;-0.633872;47.475089
32099178900027;49;-0.758999;47.406904
31909964400084;49;-0.71497;47.624496
30887794300479;44;-2.058402;47.403594
30887794300107;49;-0.725362;47.62106
30887794300099;49;-0.548409;47.477757
30249495000371;53;-0.333617;48.384927
30245160400011;85;-0.894003;46.958306
30107363100030;35;-1.727957;48.102966
30107363100063;19;1.494695;45.184229
30107363100048;31;1.408291;43.710095
40303581900230;44;-1.406274;47.750143
39176072500096;40;-0.910331;43.802271
30245160400037;18;2.964061;46.831671
30245160400045;85;-0.881275;46.943054
42970729201859;17;-0.931609;45.973353
38065643900060;84;4.840012;43.938904
31364338900049;62;2.864047;50.102658
30249495000454;53;-0.564634;48.345853
30249495000447;53;-0.346293;48.494924
49076442000017;66;2.920982;42.541546
62632034500160;86;0.211038;46.91826
37842972400032;87;0.759534;45.707759
37798828200036;30;4.024857;44.102172
34426663000245;29;-4.460573;48.418155
34426663000294;72;0.32229;48.008736
34426663000252;29;-4.455684;48.429944
34426663000039;29;-4.460437;48.417618
31981571800048;79;-0.202237;46.991819
31981571800055;37;0.272178;47.178537
31004661000047;26;5.003938;44.739175
30970721400065;79;-0.586361;46.934821
30970721400149;56;-3.077711;47.867917
30887794300149;49;-0.244184;47.661032
30116925600015;30;4.025952;44.10332
44897853600077;29;-3.983449;48.220594
43791497100167;87;1.353791;46.173877
43791497100100;86;0.516105;46.173005
43791497100092;86;0.393646;46.184678
30887794300420;44;-2.413545;47.325769
31669474400061;56;-2.649842;47.70673
30124090900038;44;-1.271086;47.161257
40303581900990;44;-1.597538;46.9928
40303581901618;86;0.021472;47.066576
40303581900958;56;-2.13246;47.767216
40303581900206;44;-1.380151;47.624531
40303581900156;44;-1.328624;47.589483
30970721400024;79;-0.23621;46.644902
30249495000389;53;-0.312032;48.422735
86880016000269;44;-1.273292;47.164809
50001490700017;35;-1.597307;48.013108
34066456400143;63;3.177121;46.031614
33372278300029;86;0.153358;47.008499
30887794300495;49;-1.174647;47.742149
30124090900020;44;-1.272467;47.165198
39176072500054;45;1.679683;47.980677
39176072500047;17;-0.648328;45.752492
77571588100592;86;-0.010625;46.478558
77571588100469;86;0.767411;46.848418
77571588100824;86;0.461043;46.495786
77571588100634;86;1.034907;46.475303
77571588100543;86;0.236187;46.606236
77571588100840;86;0.302022;46.623658
77571588100774;86;0.035786;46.362203
77571588100980;86;0.169658;46.646481
77571588100758;86;0.257629;46.418094
86180035700134;79;-0.13621;46.398387
51805352500011;35;-1.517977;48.135953
31805273500012;37;0.699483;47.392647
77561379700437;53;-0.969191;48.164675
77561379700148;53;-0.933068;48.305918
77561379700197;53;-0.283361;48.339686
77561379700031;35;-1.131541;47.986676
34426663000310;29;-4.463102;48.419077
51107270400014;29;-4.235186;48.452252
87380151800127;44;-2.062711;47.425664
54605022000013;85;-0.640624;46.547968
42161842200040;49;-0.604165;47.317485
38203699400046;97;55.445591;-20.877849
35057367100012;44;-1.383563;47.595722
32232444300025;62;2.823649;50.452039
30887794300164;49;0.160434;47.437296
06620009800045;95;2.174079;49.019617
40303581900594;44;-1.769361;47.420297
34426663000146;56;-3.362484;47.733035
34066456400192;56;-2.791666;47.670504
77571588100766;86;0.521762;46.475257
86880016000053;44;-1.37441;47.475746
40303581901030;49;-0.533048;47.432454
34082112300049;49;-0.711173;47.623871
66548013300040;37;0.77516;47.410287
34917212200021;44;-1.555925;47.200748
40303581900222;44;-1.288501;47.515993
40303581900123;44;-1.450855;47.62607
30970721400057;44;-1.488679;47.116923
48855648100015;35;-1.597307;48.013108
40303581901840;79;-0.61676;46.632043
40109722500015;76;0.189809;49.526753
33104646600016;85;-0.734997;46.537457
32667392800015;49;0.116717;47.509205
42497962300024;49;-0.541314;47.484782
30887794300628;86;0.507903;46.559707
38065643900037;94;2.36021;48.749128
40303581901816;35;-1.392465;47.912609
30249495000306;53;-0.580334;48.349751
38065643900078;35;-1.624637;48.098415
62632034500178;86;0.175948;47.011101
34066456400044;56;-2.287256;47.67505
31004661000062;13;5.38743;43.315612
32313988100029;49;-0.10477;47.270698
42970729201420;86;0.284001;46.833653
40303581900776;79;-0.59712;46.949882
40303581901303;49;-0.729416;47.220092
40303581900743;35;-2.079374;47.774305
40303581901766;37;0.32097;47.442596
86880016000079;44;-1.231746;47.433251
45344023200024;49;-0.707108;47.618758
77571588100048;86;0.822031;46.78277
77561379700072;53;-0.886826;48.176612
77561379700387;53;-0.753955;48.18569
77561379700445;53;-0.249736;48.305205
77561379700619;53;-1.049398;47.965954
77561379700049;53;-0.870608;48.021071
66548013300099;49;-0.205586;47.136291
62632034500129;86;-0.016782;46.826513
42970729200380;44;-1.328624;47.589483
42970729200950;49;-0.610576;47.037058
42970729201388;86;-0.044733;47.070361
42970729201446;86;0.008937;46.975973
42970729200109;37;0.32097;47.442596
42970729200208;44;-2.062711;47.425664
42970729200331;44;-1.501003;47.447075
42970729200406;44;-1.380151;47.624531
42970729200554;44;-1.709646;47.156951
42970729200679;49;-0.533048;47.432454
42970729201164;49;-0.975079;47.310123
42970729201370;86;0.179239;46.786787
42970729200356;44;-1.374107;47.235454
42970729201495;86;0.472409;46.911776
42970729201594;44;-1.687477;46.899309
42970729200398;44;-1.452403;47.624648
42970729200612;49;-0.549442;47.47637
42970729200893;49;-0.908395;47.086055
42970729201271;79;-0.48779;47.028032
42970729201545;44;-1.597538;46.9928
42970729200034;49;-0.541314;47.484782
42970729200125;37;0.251781;47.163854
42970729200422;44;-2.04514;47.519208
42970729201032;49;-1.047259;47.638209
42970729201255;79;-0.117945;46.990919
42970729201347;86;0.61659;46.78524
42970729201362;86;0.025335;46.773035
42970729201438;86;0.08134;47.015872
42970729201552;44;-2.026213;47.20924
42970729200067;37;0.319175;47.060314
42970729200240;44;-1.729246;47.245731
42970729200885;49;-0.868369;47.072588
42970729201263;79;-0.198837;46.982807
42970729201404;86;-0.091948;47.056247
42970729201453;86;-0.008913;46.995617
42970729201479;86;0.580045;46.67931
42970729200315;44;-2.414391;47.326453
42970729200562;44;-1.965894;47.420954
42970729200133;37;0.272033;47.180017
42970729200455;44;-1.122013;47.542763
42970729200513;44;-1.406274;47.750143
42970729201396;86;0.079833;47.130658
42970729201503;86;0.348415;46.905288
42970729201560;44;-1.860182;47.101782
42970729201610;44;-2.102202;47.117431
42970729200463;44;-2.159844;47.318289
42970729201289;79;-0.61676;46.632043
42970729201412;86;0.021472;47.066576
42970729201511;86;0.26208;46.896962
42970729201602;44;-2.127871;47.150813
42970729200182;44;-1.51453;47.061714
35133002200036;75;2.321676;48.839456
34911366200036;71;4.872926;46.389268
44429095100029;44;-1.202801;47.409024
37881593000037;44;-1.373981;47.261669
37608048700089;17;-1.202577;46.155094
37608048700121;29;-3.670446;47.910978
31669474400053;29;-3.969504;48.225409
31669474400038;35;-1.729941;47.918173
31514583900041;53;-0.684615;47.748191
40303581900321;44;-1.617833;47.329703
40303581900826;49;-0.868369;47.072588
40303581901634;49;-0.021717;47.301755
40303581901667;49;-0.121009;47.114786
40303581900578;44;-1.756263;47.479715
40303581901329;49;-0.979642;47.213484
40303581901253;49;-0.710096;47.113609
40303581901477;86;0.566753;46.873069
40303581900313;44;-1.592659;47.72792
40303581900487;49;-0.823141;47.602828
40303581900644;44;-2.32698;47.443301
40303581900784;79;-0.460984;46.85178
40303581900982;44;-2.102202;47.117431
40303581901535;86;0.40595;46.925673
40303581901600;86;0.179239;46.786787
40303581900685;79;-0.760326;46.924862
40303581900792;79;-0.48779;47.028032
40303581901360;79;-0.232973;46.88863
40303581901584;86;0.491869;46.757837
40303581901626;49;-0.226298;47.139123
40303581900271;44;-1.709646;47.156951
40303581900461;49;-0.713572;47.627568
40303581900552;44;-1.729246;47.245731
40303581900560;44;-1.716405;47.382249
40303581901493;86;0.61659;46.78524
40303581901568;86;0.328715;46.820666
40303581901758;37;0.785117;46.858465
40303581900636;44;-2.413545;47.325769
40303581900941;44;-2.058402;47.403594
40303581901394;79;-0.117711;46.995523
40303581901485;86;0.563873;46.684985
40303581901543;86;-0.031942;47.086136
40303581901725;37;0.429023;47.041899
40303581901105;49;-0.887092;47.524615
40303581901402;79;-0.056214;46.78666
40303581901576;86;0.08134;47.015872
40303581900115;44;-1.51453;47.061714
40303581900172;44;-1.549992;46.880742
40303581900248;44;-1.730657;46.941917
40303581900081;44;-1.285379;47.080546
30970721400081;72;0.082906;47.696738
30887794300370;49;-0.518237;47.504253
30801828200019;29;-4.094292;48.213541
30249495000124;53;-0.775397;47.782732
30249495000256;53;-0.581002;48.015507
30249495000140;72;-0.201372;47.842712
30185935100043;29;-4.448154;48.431629
31909964400035;44;-1.501003;47.447075
47874746200016;49;-0.543187;47.480738
40303581900446;49;-1.047259;47.638209
40303581901022;49;-0.926265;47.408413
40303581900339;44;-1.275631;47.162172
30887794300594;44;-2.119736;47.127007
87380151800101;49;-0.074567;47.271367
66548013300016;49;-0.10477;47.270698
38413501800024;44;-1.280231;47.461887
34459235700059;49;-0.868125;47.072985
34426663000104;14;-0.3095;49.155649
40303581900032;44;-1.939675;47.115761
41025064100041;44;-1.555925;47.200748
40303581901741;37;0.269986;47.180065
43791497100068;86;0.294314;46.147216
30750010800021;83;6.74558;43.432582
40303581901212;49;-1.174647;47.742149
42970729200299;44;-1.936285;47.12025
87380151800085;44;-1.457207;47.286268
86880016000186;44;-1.604582;46.885374
86880016000152;44;-1.760612;46.969785
54605022000021;85;-0.768166;46.62731
47918095200018;75;2.37292;48.843838
40994264600020;49;-0.605965;47.477436
40381719000024;29;-4.282834;48.486462
40303581900354;44;-1.703304;47.553316
40303581900701;35;-1.365061;47.894006
40303581901014;49;-0.317176;47.50118
40303581901055;79;-0.198837;46.982807
40303581901089;49;-0.429991;47.501924
40303581900099;44;-1.293169;47.391325
40303581901527;86;0.174785;46.967838
40303581901733;37;0.491461;46.983048
40303581900420;49;-0.864425;47.41705
40303581900917;44;-1.386373;47.096957
40303581901279;49;-0.746065;47.008278
40303581901675;49;-0.253671;47.182671
40303581901709;37;0.319503;47.015354
40303581901410;79;-0.138072;46.884047
40303581901519;86;0.408006;46.903955
40303581900024;44;-1.529568;47.553976
40303581900065;44;-1.55398;47.375611
40303581900131;44;-1.41358;47.49572
40303581901220;49;-0.252671;47.573029
40303581901444;49;-0.632759;47.302102
40303581900347;44;-1.028738;47.388993
40303581900859;49;-0.860484;47.355133
40303581901071;49;-0.991178;47.75623
40303581901139;49;-0.309103;47.486393
40303581901501;86;0.258051;46.8684
40303581901550;86;0.007761;46.97727
40303581901717;37;0.42425;47.114923
40303581900164;44;-1.374107;47.235454
40303581901204;49;-0.465606;47.620598
40303581901378;79;-0.144466;46.810497
40303581900180;44;-1.501003;47.447075
39176072500062;64;-1.557875;43.480095
38031761000026;49;-0.605965;47.477436
37881593000045;44;-1.552136;47.203586
34426663000179;76;0.129743;49.484435
34426663000054;29;-4.01288;47.978255
34426663000096;22;-3.157684;48.548174
34066456400168;01;5.154044;46.455299
34066456400184;62;2.864047;50.102658
34066456400069;56;-2.776898;47.66108
33053347200032;44;-1.179245;47.526147
30970721400123;89;3.701514;48.083473
30970721400099;44;-1.179245;47.526147
30887794300404;49;-0.220843;47.675469
30537565100075;56;-2.719532;47.656591
06620009800060;44;-1.179245;47.526147
66548013300081;49;-0.102707;47.268162
43224848200015;49;-0.537141;47.38782
34459235700026;79;-0.59712;46.949882
32740940500013;49;-0.564046;47.367486
30887794300172;49;-0.41766;47.737357
30887794300115;49;-0.357419;47.572685
06620009800052;95;2.174079;49.019617
86880016000103;44;-1.343063;47.416573
77561379700155;53;-1.118233;47.809569
77561379700569;53;-0.568167;48.414947
77571588100485;86;1.08398;46.509163
77571588100675;87;1.081144;46.220735
40994264600012;49;-0.543187;47.480738
87380151800077;44;-2.078451;47.433394
34757035000020;44;-1.756263;47.479715
34198573700012;14;-0.347774;49.183595
31855788100055;75;2.322897;48.843655
31364338900015;62;3.109245;50.144726
86980234800019;44;-1.283361;47.088759
77571588100444;86;0.68481;46.231521
77571588100667;86;1.174295;46.438655
77571588100899;86;0.18388;46.480168
38332052000018;85;-0.837634;46.782808
35230370500011;49;-0.996386;47.207942
34426663000088;56;-3.362335;47.735727
34426663000138;44;-1.499218;47.25431
31909964400027;44;-1.372871;47.624063
30537565100059;56;-2.766534;47.663718
30591845000027;35;-1.367697;47.949109
66548013300065;49;-0.276674;47.189576
30887794300271;49;-1.166282;47.746964
37608048700113;22;-3.254202;48.600259
40303581900602;44;-2.088744;47.435619
31329655000012;95;2.071936;49.052211
86880016000020;44;-1.45582;47.395709
77571588100170;86;0.956304;46.33694
77571588100436;86;0.27802;46.837574
77571588100618;86;0.933274;46.557567
33431548800034;79;-0.578698;46.929168
02555012000023;75;2.387019;48.830508
39426084800012;86;0.353644;46.627971
30887794300388;49;-0.984447;47.2085
77561379700577;53;-0.087692;48.404041
77571588100212;86;0.059931;46.916304
34896142600015;72;-0.016344;47.71792
34426663000211;56;-3.359495;47.737267
34082112300015;44;-1.481634;47.187338
32313988100011;49;-0.138;47.290844
35133002200028;14;-0.327216;49.178192
30537565100042;44;-2.347579;47.434088
06620009800011;49;-0.931114;47.084472
34349961200012;49;-0.895143;46.99551
34426663000161;53;-0.744382;48.079726
34459235700018;85;-1.932788;46.693632
34066456400101;29;-3.569165;48.277285
31855788100063;61;0.092833;48.446459
31364338900031;62;2.099556;50.378852
38065643900045;22;-2.203434;48.54283
77561379700544;53;-0.64527;48.278064
77571588100477;86;0.597954;46.436023
77571588100584;86;0.018873;46.473275
30537565100067;51;4.018058;49.258435
30801828200035;56;-2.649842;47.70673
38413501800032;49;-0.107769;47.380829
37608048700071;29;-3.99055;48.098505
86880016000046;44;-1.411038;47.37489
39044295200029;56;-2.667763;47.699416
77561379700635;53;-0.799602;48.217653
77571588100527;86;0.243125;46.680589
77571588100683;87;1.084674;46.129894
41025064100025;44;-1.558406;47.19462
31855788100014;72;0.444895;48.14013
30537565100034;56;-2.762871;47.662933
30185935100035;61;0.426439;48.734004
66548013300073;49;-0.27966;47.113058
38022515100014;85;-0.894003;46.958306
34426663000120;44;-1.508457;47.259238
41436387900019;02;3.920413;50.005554
87380151800069;85;-1.865009;46.841803
78609585100055;28;1.771766;48.461313
77571588100626;36;1.024262;46.645056
38065643900011;29;-4.235186;48.452252
66548013300032;41;1.116147;47.334024
38031761000018;49;-0.542559;47.460076
77571588100220;86;0.637823;46.505273
77571588100360;36;0.954218;46.7339
77571588100576;86;0.876741;46.415569
77571588100733;86;0.357951;46.279358
30591845000019;35;-1.317282;47.831519
30591845000035;35;-1.365;47.949527
31030692300015;37;0.185657;47.40293
34895081700026;79;-0.59712;46.949882
33372278300045;79;-0.499062;46.692429
31329655000020;35;-1.725848;48.104939
30591845000043;35;-1.232652;47.943735
43791497100019;79;-0.200292;47.000007
34911366200010;69;4.822277;45.752543
35029959000017;59;3.190429;50.141533
34426663000187;56;-3.369901;47.732045
33431548800026;79;-0.590913;46.938911
33431548800042;79;-0.596015;46.954203
40303581900073;44;-1.383448;47.717656
40303581900693;35;-1.688766;47.840113
87380151800028;44;-2.091164;47.398564
87380151800044;85;-0.954358;46.991408
05720093300026;49;-0.628586;47.474238
38279049100015;51;4.15203;49.303903
39176072500021;40;-0.80755;43.655261
78609585100048;28;1.625217;48.271644
77571588100790;86;0.000483;46.439988
34426663000047;22;-3.452588;48.733138
34066456400085;84;4.753093;44.298304
34171386500010;86;0.636854;46.500759
31855788100048;45;1.925639;47.943021
30970721400032;85;-1.932788;46.693632
40303581900511;49;-0.979074;47.61744
31329655000046;95;2.071011;49.052466
