<?xml version="1.0" encoding="UTF-8"?>
<svg width="63px" height="55px" viewBox="0 0 63 55" version="1.1" xmlns="http://www.w3.org/2000/svg" xmlns:xlink="http://www.w3.org/1999/xlink">
    <!-- Generator: Sketch 51.3 (57544) - http://www.bohemiancoding.com/sketch -->
    <title>Page 1</title>
    <desc>Created with Sketch.</desc>
    <defs></defs>
    <g id="HP" stroke="none" stroke-width="1" fill="none" fill-rule="evenodd">
        <g transform="translate(-574.000000, -755.000000)" fill="#FFFFFF" id="CONTENU">
            <g transform="translate(0.000000, 599.000000)">
                <g id="01.Notre-Approche---BLEU">
                    <g id="Group-10" transform="translate(495.000000, 130.000000)">
                        <path d="M90.3386288,31.1579504 L90.3386288,26 L87.8189335,26 L87.8189335,31.1579504 C82.853034,31.7972762 79,36.2183765 79,41.4846872 C79,46.7401618 82.853034,51.1612621 87.8189335,51.8005879 L87.8189335,80.180151 L90.3386288,80.180151 L90.3386288,51.8005879 C95.3045283,51.1612621 99.1575623,46.7401618 99.1575623,41.4846872 C99.1575623,36.2183765 95.3045283,31.7972762 90.3386288,31.1579504 M89.0787812,49.2216127 C84.9107852,49.2216127 81.5196953,45.743247 81.5196953,41.4846872 C81.5196953,37.2152913 84.9107852,33.7369256 89.0787812,33.7369256 C93.2467771,33.7369256 96.637867,37.2152913 96.637867,41.4846872 C96.637867,45.743247 93.2467771,49.2216127 89.0787812,49.2216127 M111.756039,53.0900755 L111.756039,26 L109.236343,26 L109.236343,53.0900755 C104.259945,53.7185653 100.406911,58.1396656 100.406911,63.4059763 C100.406911,68.672287 104.259945,73.1042233 109.236343,73.7327131 L109.236343,80.180151 L111.756039,80.180151 L111.756039,73.7327131 C116.721938,73.0825513 120.574972,68.6614509 120.574972,63.4059763 C120.574972,58.1505016 116.721938,53.7294013 111.756039,53.0900755 M110.496191,71.1537379 C106.328195,71.1537379 102.926607,67.6753722 102.926607,63.4059763 C102.926607,59.1365804 106.328195,55.6690507 110.496191,55.6690507 C114.664187,55.6690507 118.055277,59.1474164 118.055277,63.4059763 C118.055277,67.6753722 114.664187,71.1537379 110.496191,71.1537379 M133.173449,41.4846872 L133.173449,26 L130.653753,26 L130.653753,41.4846872 C125.687854,42.1131769 121.83482,46.5342772 121.83482,51.8005879 C121.83482,57.0668986 125.687854,61.4879989 130.653753,62.1164887 L130.653753,80.180151 L133.173449,80.180151 L133.173449,62.1164887 C138.139348,61.4879989 141.992382,57.0668986 141.992382,51.8005879 C141.992382,46.5342772 138.139348,42.1131769 133.173449,41.4846872 M131.913601,59.5375135 C127.745605,59.5375135 124.354515,56.0699838 124.354515,51.8005879 C124.354515,47.531192 127.745605,44.0636624 131.913601,44.0636624 C136.081597,44.0636624 139.472687,47.531192 139.472687,51.8005879 C139.472687,56.0699838 136.081597,59.5375135 131.913601,59.5375135" id="Page-1"></path>
                    </g>
                </g>
            </g>
        </g>
    </g>
</svg>