<?xml version="1.0" encoding="UTF-8"?>
<svg width="60px" height="66px" viewBox="0 0 60 66" version="1.1" xmlns="http://www.w3.org/2000/svg" xmlns:xlink="http://www.w3.org/1999/xlink">
    <!-- Generator: Sketch 51.3 (57544) - http://www.bohemiancoding.com/sketch -->
    <title>Page 1</title>
    <desc>Created with Sketch.</desc>
    <defs></defs>
    <g id="HP" stroke="none" stroke-width="1" fill="none" fill-rule="evenodd">
        <g transform="translate(-805.000000, -749.000000)" fill="#FFFFFF" id="CONTENU">
            <g transform="translate(0.000000, 599.000000)">
                <g id="01.Notre-Approche---BLEU">
                    <g id="Group-11" transform="translate(722.000000, 130.000000)">
                        <path d="M93.2285535,20 L83,54.9773012 L111.694427,54.9773012 L111.694427,83.2267068 L105.175955,83.2267068 L105.175955,85.9217428 L120.824045,85.9217428 L120.824045,83.2267068 L114.305573,83.2267068 L114.305573,54.9773012 L128.657483,54.9773012 L128.657483,73.8134697 L131.259236,73.8134697 L131.259236,54.9773012 L143,54.9773012 L132.771446,20 L93.2285535,20 Z M95.1634314,22.695036 L130.836569,22.695036 L139.487163,52.292929 L86.503444,52.292929 L95.1634314,22.695036 Z" id="Page-1"></path>
                    </g>
                </g>
            </g>
        </g>
    </g>
</svg>