<?xml version="1.0" encoding="UTF-8"?>
<svg width="61px" height="63px" viewBox="0 0 61 63" version="1.1" xmlns="http://www.w3.org/2000/svg" xmlns:xlink="http://www.w3.org/1999/xlink">
    <!-- Generator: Sketch 51.3 (57544) - http://www.bohemiancoding.com/sketch -->
    <title>Page 1</title>
    <desc>Created with Sketch.</desc>
    <defs></defs>
    <g id="HP" stroke="none" stroke-width="1" fill="none" fill-rule="evenodd">
        <g transform="translate(-114.000000, -751.000000)" fill="#FFFFFF" id="CONTENU">
            <g transform="translate(0.000000, 599.000000)">
                <g id="01.Notre-Approche---BLEU">
                    <g id="Group-9" transform="translate(35.000000, 130.000000)">
                        <path d="M108.861897,22 L97.1700547,35.3955831 L99.7657768,36.7351415 L107.552943,27.3582333 L107.552943,44.7724913 L110.159758,44.7724913 L110.159758,27.3582333 L117.946924,36.7351415 L120.542647,35.3955831 L108.861897,22 Z M125.734091,44.7724913 L134.819118,52.8098412 L117.946924,52.8098412 L117.946924,55.5004071 L134.819118,55.5004071 L125.734091,63.537757 L127.031952,66.2168736 L140.010562,54.1608488 L127.031952,42.0933747 L125.734091,44.7724913 Z M79,54.1608488 L91.9786105,66.2168736 L93.2764716,63.537757 L84.1914442,55.5004071 L101.063638,55.5004071 L101.063638,52.8098412 L84.1914442,52.8098412 L93.2764716,44.7724913 L91.9786105,42.0933747 L79,54.1608488 Z M107.552943,62.1981987 L107.552943,79.6124567 L99.7657768,70.2355485 L97.1700547,71.5751069 L108.861897,84.97069 L120.542647,71.5751069 L117.946924,70.2355485 L110.159758,79.6124567 L110.159758,62.1981987 L107.552943,62.1981987 Z" id="Page-1"></path>
                    </g>
                </g>
            </g>
        </g>
    </g>
</svg>