; GCODE Generated by cam.openbuilds.com on 2020-09-02 
G21 ; mm-mode
G54; Work Coordinates
G21; mm-mode
G90; Absolute Positioning
M3 S1000; Spindle On

; Operation 0: CNC: Vector (path inside)
; Tool Diameter: 3
; Starting inflateGrp: Closed?:true

G0 Z10
G0 F1000 X130.4098 Y109.0109

G0 Z0
G1 F300 Z-1.5000
G1 F1000 X130.7570 Y109.2429 Z-1.5000 S1000
G1 F1000 X130.9890 Y109.5901 Z-1.5000 S1000
G1 F1000 X131.0705 Y110.0000 Z-1.5000 S1000
G1 F1000 X130.9890 Y110.4099 Z-1.5000 S1000
G1 F1000 X130.7570 Y110.7571 Z-1.5000 S1000
G1 F1000 X130.4098 Y110.9891 Z-1.5000 S1000
G1 F1000 X129.9999 Y111.0706 Z-1.5000 S1000
G1 F1000 X129.5901 Y110.9891 Z-1.5000 S1000
G1 F1000 X129.2429 Y110.7571 Z-1.5000 S1000
G1 F1000 X129.0109 Y110.4099 Z-1.5000 S1000
G1 F1000 X128.9294 Y110.0000 Z-1.5000 S1000
G1 F1000 X129.0109 Y109.5901 Z-1.5000 S1000
G1 F1000 X129.2429 Y109.2429 Z-1.5000 S1000
G1 F1000 X129.5901 Y109.0109 Z-1.5000 S1000
G1 F1000 X129.9999 Y108.9294 Z-1.5000 S1000
G1 F1000 X130.4098 Y109.0109 Z-1.5000 S1000
; Starting inflateGrp: Closed?:true
G1 F300 Z-3.0000
G1 F1000 X130.7570 Y109.2429 Z-3.0000 S1000
G1 F1000 X130.9890 Y109.5901 Z-3.0000 S1000
G1 F1000 X131.0705 Y110.0000 Z-3.0000 S1000
G1 F1000 X130.9890 Y110.4099 Z-3.0000 S1000
G1 F1000 X130.7570 Y110.7571 Z-3.0000 S1000
G1 F1000 X130.4098 Y110.9891 Z-3.0000 S1000
G1 F1000 X129.9999 Y111.0706 Z-3.0000 S1000
G1 F1000 X129.5901 Y110.9891 Z-3.0000 S1000
G1 F1000 X129.2429 Y110.7571 Z-3.0000 S1000
G1 F1000 X129.0109 Y110.4099 Z-3.0000 S1000
G1 F1000 X128.9294 Y110.0000 Z-3.0000 S1000
G1 F1000 X129.0109 Y109.5901 Z-3.0000 S1000
G1 F1000 X129.2429 Y109.2429 Z-3.0000 S1000
G1 F1000 X129.5901 Y109.0109 Z-3.0000 S1000
G1 F1000 X129.9999 Y108.9294 Z-3.0000 S1000
G1 F1000 X130.4098 Y109.0109 Z-3.0000 S1000
; Starting inflateGrp: Closed?:true
G1 F300 Z-4.5000
G1 F1000 X130.7570 Y109.2429 Z-4.5000 S1000
G1 F1000 X130.9890 Y109.5901 Z-4.5000 S1000
G1 F1000 X131.0705 Y110.0000 Z-4.5000 S1000
G1 F1000 X130.9890 Y110.4099 Z-4.5000 S1000
G1 F1000 X130.7570 Y110.7571 Z-4.5000 S1000
G1 F1000 X130.4098 Y110.9891 Z-4.5000 S1000
G1 F1000 X129.9999 Y111.0706 Z-4.5000 S1000
G1 F1000 X129.5901 Y110.9891 Z-4.5000 S1000
G1 F1000 X129.2429 Y110.7571 Z-4.5000 S1000
G1 F1000 X129.0109 Y110.4099 Z-4.5000 S1000
G1 F1000 X128.9294 Y110.0000 Z-4.5000 S1000
G1 F1000 X129.0109 Y109.5901 Z-4.5000 S1000
G1 F1000 X129.2429 Y109.2429 Z-4.5000 S1000
G1 F1000 X129.5901 Y109.0109 Z-4.5000 S1000
G1 F1000 X129.9999 Y108.9294 Z-4.5000 S1000
G1 F1000 X130.4098 Y109.0109 Z-4.5000 S1000
; Starting inflateGrp: Closed?:true
G1 F300 Z-6.0000
G1 F1000 X130.7570 Y109.2429 Z-6.0000 S1000
G1 F1000 X130.9890 Y109.5901 Z-6.0000 S1000
G1 F1000 X131.0705 Y110.0000 Z-6.0000 S1000
G1 F1000 X130.9890 Y110.4099 Z-6.0000 S1000
G1 F1000 X130.7570 Y110.7571 Z-6.0000 S1000
G1 F1000 X130.4098 Y110.9891 Z-6.0000 S1000
G1 F1000 X129.9999 Y111.0706 Z-6.0000 S1000
G1 F1000 X129.5901 Y110.9891 Z-6.0000 S1000
G1 F1000 X129.2429 Y110.7571 Z-6.0000 S1000
G1 F1000 X129.0109 Y110.4099 Z-6.0000 S1000
G1 F1000 X128.9294 Y110.0000 Z-6.0000 S1000
G1 F1000 X129.0109 Y109.5901 Z-6.0000 S1000
G1 F1000 X129.2429 Y109.2429 Z-6.0000 S1000
G1 F1000 X129.5901 Y109.0109 Z-6.0000 S1000
G1 F1000 X129.9999 Y108.9294 Z-6.0000 S1000
G1 F1000 X130.4098 Y109.0109 Z-6.0000 S1000
; Starting inflateGrp: Closed?:true
G1 F300 Z-7.5000
G1 F1000 X130.7570 Y109.2429 Z-7.5000 S1000
G1 F1000 X130.9890 Y109.5901 Z-7.5000 S1000
G1 F1000 X131.0705 Y110.0000 Z-7.5000 S1000
G1 F1000 X130.9890 Y110.4099 Z-7.5000 S1000
G1 F1000 X130.7570 Y110.7571 Z-7.5000 S1000
G1 F1000 X130.4098 Y110.9891 Z-7.5000 S1000
G1 F1000 X129.9999 Y111.0706 Z-7.5000 S1000
G1 F1000 X129.5901 Y110.9891 Z-7.5000 S1000
G1 F1000 X129.2429 Y110.7571 Z-7.5000 S1000
G1 F1000 X129.0109 Y110.4099 Z-7.5000 S1000
G1 F1000 X128.9294 Y110.0000 Z-7.5000 S1000
G1 F1000 X129.0109 Y109.5901 Z-7.5000 S1000
G1 F1000 X129.2429 Y109.2429 Z-7.5000 S1000
G1 F1000 X129.5901 Y109.0109 Z-7.5000 S1000
G1 F1000 X129.9999 Y108.9294 Z-7.5000 S1000
G1 F1000 X130.4098 Y109.0109 Z-7.5000 S1000
; Starting inflateGrp: Closed?:true
G1 F300 Z-9.0000
G1 F1000 X130.7570 Y109.2429 Z-9.0000 S1000
G1 F1000 X130.9890 Y109.5901 Z-9.0000 S1000
G1 F1000 X131.0705 Y110.0000 Z-9.0000 S1000
G1 F1000 X130.9890 Y110.4099 Z-9.0000 S1000
G1 F1000 X130.7570 Y110.7571 Z-9.0000 S1000
G1 F1000 X130.4098 Y110.9891 Z-9.0000 S1000
G1 F1000 X129.9999 Y111.0706 Z-9.0000 S1000
G1 F1000 X129.5901 Y110.9891 Z-9.0000 S1000
G1 F1000 X129.2429 Y110.7571 Z-9.0000 S1000
G1 F1000 X129.0109 Y110.4099 Z-9.0000 S1000
G1 F1000 X128.9294 Y110.0000 Z-9.0000 S1000
G1 F1000 X129.0109 Y109.5901 Z-9.0000 S1000
G1 F1000 X129.2429 Y109.2429 Z-9.0000 S1000
G1 F1000 X129.5901 Y109.0109 Z-9.0000 S1000
G1 F1000 X129.9999 Y108.9294 Z-9.0000 S1000
G1 F1000 X130.4098 Y109.0109 Z-9.0000 S1000
; Starting inflateGrp: Closed?:true
G1 F300 Z-10.5000
G1 F1000 X130.7570 Y109.2429 Z-10.5000 S1000
G1 F1000 X130.9890 Y109.5901 Z-10.5000 S1000
G1 F1000 X131.0705 Y110.0000 Z-10.5000 S1000
G1 F1000 X130.9890 Y110.4099 Z-10.5000 S1000
G1 F1000 X130.7570 Y110.7571 Z-10.5000 S1000
G1 F1000 X130.4098 Y110.9891 Z-10.5000 S1000
G1 F1000 X129.9999 Y111.0706 Z-10.5000 S1000
G1 F1000 X129.5901 Y110.9891 Z-10.5000 S1000
G1 F1000 X129.2429 Y110.7571 Z-10.5000 S1000
G1 F1000 X129.0109 Y110.4099 Z-10.5000 S1000
G1 F1000 X128.9294 Y110.0000 Z-10.5000 S1000
G1 F1000 X129.0109 Y109.5901 Z-10.5000 S1000
G1 F1000 X129.2429 Y109.2429 Z-10.5000 S1000
G1 F1000 X129.5901 Y109.0109 Z-10.5000 S1000
G1 F1000 X129.9999 Y108.9294 Z-10.5000 S1000
G1 F1000 X130.4098 Y109.0109 Z-10.5000 S1000
; Starting inflateGrp: Closed?:true
G1 F300 Z-12.0000
G1 F1000 X130.7570 Y109.2429 Z-12.0000 S1000
G1 F1000 X130.9890 Y109.5901 Z-12.0000 S1000
G1 F1000 X131.0705 Y110.0000 Z-12.0000 S1000
G1 F1000 X130.9890 Y110.4099 Z-12.0000 S1000
G1 F1000 X130.7570 Y110.7571 Z-12.0000 S1000
G1 F1000 X130.4098 Y110.9891 Z-12.0000 S1000
G1 F1000 X129.9999 Y111.0706 Z-12.0000 S1000
G1 F1000 X129.5901 Y110.9891 Z-12.0000 S1000
G1 F1000 X129.2429 Y110.7571 Z-12.0000 S1000
G1 F1000 X129.0109 Y110.4099 Z-12.0000 S1000
G1 F1000 X128.9294 Y110.0000 Z-12.0000 S1000
G1 F1000 X129.0109 Y109.5901 Z-12.0000 S1000
G1 F1000 X129.2429 Y109.2429 Z-12.0000 S1000
G1 F1000 X129.5901 Y109.0109 Z-12.0000 S1000
G1 F1000 X129.9999 Y108.9294 Z-12.0000 S1000
G1 F1000 X130.4098 Y109.0109 Z-12.0000 S1000
; Starting inflateGrp: Closed?:true
G1 F300 Z-13.5000
G1 F1000 X130.7570 Y109.2429 Z-13.5000 S1000
G1 F1000 X130.9890 Y109.5901 Z-13.5000 S1000
G1 F1000 X131.0705 Y110.0000 Z-13.5000 S1000
G1 F1000 X130.9890 Y110.4099 Z-13.5000 S1000
G1 F1000 X130.7570 Y110.7571 Z-13.5000 S1000
G1 F1000 X130.4098 Y110.9891 Z-13.5000 S1000
G1 F1000 X129.9999 Y111.0706 Z-13.5000 S1000
G1 F1000 X129.5901 Y110.9891 Z-13.5000 S1000
G1 F1000 X129.2429 Y110.7571 Z-13.5000 S1000
G1 F1000 X129.0109 Y110.4099 Z-13.5000 S1000
G1 F1000 X128.9294 Y110.0000 Z-13.5000 S1000
G1 F1000 X129.0109 Y109.5901 Z-13.5000 S1000
G1 F1000 X129.2429 Y109.2429 Z-13.5000 S1000
G1 F1000 X129.5901 Y109.0109 Z-13.5000 S1000
G1 F1000 X129.9999 Y108.9294 Z-13.5000 S1000
G1 F1000 X130.4098 Y109.0109 Z-13.5000 S1000
; Starting inflateGrp: Closed?:true
G1 F300 Z-15.0000
G1 F1000 X130.7570 Y109.2429 Z-15.0000 S1000
G1 F1000 X130.9890 Y109.5901 Z-15.0000 S1000
G1 F1000 X131.0705 Y110.0000 Z-15.0000 S1000
G1 F1000 X130.9890 Y110.4099 Z-15.0000 S1000
G1 F1000 X130.7570 Y110.7571 Z-15.0000 S1000
G1 F1000 X130.4098 Y110.9891 Z-15.0000 S1000
G1 F1000 X129.9999 Y111.0706 Z-15.0000 S1000
G1 F1000 X129.5901 Y110.9891 Z-15.0000 S1000
G1 F1000 X129.2429 Y110.7571 Z-15.0000 S1000
G1 F1000 X129.0109 Y110.4099 Z-15.0000 S1000
G1 F1000 X128.9294 Y110.0000 Z-15.0000 S1000
G1 F1000 X129.0109 Y109.5901 Z-15.0000 S1000
G1 F1000 X129.2429 Y109.2429 Z-15.0000 S1000
G1 F1000 X129.5901 Y109.0109 Z-15.0000 S1000
G1 F1000 X129.9999 Y108.9294 Z-15.0000 S1000
G1 F1000 X130.4098 Y109.0109 Z-15.0000 S1000
; Starting inflateGrp: Closed?:true
G1 F300 Z-16.5000
G1 F1000 X130.7570 Y109.2429 Z-16.5000 S1000
G1 F1000 X130.9890 Y109.5901 Z-16.5000 S1000
G1 F1000 X131.0705 Y110.0000 Z-16.5000 S1000
G1 F1000 X130.9890 Y110.4099 Z-16.5000 S1000
G1 F1000 X130.7570 Y110.7571 Z-16.5000 S1000
G1 F1000 X130.4098 Y110.9891 Z-16.5000 S1000
G1 F1000 X129.9999 Y111.0706 Z-16.5000 S1000
G1 F1000 X129.5901 Y110.9891 Z-16.5000 S1000
G1 F1000 X129.2429 Y110.7571 Z-16.5000 S1000
G1 F1000 X129.0109 Y110.4099 Z-16.5000 S1000
G1 F1000 X128.9294 Y110.0000 Z-16.5000 S1000
G1 F1000 X129.0109 Y109.5901 Z-16.5000 S1000
G1 F1000 X129.2429 Y109.2429 Z-16.5000 S1000
G1 F1000 X129.5901 Y109.0109 Z-16.5000 S1000
G1 F1000 X129.9999 Y108.9294 Z-16.5000 S1000
G1 F1000 X130.4098 Y109.0109 Z-16.5000 S1000
; Starting inflateGrp: Closed?:true
G1 F300 Z-18.0000
G1 F1000 X130.7570 Y109.2429 Z-18.0000 S1000
G1 F1000 X130.9890 Y109.5901 Z-18.0000 S1000
G1 F1000 X131.0705 Y110.0000 Z-18.0000 S1000
G1 F1000 X130.9890 Y110.4099 Z-18.0000 S1000
G1 F1000 X130.7570 Y110.7571 Z-18.0000 S1000
G1 F1000 X130.4098 Y110.9891 Z-18.0000 S1000
G1 F1000 X129.9999 Y111.0706 Z-18.0000 S1000
G1 F1000 X129.5901 Y110.9891 Z-18.0000 S1000
G1 F1000 X129.2429 Y110.7571 Z-18.0000 S1000
G1 F1000 X129.0109 Y110.4099 Z-18.0000 S1000
G1 F1000 X128.9294 Y110.0000 Z-18.0000 S1000
G1 F1000 X129.0109 Y109.5901 Z-18.0000 S1000
G1 F1000 X129.2429 Y109.2429 Z-18.0000 S1000
G1 F1000 X129.5901 Y109.0109 Z-18.0000 S1000
G1 F1000 X129.9999 Y108.9294 Z-18.0000 S1000
G1 F1000 X130.4098 Y109.0109 Z-18.0000 S1000
; Starting inflateGrp: Closed?:true
G1 F300 Z-19.2000
G1 F1000 X130.7570 Y109.2429 Z-19.2000 S1000
G1 F1000 X130.9890 Y109.5901 Z-19.2000 S1000
G1 F1000 X131.0705 Y110.0000 Z-19.2000 S1000
G1 F1000 X130.9890 Y110.4099 Z-19.2000 S1000
G1 F1000 X130.7570 Y110.7571 Z-19.2000 S1000
G1 F1000 X130.4098 Y110.9891 Z-19.2000 S1000
G1 F1000 X129.9999 Y111.0706 Z-19.2000 S1000
G1 F1000 X129.5901 Y110.9891 Z-19.2000 S1000
G1 F1000 X129.2429 Y110.7571 Z-19.2000 S1000
G1 F1000 X129.0109 Y110.4099 Z-19.2000 S1000
G1 F1000 X128.9294 Y110.0000 Z-19.2000 S1000
G1 F1000 X129.0109 Y109.5901 Z-19.2000 S1000
G1 F1000 X129.2429 Y109.2429 Z-19.2000 S1000
G1 F1000 X129.5901 Y109.0109 Z-19.2000 S1000
G1 F1000 X129.9999 Y108.9294 Z-19.2000 S1000
G1 F1000 X130.4098 Y109.0109 Z-19.2000 S1000
; Starting inflateGrp: Closed?:true

G0 Z10
G0 X130.4098 Y29.0109

G0 Z0
G1 F300 Z-1.5000
G1 F1000 X130.7570 Y29.2429 Z-1.5000 S1000
G1 F1000 X130.9890 Y29.5901 Z-1.5000 S1000
G1 F1000 X131.0705 Y30.0000 Z-1.5000 S1000
G1 F1000 X130.9890 Y30.4099 Z-1.5000 S1000
G1 F1000 X130.7570 Y30.7571 Z-1.5000 S1000
G1 F1000 X130.4098 Y30.9891 Z-1.5000 S1000
G1 F1000 X129.9999 Y31.0706 Z-1.5000 S1000
G1 F1000 X129.5901 Y30.9891 Z-1.5000 S1000
G1 F1000 X129.2429 Y30.7571 Z-1.5000 S1000
G1 F1000 X129.0109 Y30.4099 Z-1.5000 S1000
G1 F1000 X128.9294 Y30.0000 Z-1.5000 S1000
G1 F1000 X129.0109 Y29.5901 Z-1.5000 S1000
G1 F1000 X129.2429 Y29.2429 Z-1.5000 S1000
G1 F1000 X129.5901 Y29.0109 Z-1.5000 S1000
G1 F1000 X129.9999 Y28.9294 Z-1.5000 S1000
G1 F1000 X130.4098 Y29.0109 Z-1.5000 S1000
; Starting inflateGrp: Closed?:true
G1 F300 Z-3.0000
G1 F1000 X130.7570 Y29.2429 Z-3.0000 S1000
G1 F1000 X130.9890 Y29.5901 Z-3.0000 S1000
G1 F1000 X131.0705 Y30.0000 Z-3.0000 S1000
G1 F1000 X130.9890 Y30.4099 Z-3.0000 S1000
G1 F1000 X130.7570 Y30.7571 Z-3.0000 S1000
G1 F1000 X130.4098 Y30.9891 Z-3.0000 S1000
G1 F1000 X129.9999 Y31.0706 Z-3.0000 S1000
G1 F1000 X129.5901 Y30.9891 Z-3.0000 S1000
G1 F1000 X129.2429 Y30.7571 Z-3.0000 S1000
G1 F1000 X129.0109 Y30.4099 Z-3.0000 S1000
G1 F1000 X128.9294 Y30.0000 Z-3.0000 S1000
G1 F1000 X129.0109 Y29.5901 Z-3.0000 S1000
G1 F1000 X129.2429 Y29.2429 Z-3.0000 S1000
G1 F1000 X129.5901 Y29.0109 Z-3.0000 S1000
G1 F1000 X129.9999 Y28.9294 Z-3.0000 S1000
G1 F1000 X130.4098 Y29.0109 Z-3.0000 S1000
; Starting inflateGrp: Closed?:true
G1 F300 Z-4.5000
G1 F1000 X130.7570 Y29.2429 Z-4.5000 S1000
G1 F1000 X130.9890 Y29.5901 Z-4.5000 S1000
G1 F1000 X131.0705 Y30.0000 Z-4.5000 S1000
G1 F1000 X130.9890 Y30.4099 Z-4.5000 S1000
G1 F1000 X130.7570 Y30.7571 Z-4.5000 S1000
G1 F1000 X130.4098 Y30.9891 Z-4.5000 S1000
G1 F1000 X129.9999 Y31.0706 Z-4.5000 S1000
G1 F1000 X129.5901 Y30.9891 Z-4.5000 S1000
G1 F1000 X129.2429 Y30.7571 Z-4.5000 S1000
G1 F1000 X129.0109 Y30.4099 Z-4.5000 S1000
G1 F1000 X128.9294 Y30.0000 Z-4.5000 S1000
G1 F1000 X129.0109 Y29.5901 Z-4.5000 S1000
G1 F1000 X129.2429 Y29.2429 Z-4.5000 S1000
G1 F1000 X129.5901 Y29.0109 Z-4.5000 S1000
G1 F1000 X129.9999 Y28.9294 Z-4.5000 S1000
G1 F1000 X130.4098 Y29.0109 Z-4.5000 S1000
; Starting inflateGrp: Closed?:true
G1 F300 Z-6.0000
G1 F1000 X130.7570 Y29.2429 Z-6.0000 S1000
G1 F1000 X130.9890 Y29.5901 Z-6.0000 S1000
G1 F1000 X131.0705 Y30.0000 Z-6.0000 S1000
G1 F1000 X130.9890 Y30.4099 Z-6.0000 S1000
G1 F1000 X130.7570 Y30.7571 Z-6.0000 S1000
G1 F1000 X130.4098 Y30.9891 Z-6.0000 S1000
G1 F1000 X129.9999 Y31.0706 Z-6.0000 S1000
G1 F1000 X129.5901 Y30.9891 Z-6.0000 S1000
G1 F1000 X129.2429 Y30.7571 Z-6.0000 S1000
G1 F1000 X129.0109 Y30.4099 Z-6.0000 S1000
G1 F1000 X128.9294 Y30.0000 Z-6.0000 S1000
G1 F1000 X129.0109 Y29.5901 Z-6.0000 S1000
G1 F1000 X129.2429 Y29.2429 Z-6.0000 S1000
G1 F1000 X129.5901 Y29.0109 Z-6.0000 S1000
G1 F1000 X129.9999 Y28.9294 Z-6.0000 S1000
G1 F1000 X130.4098 Y29.0109 Z-6.0000 S1000
; Starting inflateGrp: Closed?:true
G1 F300 Z-7.5000
G1 F1000 X130.7570 Y29.2429 Z-7.5000 S1000
G1 F1000 X130.9890 Y29.5901 Z-7.5000 S1000
G1 F1000 X131.0705 Y30.0000 Z-7.5000 S1000
G1 F1000 X130.9890 Y30.4099 Z-7.5000 S1000
G1 F1000 X130.7570 Y30.7571 Z-7.5000 S1000
G1 F1000 X130.4098 Y30.9891 Z-7.5000 S1000
G1 F1000 X129.9999 Y31.0706 Z-7.5000 S1000
G1 F1000 X129.5901 Y30.9891 Z-7.5000 S1000
G1 F1000 X129.2429 Y30.7571 Z-7.5000 S1000
G1 F1000 X129.0109 Y30.4099 Z-7.5000 S1000
G1 F1000 X128.9294 Y30.0000 Z-7.5000 S1000
G1 F1000 X129.0109 Y29.5901 Z-7.5000 S1000
G1 F1000 X129.2429 Y29.2429 Z-7.5000 S1000
G1 F1000 X129.5901 Y29.0109 Z-7.5000 S1000
G1 F1000 X129.9999 Y28.9294 Z-7.5000 S1000
G1 F1000 X130.4098 Y29.0109 Z-7.5000 S1000
; Starting inflateGrp: Closed?:true
G1 F300 Z-9.0000
G1 F1000 X130.7570 Y29.2429 Z-9.0000 S1000
G1 F1000 X130.9890 Y29.5901 Z-9.0000 S1000
G1 F1000 X131.0705 Y30.0000 Z-9.0000 S1000
G1 F1000 X130.9890 Y30.4099 Z-9.0000 S1000
G1 F1000 X130.7570 Y30.7571 Z-9.0000 S1000
G1 F1000 X130.4098 Y30.9891 Z-9.0000 S1000
G1 F1000 X129.9999 Y31.0706 Z-9.0000 S1000
G1 F1000 X129.5901 Y30.9891 Z-9.0000 S1000
G1 F1000 X129.2429 Y30.7571 Z-9.0000 S1000
G1 F1000 X129.0109 Y30.4099 Z-9.0000 S1000
G1 F1000 X128.9294 Y30.0000 Z-9.0000 S1000
G1 F1000 X129.0109 Y29.5901 Z-9.0000 S1000
G1 F1000 X129.2429 Y29.2429 Z-9.0000 S1000
G1 F1000 X129.5901 Y29.0109 Z-9.0000 S1000
G1 F1000 X129.9999 Y28.9294 Z-9.0000 S1000
G1 F1000 X130.4098 Y29.0109 Z-9.0000 S1000
; Starting inflateGrp: Closed?:true
G1 F300 Z-10.5000
G1 F1000 X130.7570 Y29.2429 Z-10.5000 S1000
G1 F1000 X130.9890 Y29.5901 Z-10.5000 S1000
G1 F1000 X131.0705 Y30.0000 Z-10.5000 S1000
G1 F1000 X130.9890 Y30.4099 Z-10.5000 S1000
G1 F1000 X130.7570 Y30.7571 Z-10.5000 S1000
G1 F1000 X130.4098 Y30.9891 Z-10.5000 S1000
G1 F1000 X129.9999 Y31.0706 Z-10.5000 S1000
G1 F1000 X129.5901 Y30.9891 Z-10.5000 S1000
G1 F1000 X129.2429 Y30.7571 Z-10.5000 S1000
G1 F1000 X129.0109 Y30.4099 Z-10.5000 S1000
G1 F1000 X128.9294 Y30.0000 Z-10.5000 S1000
G1 F1000 X129.0109 Y29.5901 Z-10.5000 S1000
G1 F1000 X129.2429 Y29.2429 Z-10.5000 S1000
G1 F1000 X129.5901 Y29.0109 Z-10.5000 S1000
G1 F1000 X129.9999 Y28.9294 Z-10.5000 S1000
G1 F1000 X130.4098 Y29.0109 Z-10.5000 S1000
; Starting inflateGrp: Closed?:true
G1 F300 Z-12.0000
G1 F1000 X130.7570 Y29.2429 Z-12.0000 S1000
G1 F1000 X130.9890 Y29.5901 Z-12.0000 S1000
G1 F1000 X131.0705 Y30.0000 Z-12.0000 S1000
G1 F1000 X130.9890 Y30.4099 Z-12.0000 S1000
G1 F1000 X130.7570 Y30.7571 Z-12.0000 S1000
G1 F1000 X130.4098 Y30.9891 Z-12.0000 S1000
G1 F1000 X129.9999 Y31.0706 Z-12.0000 S1000
G1 F1000 X129.5901 Y30.9891 Z-12.0000 S1000
G1 F1000 X129.2429 Y30.7571 Z-12.0000 S1000
G1 F1000 X129.0109 Y30.4099 Z-12.0000 S1000
G1 F1000 X128.9294 Y30.0000 Z-12.0000 S1000
G1 F1000 X129.0109 Y29.5901 Z-12.0000 S1000
G1 F1000 X129.2429 Y29.2429 Z-12.0000 S1000
G1 F1000 X129.5901 Y29.0109 Z-12.0000 S1000
G1 F1000 X129.9999 Y28.9294 Z-12.0000 S1000
G1 F1000 X130.4098 Y29.0109 Z-12.0000 S1000
; Starting inflateGrp: Closed?:true
G1 F300 Z-13.5000
G1 F1000 X130.7570 Y29.2429 Z-13.5000 S1000
G1 F1000 X130.9890 Y29.5901 Z-13.5000 S1000
G1 F1000 X131.0705 Y30.0000 Z-13.5000 S1000
G1 F1000 X130.9890 Y30.4099 Z-13.5000 S1000
G1 F1000 X130.7570 Y30.7571 Z-13.5000 S1000
G1 F1000 X130.4098 Y30.9891 Z-13.5000 S1000
G1 F1000 X129.9999 Y31.0706 Z-13.5000 S1000
G1 F1000 X129.5901 Y30.9891 Z-13.5000 S1000
G1 F1000 X129.2429 Y30.7571 Z-13.5000 S1000
G1 F1000 X129.0109 Y30.4099 Z-13.5000 S1000
G1 F1000 X128.9294 Y30.0000 Z-13.5000 S1000
G1 F1000 X129.0109 Y29.5901 Z-13.5000 S1000
G1 F1000 X129.2429 Y29.2429 Z-13.5000 S1000
G1 F1000 X129.5901 Y29.0109 Z-13.5000 S1000
G1 F1000 X129.9999 Y28.9294 Z-13.5000 S1000
G1 F1000 X130.4098 Y29.0109 Z-13.5000 S1000
; Starting inflateGrp: Closed?:true
G1 F300 Z-15.0000
G1 F1000 X130.7570 Y29.2429 Z-15.0000 S1000
G1 F1000 X130.9890 Y29.5901 Z-15.0000 S1000
G1 F1000 X131.0705 Y30.0000 Z-15.0000 S1000
G1 F1000 X130.9890 Y30.4099 Z-15.0000 S1000
G1 F1000 X130.7570 Y30.7571 Z-15.0000 S1000
G1 F1000 X130.4098 Y30.9891 Z-15.0000 S1000
G1 F1000 X129.9999 Y31.0706 Z-15.0000 S1000
G1 F1000 X129.5901 Y30.9891 Z-15.0000 S1000
G1 F1000 X129.2429 Y30.7571 Z-15.0000 S1000
G1 F1000 X129.0109 Y30.4099 Z-15.0000 S1000
G1 F1000 X128.9294 Y30.0000 Z-15.0000 S1000
G1 F1000 X129.0109 Y29.5901 Z-15.0000 S1000
G1 F1000 X129.2429 Y29.2429 Z-15.0000 S1000
G1 F1000 X129.5901 Y29.0109 Z-15.0000 S1000
G1 F1000 X129.9999 Y28.9294 Z-15.0000 S1000
G1 F1000 X130.4098 Y29.0109 Z-15.0000 S1000
; Starting inflateGrp: Closed?:true
G1 F300 Z-16.5000
G1 F1000 X130.7570 Y29.2429 Z-16.5000 S1000
G1 F1000 X130.9890 Y29.5901 Z-16.5000 S1000
G1 F1000 X131.0705 Y30.0000 Z-16.5000 S1000
G1 F1000 X130.9890 Y30.4099 Z-16.5000 S1000
G1 F1000 X130.7570 Y30.7571 Z-16.5000 S1000
G1 F1000 X130.4098 Y30.9891 Z-16.5000 S1000
G1 F1000 X129.9999 Y31.0706 Z-16.5000 S1000
G1 F1000 X129.5901 Y30.9891 Z-16.5000 S1000
G1 F1000 X129.2429 Y30.7571 Z-16.5000 S1000
G1 F1000 X129.0109 Y30.4099 Z-16.5000 S1000
G1 F1000 X128.9294 Y30.0000 Z-16.5000 S1000
G1 F1000 X129.0109 Y29.5901 Z-16.5000 S1000
G1 F1000 X129.2429 Y29.2429 Z-16.5000 S1000
G1 F1000 X129.5901 Y29.0109 Z-16.5000 S1000
G1 F1000 X129.9999 Y28.9294 Z-16.5000 S1000
G1 F1000 X130.4098 Y29.0109 Z-16.5000 S1000
; Starting inflateGrp: Closed?:true
G1 F300 Z-18.0000
G1 F1000 X130.7570 Y29.2429 Z-18.0000 S1000
G1 F1000 X130.9890 Y29.5901 Z-18.0000 S1000
G1 F1000 X131.0705 Y30.0000 Z-18.0000 S1000
G1 F1000 X130.9890 Y30.4099 Z-18.0000 S1000
G1 F1000 X130.7570 Y30.7571 Z-18.0000 S1000
G1 F1000 X130.4098 Y30.9891 Z-18.0000 S1000
G1 F1000 X129.9999 Y31.0706 Z-18.0000 S1000
G1 F1000 X129.5901 Y30.9891 Z-18.0000 S1000
G1 F1000 X129.2429 Y30.7571 Z-18.0000 S1000
G1 F1000 X129.0109 Y30.4099 Z-18.0000 S1000
G1 F1000 X128.9294 Y30.0000 Z-18.0000 S1000
G1 F1000 X129.0109 Y29.5901 Z-18.0000 S1000
G1 F1000 X129.2429 Y29.2429 Z-18.0000 S1000
G1 F1000 X129.5901 Y29.0109 Z-18.0000 S1000
G1 F1000 X129.9999 Y28.9294 Z-18.0000 S1000
G1 F1000 X130.4098 Y29.0109 Z-18.0000 S1000
; Starting inflateGrp: Closed?:true
G1 F300 Z-19.2000
G1 F1000 X130.7570 Y29.2429 Z-19.2000 S1000
G1 F1000 X130.9890 Y29.5901 Z-19.2000 S1000
G1 F1000 X131.0705 Y30.0000 Z-19.2000 S1000
G1 F1000 X130.9890 Y30.4099 Z-19.2000 S1000
G1 F1000 X130.7570 Y30.7571 Z-19.2000 S1000
G1 F1000 X130.4098 Y30.9891 Z-19.2000 S1000
G1 F1000 X129.9999 Y31.0706 Z-19.2000 S1000
G1 F1000 X129.5901 Y30.9891 Z-19.2000 S1000
G1 F1000 X129.2429 Y30.7571 Z-19.2000 S1000
G1 F1000 X129.0109 Y30.4099 Z-19.2000 S1000
G1 F1000 X128.9294 Y30.0000 Z-19.2000 S1000
G1 F1000 X129.0109 Y29.5901 Z-19.2000 S1000
G1 F1000 X129.2429 Y29.2429 Z-19.2000 S1000
G1 F1000 X129.5901 Y29.0109 Z-19.2000 S1000
G1 F1000 X129.9999 Y28.9294 Z-19.2000 S1000
G1 F1000 X130.4098 Y29.0109 Z-19.2000 S1000
; Starting inflateGrp: Closed?:true

G0 Z10
G0 X10.4098 Y109.0109

G0 Z0
G1 F300 Z-1.5000
G1 F1000 X10.7570 Y109.2429 Z-1.5000 S1000
G1 F1000 X10.9890 Y109.5901 Z-1.5000 S1000
G1 F1000 X11.0705 Y110.0000 Z-1.5000 S1000
G1 F1000 X10.9890 Y110.4099 Z-1.5000 S1000
G1 F1000 X10.7570 Y110.7571 Z-1.5000 S1000
G1 F1000 X10.4098 Y110.9891 Z-1.5000 S1000
G1 F1000 X9.9999 Y111.0706 Z-1.5000 S1000
G1 F1000 X9.5901 Y110.9891 Z-1.5000 S1000
G1 F1000 X9.2429 Y110.7571 Z-1.5000 S1000
G1 F1000 X9.0109 Y110.4099 Z-1.5000 S1000
G1 F1000 X8.9294 Y110.0000 Z-1.5000 S1000
G1 F1000 X9.0109 Y109.5901 Z-1.5000 S1000
G1 F1000 X9.2429 Y109.2429 Z-1.5000 S1000
G1 F1000 X9.5901 Y109.0109 Z-1.5000 S1000
G1 F1000 X9.9999 Y108.9294 Z-1.5000 S1000
G1 F1000 X10.4098 Y109.0109 Z-1.5000 S1000
; Starting inflateGrp: Closed?:true
G1 F300 Z-3.0000
G1 F1000 X10.7570 Y109.2429 Z-3.0000 S1000
G1 F1000 X10.9890 Y109.5901 Z-3.0000 S1000
G1 F1000 X11.0705 Y110.0000 Z-3.0000 S1000
G1 F1000 X10.9890 Y110.4099 Z-3.0000 S1000
G1 F1000 X10.7570 Y110.7571 Z-3.0000 S1000
G1 F1000 X10.4098 Y110.9891 Z-3.0000 S1000
G1 F1000 X9.9999 Y111.0706 Z-3.0000 S1000
G1 F1000 X9.5901 Y110.9891 Z-3.0000 S1000
G1 F1000 X9.2429 Y110.7571 Z-3.0000 S1000
G1 F1000 X9.0109 Y110.4099 Z-3.0000 S1000
G1 F1000 X8.9294 Y110.0000 Z-3.0000 S1000
G1 F1000 X9.0109 Y109.5901 Z-3.0000 S1000
G1 F1000 X9.2429 Y109.2429 Z-3.0000 S1000
G1 F1000 X9.5901 Y109.0109 Z-3.0000 S1000
G1 F1000 X9.9999 Y108.9294 Z-3.0000 S1000
G1 F1000 X10.4098 Y109.0109 Z-3.0000 S1000
; Starting inflateGrp: Closed?:true
G1 F300 Z-4.5000
G1 F1000 X10.7570 Y109.2429 Z-4.5000 S1000
G1 F1000 X10.9890 Y109.5901 Z-4.5000 S1000
G1 F1000 X11.0705 Y110.0000 Z-4.5000 S1000
G1 F1000 X10.9890 Y110.4099 Z-4.5000 S1000
G1 F1000 X10.7570 Y110.7571 Z-4.5000 S1000
G1 F1000 X10.4098 Y110.9891 Z-4.5000 S1000
G1 F1000 X9.9999 Y111.0706 Z-4.5000 S1000
G1 F1000 X9.5901 Y110.9891 Z-4.5000 S1000
G1 F1000 X9.2429 Y110.7571 Z-4.5000 S1000
G1 F1000 X9.0109 Y110.4099 Z-4.5000 S1000
G1 F1000 X8.9294 Y110.0000 Z-4.5000 S1000
G1 F1000 X9.0109 Y109.5901 Z-4.5000 S1000
G1 F1000 X9.2429 Y109.2429 Z-4.5000 S1000
G1 F1000 X9.5901 Y109.0109 Z-4.5000 S1000
G1 F1000 X9.9999 Y108.9294 Z-4.5000 S1000
G1 F1000 X10.4098 Y109.0109 Z-4.5000 S1000
; Starting inflateGrp: Closed?:true
G1 F300 Z-6.0000
G1 F1000 X10.7570 Y109.2429 Z-6.0000 S1000
G1 F1000 X10.9890 Y109.5901 Z-6.0000 S1000
G1 F1000 X11.0705 Y110.0000 Z-6.0000 S1000
G1 F1000 X10.9890 Y110.4099 Z-6.0000 S1000
G1 F1000 X10.7570 Y110.7571 Z-6.0000 S1000
G1 F1000 X10.4098 Y110.9891 Z-6.0000 S1000
G1 F1000 X9.9999 Y111.0706 Z-6.0000 S1000
G1 F1000 X9.5901 Y110.9891 Z-6.0000 S1000
G1 F1000 X9.2429 Y110.7571 Z-6.0000 S1000
G1 F1000 X9.0109 Y110.4099 Z-6.0000 S1000
G1 F1000 X8.9294 Y110.0000 Z-6.0000 S1000
G1 F1000 X9.0109 Y109.5901 Z-6.0000 S1000
G1 F1000 X9.2429 Y109.2429 Z-6.0000 S1000
G1 F1000 X9.5901 Y109.0109 Z-6.0000 S1000
G1 F1000 X9.9999 Y108.9294 Z-6.0000 S1000
G1 F1000 X10.4098 Y109.0109 Z-6.0000 S1000
; Starting inflateGrp: Closed?:true
G1 F300 Z-7.5000
G1 F1000 X10.7570 Y109.2429 Z-7.5000 S1000
G1 F1000 X10.9890 Y109.5901 Z-7.5000 S1000
G1 F1000 X11.0705 Y110.0000 Z-7.5000 S1000
G1 F1000 X10.9890 Y110.4099 Z-7.5000 S1000
G1 F1000 X10.7570 Y110.7571 Z-7.5000 S1000
G1 F1000 X10.4098 Y110.9891 Z-7.5000 S1000
G1 F1000 X9.9999 Y111.0706 Z-7.5000 S1000
G1 F1000 X9.5901 Y110.9891 Z-7.5000 S1000
G1 F1000 X9.2429 Y110.7571 Z-7.5000 S1000
G1 F1000 X9.0109 Y110.4099 Z-7.5000 S1000
G1 F1000 X8.9294 Y110.0000 Z-7.5000 S1000
G1 F1000 X9.0109 Y109.5901 Z-7.5000 S1000
G1 F1000 X9.2429 Y109.2429 Z-7.5000 S1000
G1 F1000 X9.5901 Y109.0109 Z-7.5000 S1000
G1 F1000 X9.9999 Y108.9294 Z-7.5000 S1000
G1 F1000 X10.4098 Y109.0109 Z-7.5000 S1000
; Starting inflateGrp: Closed?:true
G1 F300 Z-9.0000
G1 F1000 X10.7570 Y109.2429 Z-9.0000 S1000
G1 F1000 X10.9890 Y109.5901 Z-9.0000 S1000
G1 F1000 X11.0705 Y110.0000 Z-9.0000 S1000
G1 F1000 X10.9890 Y110.4099 Z-9.0000 S1000
G1 F1000 X10.7570 Y110.7571 Z-9.0000 S1000
G1 F1000 X10.4098 Y110.9891 Z-9.0000 S1000
G1 F1000 X9.9999 Y111.0706 Z-9.0000 S1000
G1 F1000 X9.5901 Y110.9891 Z-9.0000 S1000
G1 F1000 X9.2429 Y110.7571 Z-9.0000 S1000
G1 F1000 X9.0109 Y110.4099 Z-9.0000 S1000
G1 F1000 X8.9294 Y110.0000 Z-9.0000 S1000
G1 F1000 X9.0109 Y109.5901 Z-9.0000 S1000
G1 F1000 X9.2429 Y109.2429 Z-9.0000 S1000
G1 F1000 X9.5901 Y109.0109 Z-9.0000 S1000
G1 F1000 X9.9999 Y108.9294 Z-9.0000 S1000
G1 F1000 X10.4098 Y109.0109 Z-9.0000 S1000
; Starting inflateGrp: Closed?:true
G1 F300 Z-10.5000
G1 F1000 X10.7570 Y109.2429 Z-10.5000 S1000
G1 F1000 X10.9890 Y109.5901 Z-10.5000 S1000
G1 F1000 X11.0705 Y110.0000 Z-10.5000 S1000
G1 F1000 X10.9890 Y110.4099 Z-10.5000 S1000
G1 F1000 X10.7570 Y110.7571 Z-10.5000 S1000
G1 F1000 X10.4098 Y110.9891 Z-10.5000 S1000
G1 F1000 X9.9999 Y111.0706 Z-10.5000 S1000
G1 F1000 X9.5901 Y110.9891 Z-10.5000 S1000
G1 F1000 X9.2429 Y110.7571 Z-10.5000 S1000
G1 F1000 X9.0109 Y110.4099 Z-10.5000 S1000
G1 F1000 X8.9294 Y110.0000 Z-10.5000 S1000
G1 F1000 X9.0109 Y109.5901 Z-10.5000 S1000
G1 F1000 X9.2429 Y109.2429 Z-10.5000 S1000
G1 F1000 X9.5901 Y109.0109 Z-10.5000 S1000
G1 F1000 X9.9999 Y108.9294 Z-10.5000 S1000
G1 F1000 X10.4098 Y109.0109 Z-10.5000 S1000
; Starting inflateGrp: Closed?:true
G1 F300 Z-12.0000
G1 F1000 X10.7570 Y109.2429 Z-12.0000 S1000
G1 F1000 X10.9890 Y109.5901 Z-12.0000 S1000
G1 F1000 X11.0705 Y110.0000 Z-12.0000 S1000
G1 F1000 X10.9890 Y110.4099 Z-12.0000 S1000
G1 F1000 X10.7570 Y110.7571 Z-12.0000 S1000
G1 F1000 X10.4098 Y110.9891 Z-12.0000 S1000
G1 F1000 X9.9999 Y111.0706 Z-12.0000 S1000
G1 F1000 X9.5901 Y110.9891 Z-12.0000 S1000
G1 F1000 X9.2429 Y110.7571 Z-12.0000 S1000
G1 F1000 X9.0109 Y110.4099 Z-12.0000 S1000
G1 F1000 X8.9294 Y110.0000 Z-12.0000 S1000
G1 F1000 X9.0109 Y109.5901 Z-12.0000 S1000
G1 F1000 X9.2429 Y109.2429 Z-12.0000 S1000
G1 F1000 X9.5901 Y109.0109 Z-12.0000 S1000
G1 F1000 X9.9999 Y108.9294 Z-12.0000 S1000
G1 F1000 X10.4098 Y109.0109 Z-12.0000 S1000
; Starting inflateGrp: Closed?:true
G1 F300 Z-13.5000
G1 F1000 X10.7570 Y109.2429 Z-13.5000 S1000
G1 F1000 X10.9890 Y109.5901 Z-13.5000 S1000
G1 F1000 X11.0705 Y110.0000 Z-13.5000 S1000
G1 F1000 X10.9890 Y110.4099 Z-13.5000 S1000
G1 F1000 X10.7570 Y110.7571 Z-13.5000 S1000
G1 F1000 X10.4098 Y110.9891 Z-13.5000 S1000
G1 F1000 X9.9999 Y111.0706 Z-13.5000 S1000
G1 F1000 X9.5901 Y110.9891 Z-13.5000 S1000
G1 F1000 X9.2429 Y110.7571 Z-13.5000 S1000
G1 F1000 X9.0109 Y110.4099 Z-13.5000 S1000
G1 F1000 X8.9294 Y110.0000 Z-13.5000 S1000
G1 F1000 X9.0109 Y109.5901 Z-13.5000 S1000
G1 F1000 X9.2429 Y109.2429 Z-13.5000 S1000
G1 F1000 X9.5901 Y109.0109 Z-13.5000 S1000
G1 F1000 X9.9999 Y108.9294 Z-13.5000 S1000
G1 F1000 X10.4098 Y109.0109 Z-13.5000 S1000
; Starting inflateGrp: Closed?:true
G1 F300 Z-15.0000
G1 F1000 X10.7570 Y109.2429 Z-15.0000 S1000
G1 F1000 X10.9890 Y109.5901 Z-15.0000 S1000
G1 F1000 X11.0705 Y110.0000 Z-15.0000 S1000
G1 F1000 X10.9890 Y110.4099 Z-15.0000 S1000
G1 F1000 X10.7570 Y110.7571 Z-15.0000 S1000
G1 F1000 X10.4098 Y110.9891 Z-15.0000 S1000
G1 F1000 X9.9999 Y111.0706 Z-15.0000 S1000
G1 F1000 X9.5901 Y110.9891 Z-15.0000 S1000
G1 F1000 X9.2429 Y110.7571 Z-15.0000 S1000
G1 F1000 X9.0109 Y110.4099 Z-15.0000 S1000
G1 F1000 X8.9294 Y110.0000 Z-15.0000 S1000
G1 F1000 X9.0109 Y109.5901 Z-15.0000 S1000
G1 F1000 X9.2429 Y109.2429 Z-15.0000 S1000
G1 F1000 X9.5901 Y109.0109 Z-15.0000 S1000
G1 F1000 X9.9999 Y108.9294 Z-15.0000 S1000
G1 F1000 X10.4098 Y109.0109 Z-15.0000 S1000
; Starting inflateGrp: Closed?:true
G1 F300 Z-16.5000
G1 F1000 X10.7570 Y109.2429 Z-16.5000 S1000
G1 F1000 X10.9890 Y109.5901 Z-16.5000 S1000
G1 F1000 X11.0705 Y110.0000 Z-16.5000 S1000
G1 F1000 X10.9890 Y110.4099 Z-16.5000 S1000
G1 F1000 X10.7570 Y110.7571 Z-16.5000 S1000
G1 F1000 X10.4098 Y110.9891 Z-16.5000 S1000
G1 F1000 X9.9999 Y111.0706 Z-16.5000 S1000
G1 F1000 X9.5901 Y110.9891 Z-16.5000 S1000
G1 F1000 X9.2429 Y110.7571 Z-16.5000 S1000
G1 F1000 X9.0109 Y110.4099 Z-16.5000 S1000
G1 F1000 X8.9294 Y110.0000 Z-16.5000 S1000
G1 F1000 X9.0109 Y109.5901 Z-16.5000 S1000
G1 F1000 X9.2429 Y109.2429 Z-16.5000 S1000
G1 F1000 X9.5901 Y109.0109 Z-16.5000 S1000
G1 F1000 X9.9999 Y108.9294 Z-16.5000 S1000
G1 F1000 X10.4098 Y109.0109 Z-16.5000 S1000
; Starting inflateGrp: Closed?:true
G1 F300 Z-18.0000
G1 F1000 X10.7570 Y109.2429 Z-18.0000 S1000
G1 F1000 X10.9890 Y109.5901 Z-18.0000 S1000
G1 F1000 X11.0705 Y110.0000 Z-18.0000 S1000
G1 F1000 X10.9890 Y110.4099 Z-18.0000 S1000
G1 F1000 X10.7570 Y110.7571 Z-18.0000 S1000
G1 F1000 X10.4098 Y110.9891 Z-18.0000 S1000
G1 F1000 X9.9999 Y111.0706 Z-18.0000 S1000
G1 F1000 X9.5901 Y110.9891 Z-18.0000 S1000
G1 F1000 X9.2429 Y110.7571 Z-18.0000 S1000
G1 F1000 X9.0109 Y110.4099 Z-18.0000 S1000
G1 F1000 X8.9294 Y110.0000 Z-18.0000 S1000
G1 F1000 X9.0109 Y109.5901 Z-18.0000 S1000
G1 F1000 X9.2429 Y109.2429 Z-18.0000 S1000
G1 F1000 X9.5901 Y109.0109 Z-18.0000 S1000
G1 F1000 X9.9999 Y108.9294 Z-18.0000 S1000
G1 F1000 X10.4098 Y109.0109 Z-18.0000 S1000
; Starting inflateGrp: Closed?:true
G1 F300 Z-19.2000
G1 F1000 X10.7570 Y109.2429 Z-19.2000 S1000
G1 F1000 X10.9890 Y109.5901 Z-19.2000 S1000
G1 F1000 X11.0705 Y110.0000 Z-19.2000 S1000
G1 F1000 X10.9890 Y110.4099 Z-19.2000 S1000
G1 F1000 X10.7570 Y110.7571 Z-19.2000 S1000
G1 F1000 X10.4098 Y110.9891 Z-19.2000 S1000
G1 F1000 X9.9999 Y111.0706 Z-19.2000 S1000
G1 F1000 X9.5901 Y110.9891 Z-19.2000 S1000
G1 F1000 X9.2429 Y110.7571 Z-19.2000 S1000
G1 F1000 X9.0109 Y110.4099 Z-19.2000 S1000
G1 F1000 X8.9294 Y110.0000 Z-19.2000 S1000
G1 F1000 X9.0109 Y109.5901 Z-19.2000 S1000
G1 F1000 X9.2429 Y109.2429 Z-19.2000 S1000
G1 F1000 X9.5901 Y109.0109 Z-19.2000 S1000
G1 F1000 X9.9999 Y108.9294 Z-19.2000 S1000
G1 F1000 X10.4098 Y109.0109 Z-19.2000 S1000
; Starting inflateGrp: Closed?:true

G0 Z10
G0 X10.4098 Y29.0109

G0 Z0
G1 F300 Z-1.5000
G1 F1000 X10.7570 Y29.2429 Z-1.5000 S1000
G1 F1000 X10.9890 Y29.5901 Z-1.5000 S1000
G1 F1000 X11.0705 Y30.0000 Z-1.5000 S1000
G1 F1000 X10.9890 Y30.4099 Z-1.5000 S1000
G1 F1000 X10.7570 Y30.7571 Z-1.5000 S1000
G1 F1000 X10.4098 Y30.9891 Z-1.5000 S1000
G1 F1000 X9.9999 Y31.0706 Z-1.5000 S1000
G1 F1000 X9.5901 Y30.9891 Z-1.5000 S1000
G1 F1000 X9.2429 Y30.7571 Z-1.5000 S1000
G1 F1000 X9.0109 Y30.4099 Z-1.5000 S1000
G1 F1000 X8.9294 Y30.0000 Z-1.5000 S1000
G1 F1000 X9.0109 Y29.5901 Z-1.5000 S1000
G1 F1000 X9.2429 Y29.2429 Z-1.5000 S1000
G1 F1000 X9.5901 Y29.0109 Z-1.5000 S1000
G1 F1000 X9.9999 Y28.9294 Z-1.5000 S1000
G1 F1000 X10.4098 Y29.0109 Z-1.5000 S1000
; Starting inflateGrp: Closed?:true
G1 F300 Z-3.0000
G1 F1000 X10.7570 Y29.2429 Z-3.0000 S1000
G1 F1000 X10.9890 Y29.5901 Z-3.0000 S1000
G1 F1000 X11.0705 Y30.0000 Z-3.0000 S1000
G1 F1000 X10.9890 Y30.4099 Z-3.0000 S1000
G1 F1000 X10.7570 Y30.7571 Z-3.0000 S1000
G1 F1000 X10.4098 Y30.9891 Z-3.0000 S1000
G1 F1000 X9.9999 Y31.0706 Z-3.0000 S1000
G1 F1000 X9.5901 Y30.9891 Z-3.0000 S1000
G1 F1000 X9.2429 Y30.7571 Z-3.0000 S1000
G1 F1000 X9.0109 Y30.4099 Z-3.0000 S1000
G1 F1000 X8.9294 Y30.0000 Z-3.0000 S1000
G1 F1000 X9.0109 Y29.5901 Z-3.0000 S1000
G1 F1000 X9.2429 Y29.2429 Z-3.0000 S1000
G1 F1000 X9.5901 Y29.0109 Z-3.0000 S1000
G1 F1000 X9.9999 Y28.9294 Z-3.0000 S1000
G1 F1000 X10.4098 Y29.0109 Z-3.0000 S1000
; Starting inflateGrp: Closed?:true
G1 F300 Z-4.5000
G1 F1000 X10.7570 Y29.2429 Z-4.5000 S1000
G1 F1000 X10.9890 Y29.5901 Z-4.5000 S1000
G1 F1000 X11.0705 Y30.0000 Z-4.5000 S1000
G1 F1000 X10.9890 Y30.4099 Z-4.5000 S1000
G1 F1000 X10.7570 Y30.7571 Z-4.5000 S1000
G1 F1000 X10.4098 Y30.9891 Z-4.5000 S1000
G1 F1000 X9.9999 Y31.0706 Z-4.5000 S1000
G1 F1000 X9.5901 Y30.9891 Z-4.5000 S1000
G1 F1000 X9.2429 Y30.7571 Z-4.5000 S1000
G1 F1000 X9.0109 Y30.4099 Z-4.5000 S1000
G1 F1000 X8.9294 Y30.0000 Z-4.5000 S1000
G1 F1000 X9.0109 Y29.5901 Z-4.5000 S1000
G1 F1000 X9.2429 Y29.2429 Z-4.5000 S1000
G1 F1000 X9.5901 Y29.0109 Z-4.5000 S1000
G1 F1000 X9.9999 Y28.9294 Z-4.5000 S1000
G1 F1000 X10.4098 Y29.0109 Z-4.5000 S1000
; Starting inflateGrp: Closed?:true
G1 F300 Z-6.0000
G1 F1000 X10.7570 Y29.2429 Z-6.0000 S1000
G1 F1000 X10.9890 Y29.5901 Z-6.0000 S1000
G1 F1000 X11.0705 Y30.0000 Z-6.0000 S1000
G1 F1000 X10.9890 Y30.4099 Z-6.0000 S1000
G1 F1000 X10.7570 Y30.7571 Z-6.0000 S1000
G1 F1000 X10.4098 Y30.9891 Z-6.0000 S1000
G1 F1000 X9.9999 Y31.0706 Z-6.0000 S1000
G1 F1000 X9.5901 Y30.9891 Z-6.0000 S1000
G1 F1000 X9.2429 Y30.7571 Z-6.0000 S1000
G1 F1000 X9.0109 Y30.4099 Z-6.0000 S1000
G1 F1000 X8.9294 Y30.0000 Z-6.0000 S1000
G1 F1000 X9.0109 Y29.5901 Z-6.0000 S1000
G1 F1000 X9.2429 Y29.2429 Z-6.0000 S1000
G1 F1000 X9.5901 Y29.0109 Z-6.0000 S1000
G1 F1000 X9.9999 Y28.9294 Z-6.0000 S1000
G1 F1000 X10.4098 Y29.0109 Z-6.0000 S1000
; Starting inflateGrp: Closed?:true
G1 F300 Z-7.5000
G1 F1000 X10.7570 Y29.2429 Z-7.5000 S1000
G1 F1000 X10.9890 Y29.5901 Z-7.5000 S1000
G1 F1000 X11.0705 Y30.0000 Z-7.5000 S1000
G1 F1000 X10.9890 Y30.4099 Z-7.5000 S1000
G1 F1000 X10.7570 Y30.7571 Z-7.5000 S1000
G1 F1000 X10.4098 Y30.9891 Z-7.5000 S1000
G1 F1000 X9.9999 Y31.0706 Z-7.5000 S1000
G1 F1000 X9.5901 Y30.9891 Z-7.5000 S1000
G1 F1000 X9.2429 Y30.7571 Z-7.5000 S1000
G1 F1000 X9.0109 Y30.4099 Z-7.5000 S1000
G1 F1000 X8.9294 Y30.0000 Z-7.5000 S1000
G1 F1000 X9.0109 Y29.5901 Z-7.5000 S1000
G1 F1000 X9.2429 Y29.2429 Z-7.5000 S1000
G1 F1000 X9.5901 Y29.0109 Z-7.5000 S1000
G1 F1000 X9.9999 Y28.9294 Z-7.5000 S1000
G1 F1000 X10.4098 Y29.0109 Z-7.5000 S1000
; Starting inflateGrp: Closed?:true
G1 F300 Z-9.0000
G1 F1000 X10.7570 Y29.2429 Z-9.0000 S1000
G1 F1000 X10.9890 Y29.5901 Z-9.0000 S1000
G1 F1000 X11.0705 Y30.0000 Z-9.0000 S1000
G1 F1000 X10.9890 Y30.4099 Z-9.0000 S1000
G1 F1000 X10.7570 Y30.7571 Z-9.0000 S1000
G1 F1000 X10.4098 Y30.9891 Z-9.0000 S1000
G1 F1000 X9.9999 Y31.0706 Z-9.0000 S1000
G1 F1000 X9.5901 Y30.9891 Z-9.0000 S1000
G1 F1000 X9.2429 Y30.7571 Z-9.0000 S1000
G1 F1000 X9.0109 Y30.4099 Z-9.0000 S1000
G1 F1000 X8.9294 Y30.0000 Z-9.0000 S1000
G1 F1000 X9.0109 Y29.5901 Z-9.0000 S1000
G1 F1000 X9.2429 Y29.2429 Z-9.0000 S1000
G1 F1000 X9.5901 Y29.0109 Z-9.0000 S1000
G1 F1000 X9.9999 Y28.9294 Z-9.0000 S1000
G1 F1000 X10.4098 Y29.0109 Z-9.0000 S1000
; Starting inflateGrp: Closed?:true
G1 F300 Z-10.5000
G1 F1000 X10.7570 Y29.2429 Z-10.5000 S1000
G1 F1000 X10.9890 Y29.5901 Z-10.5000 S1000
G1 F1000 X11.0705 Y30.0000 Z-10.5000 S1000
G1 F1000 X10.9890 Y30.4099 Z-10.5000 S1000
G1 F1000 X10.7570 Y30.7571 Z-10.5000 S1000
G1 F1000 X10.4098 Y30.9891 Z-10.5000 S1000
G1 F1000 X9.9999 Y31.0706 Z-10.5000 S1000
G1 F1000 X9.5901 Y30.9891 Z-10.5000 S1000
G1 F1000 X9.2429 Y30.7571 Z-10.5000 S1000
G1 F1000 X9.0109 Y30.4099 Z-10.5000 S1000
G1 F1000 X8.9294 Y30.0000 Z-10.5000 S1000
G1 F1000 X9.0109 Y29.5901 Z-10.5000 S1000
G1 F1000 X9.2429 Y29.2429 Z-10.5000 S1000
G1 F1000 X9.5901 Y29.0109 Z-10.5000 S1000
G1 F1000 X9.9999 Y28.9294 Z-10.5000 S1000
G1 F1000 X10.4098 Y29.0109 Z-10.5000 S1000
; Starting inflateGrp: Closed?:true
G1 F300 Z-12.0000
G1 F1000 X10.7570 Y29.2429 Z-12.0000 S1000
G1 F1000 X10.9890 Y29.5901 Z-12.0000 S1000
G1 F1000 X11.0705 Y30.0000 Z-12.0000 S1000
G1 F1000 X10.9890 Y30.4099 Z-12.0000 S1000
G1 F1000 X10.7570 Y30.7571 Z-12.0000 S1000
G1 F1000 X10.4098 Y30.9891 Z-12.0000 S1000
G1 F1000 X9.9999 Y31.0706 Z-12.0000 S1000
G1 F1000 X9.5901 Y30.9891 Z-12.0000 S1000
G1 F1000 X9.2429 Y30.7571 Z-12.0000 S1000
G1 F1000 X9.0109 Y30.4099 Z-12.0000 S1000
G1 F1000 X8.9294 Y30.0000 Z-12.0000 S1000
G1 F1000 X9.0109 Y29.5901 Z-12.0000 S1000
G1 F1000 X9.2429 Y29.2429 Z-12.0000 S1000
G1 F1000 X9.5901 Y29.0109 Z-12.0000 S1000
G1 F1000 X9.9999 Y28.9294 Z-12.0000 S1000
G1 F1000 X10.4098 Y29.0109 Z-12.0000 S1000
; Starting inflateGrp: Closed?:true
G1 F300 Z-13.5000
G1 F1000 X10.7570 Y29.2429 Z-13.5000 S1000
G1 F1000 X10.9890 Y29.5901 Z-13.5000 S1000
G1 F1000 X11.0705 Y30.0000 Z-13.5000 S1000
G1 F1000 X10.9890 Y30.4099 Z-13.5000 S1000
G1 F1000 X10.7570 Y30.7571 Z-13.5000 S1000
G1 F1000 X10.4098 Y30.9891 Z-13.5000 S1000
G1 F1000 X9.9999 Y31.0706 Z-13.5000 S1000
G1 F1000 X9.5901 Y30.9891 Z-13.5000 S1000
G1 F1000 X9.2429 Y30.7571 Z-13.5000 S1000
G1 F1000 X9.0109 Y30.4099 Z-13.5000 S1000
G1 F1000 X8.9294 Y30.0000 Z-13.5000 S1000
G1 F1000 X9.0109 Y29.5901 Z-13.5000 S1000
G1 F1000 X9.2429 Y29.2429 Z-13.5000 S1000
G1 F1000 X9.5901 Y29.0109 Z-13.5000 S1000
G1 F1000 X9.9999 Y28.9294 Z-13.5000 S1000
G1 F1000 X10.4098 Y29.0109 Z-13.5000 S1000
; Starting inflateGrp: Closed?:true
G1 F300 Z-15.0000
G1 F1000 X10.7570 Y29.2429 Z-15.0000 S1000
G1 F1000 X10.9890 Y29.5901 Z-15.0000 S1000
G1 F1000 X11.0705 Y30.0000 Z-15.0000 S1000
G1 F1000 X10.9890 Y30.4099 Z-15.0000 S1000
G1 F1000 X10.7570 Y30.7571 Z-15.0000 S1000
G1 F1000 X10.4098 Y30.9891 Z-15.0000 S1000
G1 F1000 X9.9999 Y31.0706 Z-15.0000 S1000
G1 F1000 X9.5901 Y30.9891 Z-15.0000 S1000
G1 F1000 X9.2429 Y30.7571 Z-15.0000 S1000
G1 F1000 X9.0109 Y30.4099 Z-15.0000 S1000
G1 F1000 X8.9294 Y30.0000 Z-15.0000 S1000
G1 F1000 X9.0109 Y29.5901 Z-15.0000 S1000
G1 F1000 X9.2429 Y29.2429 Z-15.0000 S1000
G1 F1000 X9.5901 Y29.0109 Z-15.0000 S1000
G1 F1000 X9.9999 Y28.9294 Z-15.0000 S1000
G1 F1000 X10.4098 Y29.0109 Z-15.0000 S1000
; Starting inflateGrp: Closed?:true
G1 F300 Z-16.5000
G1 F1000 X10.7570 Y29.2429 Z-16.5000 S1000
G1 F1000 X10.9890 Y29.5901 Z-16.5000 S1000
G1 F1000 X11.0705 Y30.0000 Z-16.5000 S1000
G1 F1000 X10.9890 Y30.4099 Z-16.5000 S1000
G1 F1000 X10.7570 Y30.7571 Z-16.5000 S1000
G1 F1000 X10.4098 Y30.9891 Z-16.5000 S1000
G1 F1000 X9.9999 Y31.0706 Z-16.5000 S1000
G1 F1000 X9.5901 Y30.9891 Z-16.5000 S1000
G1 F1000 X9.2429 Y30.7571 Z-16.5000 S1000
G1 F1000 X9.0109 Y30.4099 Z-16.5000 S1000
G1 F1000 X8.9294 Y30.0000 Z-16.5000 S1000
G1 F1000 X9.0109 Y29.5901 Z-16.5000 S1000
G1 F1000 X9.2429 Y29.2429 Z-16.5000 S1000
G1 F1000 X9.5901 Y29.0109 Z-16.5000 S1000
G1 F1000 X9.9999 Y28.9294 Z-16.5000 S1000
G1 F1000 X10.4098 Y29.0109 Z-16.5000 S1000
; Starting inflateGrp: Closed?:true
G1 F300 Z-18.0000
G1 F1000 X10.7570 Y29.2429 Z-18.0000 S1000
G1 F1000 X10.9890 Y29.5901 Z-18.0000 S1000
G1 F1000 X11.0705 Y30.0000 Z-18.0000 S1000
G1 F1000 X10.9890 Y30.4099 Z-18.0000 S1000
G1 F1000 X10.7570 Y30.7571 Z-18.0000 S1000
G1 F1000 X10.4098 Y30.9891 Z-18.0000 S1000
G1 F1000 X9.9999 Y31.0706 Z-18.0000 S1000
G1 F1000 X9.5901 Y30.9891 Z-18.0000 S1000
G1 F1000 X9.2429 Y30.7571 Z-18.0000 S1000
G1 F1000 X9.0109 Y30.4099 Z-18.0000 S1000
G1 F1000 X8.9294 Y30.0000 Z-18.0000 S1000
G1 F1000 X9.0109 Y29.5901 Z-18.0000 S1000
G1 F1000 X9.2429 Y29.2429 Z-18.0000 S1000
G1 F1000 X9.5901 Y29.0109 Z-18.0000 S1000
G1 F1000 X9.9999 Y28.9294 Z-18.0000 S1000
G1 F1000 X10.4098 Y29.0109 Z-18.0000 S1000
; Starting inflateGrp: Closed?:true
G1 F300 Z-19.2000
G1 F1000 X10.7570 Y29.2429 Z-19.2000 S1000
G1 F1000 X10.9890 Y29.5901 Z-19.2000 S1000
G1 F1000 X11.0705 Y30.0000 Z-19.2000 S1000
G1 F1000 X10.9890 Y30.4099 Z-19.2000 S1000
G1 F1000 X10.7570 Y30.7571 Z-19.2000 S1000
G1 F1000 X10.4098 Y30.9891 Z-19.2000 S1000
G1 F1000 X9.9999 Y31.0706 Z-19.2000 S1000
G1 F1000 X9.5901 Y30.9891 Z-19.2000 S1000
G1 F1000 X9.2429 Y30.7571 Z-19.2000 S1000
G1 F1000 X9.0109 Y30.4099 Z-19.2000 S1000
G1 F1000 X8.9294 Y30.0000 Z-19.2000 S1000
G1 F1000 X9.0109 Y29.5901 Z-19.2000 S1000
G1 F1000 X9.2429 Y29.2429 Z-19.2000 S1000
G1 F1000 X9.5901 Y29.0109 Z-19.2000 S1000
G1 F1000 X9.9999 Y28.9294 Z-19.2000 S1000
G1 F1000 X10.4098 Y29.0109 Z-19.2000 S1000
; Starting inflateGrp: Closed?:true

G0 Z10
G0 X10.4098 Y9.0109

G0 Z0
G1 F300 Z-1.5000
G1 F1000 X10.7570 Y9.2429 Z-1.5000 S1000
G1 F1000 X10.9890 Y9.5901 Z-1.5000 S1000
G1 F1000 X11.0705 Y10.0000 Z-1.5000 S1000
G1 F1000 X10.9890 Y10.4099 Z-1.5000 S1000
G1 F1000 X10.7570 Y10.7571 Z-1.5000 S1000
G1 F1000 X10.4098 Y10.9891 Z-1.5000 S1000
G1 F1000 X9.9999 Y11.0706 Z-1.5000 S1000
G1 F1000 X9.5901 Y10.9891 Z-1.5000 S1000
G1 F1000 X9.2429 Y10.7571 Z-1.5000 S1000
G1 F1000 X9.0109 Y10.4099 Z-1.5000 S1000
G1 F1000 X8.9294 Y10.0000 Z-1.5000 S1000
G1 F1000 X9.0109 Y9.5901 Z-1.5000 S1000
G1 F1000 X9.2429 Y9.2429 Z-1.5000 S1000
G1 F1000 X9.5901 Y9.0109 Z-1.5000 S1000
G1 F1000 X9.9999 Y8.9294 Z-1.5000 S1000
G1 F1000 X10.4098 Y9.0109 Z-1.5000 S1000
; Starting inflateGrp: Closed?:true
G1 F300 Z-3.0000
G1 F1000 X10.7570 Y9.2429 Z-3.0000 S1000
G1 F1000 X10.9890 Y9.5901 Z-3.0000 S1000
G1 F1000 X11.0705 Y10.0000 Z-3.0000 S1000
G1 F1000 X10.9890 Y10.4099 Z-3.0000 S1000
G1 F1000 X10.7570 Y10.7571 Z-3.0000 S1000
G1 F1000 X10.4098 Y10.9891 Z-3.0000 S1000
G1 F1000 X9.9999 Y11.0706 Z-3.0000 S1000
G1 F1000 X9.5901 Y10.9891 Z-3.0000 S1000
G1 F1000 X9.2429 Y10.7571 Z-3.0000 S1000
G1 F1000 X9.0109 Y10.4099 Z-3.0000 S1000
G1 F1000 X8.9294 Y10.0000 Z-3.0000 S1000
G1 F1000 X9.0109 Y9.5901 Z-3.0000 S1000
G1 F1000 X9.2429 Y9.2429 Z-3.0000 S1000
G1 F1000 X9.5901 Y9.0109 Z-3.0000 S1000
G1 F1000 X9.9999 Y8.9294 Z-3.0000 S1000
G1 F1000 X10.4098 Y9.0109 Z-3.0000 S1000
; Starting inflateGrp: Closed?:true
G1 F300 Z-4.5000
G1 F1000 X10.7570 Y9.2429 Z-4.5000 S1000
G1 F1000 X10.9890 Y9.5901 Z-4.5000 S1000
G1 F1000 X11.0705 Y10.0000 Z-4.5000 S1000
G1 F1000 X10.9890 Y10.4099 Z-4.5000 S1000
G1 F1000 X10.7570 Y10.7571 Z-4.5000 S1000
G1 F1000 X10.4098 Y10.9891 Z-4.5000 S1000
G1 F1000 X9.9999 Y11.0706 Z-4.5000 S1000
G1 F1000 X9.5901 Y10.9891 Z-4.5000 S1000
G1 F1000 X9.2429 Y10.7571 Z-4.5000 S1000
G1 F1000 X9.0109 Y10.4099 Z-4.5000 S1000
G1 F1000 X8.9294 Y10.0000 Z-4.5000 S1000
G1 F1000 X9.0109 Y9.5901 Z-4.5000 S1000
G1 F1000 X9.2429 Y9.2429 Z-4.5000 S1000
G1 F1000 X9.5901 Y9.0109 Z-4.5000 S1000
G1 F1000 X9.9999 Y8.9294 Z-4.5000 S1000
G1 F1000 X10.4098 Y9.0109 Z-4.5000 S1000
; Starting inflateGrp: Closed?:true
G1 F300 Z-6.0000
G1 F1000 X10.7570 Y9.2429 Z-6.0000 S1000
G1 F1000 X10.9890 Y9.5901 Z-6.0000 S1000
G1 F1000 X11.0705 Y10.0000 Z-6.0000 S1000
G1 F1000 X10.9890 Y10.4099 Z-6.0000 S1000
G1 F1000 X10.7570 Y10.7571 Z-6.0000 S1000
G1 F1000 X10.4098 Y10.9891 Z-6.0000 S1000
G1 F1000 X9.9999 Y11.0706 Z-6.0000 S1000
G1 F1000 X9.5901 Y10.9891 Z-6.0000 S1000
G1 F1000 X9.2429 Y10.7571 Z-6.0000 S1000
G1 F1000 X9.0109 Y10.4099 Z-6.0000 S1000
G1 F1000 X8.9294 Y10.0000 Z-6.0000 S1000
G1 F1000 X9.0109 Y9.5901 Z-6.0000 S1000
G1 F1000 X9.2429 Y9.2429 Z-6.0000 S1000
G1 F1000 X9.5901 Y9.0109 Z-6.0000 S1000
G1 F1000 X9.9999 Y8.9294 Z-6.0000 S1000
G1 F1000 X10.4098 Y9.0109 Z-6.0000 S1000
; Starting inflateGrp: Closed?:true
G1 F300 Z-7.5000
G1 F1000 X10.7570 Y9.2429 Z-7.5000 S1000
G1 F1000 X10.9890 Y9.5901 Z-7.5000 S1000
G1 F1000 X11.0705 Y10.0000 Z-7.5000 S1000
G1 F1000 X10.9890 Y10.4099 Z-7.5000 S1000
G1 F1000 X10.7570 Y10.7571 Z-7.5000 S1000
G1 F1000 X10.4098 Y10.9891 Z-7.5000 S1000
G1 F1000 X9.9999 Y11.0706 Z-7.5000 S1000
G1 F1000 X9.5901 Y10.9891 Z-7.5000 S1000
G1 F1000 X9.2429 Y10.7571 Z-7.5000 S1000
G1 F1000 X9.0109 Y10.4099 Z-7.5000 S1000
G1 F1000 X8.9294 Y10.0000 Z-7.5000 S1000
G1 F1000 X9.0109 Y9.5901 Z-7.5000 S1000
G1 F1000 X9.2429 Y9.2429 Z-7.5000 S1000
G1 F1000 X9.5901 Y9.0109 Z-7.5000 S1000
G1 F1000 X9.9999 Y8.9294 Z-7.5000 S1000
G1 F1000 X10.4098 Y9.0109 Z-7.5000 S1000
; Starting inflateGrp: Closed?:true
G1 F300 Z-9.0000
G1 F1000 X10.7570 Y9.2429 Z-9.0000 S1000
G1 F1000 X10.9890 Y9.5901 Z-9.0000 S1000
G1 F1000 X11.0705 Y10.0000 Z-9.0000 S1000
G1 F1000 X10.9890 Y10.4099 Z-9.0000 S1000
G1 F1000 X10.7570 Y10.7571 Z-9.0000 S1000
G1 F1000 X10.4098 Y10.9891 Z-9.0000 S1000
G1 F1000 X9.9999 Y11.0706 Z-9.0000 S1000
G1 F1000 X9.5901 Y10.9891 Z-9.0000 S1000
G1 F1000 X9.2429 Y10.7571 Z-9.0000 S1000
G1 F1000 X9.0109 Y10.4099 Z-9.0000 S1000
G1 F1000 X8.9294 Y10.0000 Z-9.0000 S1000
G1 F1000 X9.0109 Y9.5901 Z-9.0000 S1000
G1 F1000 X9.2429 Y9.2429 Z-9.0000 S1000
G1 F1000 X9.5901 Y9.0109 Z-9.0000 S1000
G1 F1000 X9.9999 Y8.9294 Z-9.0000 S1000
G1 F1000 X10.4098 Y9.0109 Z-9.0000 S1000
; Starting inflateGrp: Closed?:true
G1 F300 Z-10.5000
G1 F1000 X10.7570 Y9.2429 Z-10.5000 S1000
G1 F1000 X10.9890 Y9.5901 Z-10.5000 S1000
G1 F1000 X11.0705 Y10.0000 Z-10.5000 S1000
G1 F1000 X10.9890 Y10.4099 Z-10.5000 S1000
G1 F1000 X10.7570 Y10.7571 Z-10.5000 S1000
G1 F1000 X10.4098 Y10.9891 Z-10.5000 S1000
G1 F1000 X9.9999 Y11.0706 Z-10.5000 S1000
G1 F1000 X9.5901 Y10.9891 Z-10.5000 S1000
G1 F1000 X9.2429 Y10.7571 Z-10.5000 S1000
G1 F1000 X9.0109 Y10.4099 Z-10.5000 S1000
G1 F1000 X8.9294 Y10.0000 Z-10.5000 S1000
G1 F1000 X9.0109 Y9.5901 Z-10.5000 S1000
G1 F1000 X9.2429 Y9.2429 Z-10.5000 S1000
G1 F1000 X9.5901 Y9.0109 Z-10.5000 S1000
G1 F1000 X9.9999 Y8.9294 Z-10.5000 S1000
G1 F1000 X10.4098 Y9.0109 Z-10.5000 S1000
; Starting inflateGrp: Closed?:true
G1 F300 Z-12.0000
G1 F1000 X10.7570 Y9.2429 Z-12.0000 S1000
G1 F1000 X10.9890 Y9.5901 Z-12.0000 S1000
G1 F1000 X11.0705 Y10.0000 Z-12.0000 S1000
G1 F1000 X10.9890 Y10.4099 Z-12.0000 S1000
G1 F1000 X10.7570 Y10.7571 Z-12.0000 S1000
G1 F1000 X10.4098 Y10.9891 Z-12.0000 S1000
G1 F1000 X9.9999 Y11.0706 Z-12.0000 S1000
G1 F1000 X9.5901 Y10.9891 Z-12.0000 S1000
G1 F1000 X9.2429 Y10.7571 Z-12.0000 S1000
G1 F1000 X9.0109 Y10.4099 Z-12.0000 S1000
G1 F1000 X8.9294 Y10.0000 Z-12.0000 S1000
G1 F1000 X9.0109 Y9.5901 Z-12.0000 S1000
G1 F1000 X9.2429 Y9.2429 Z-12.0000 S1000
G1 F1000 X9.5901 Y9.0109 Z-12.0000 S1000
G1 F1000 X9.9999 Y8.9294 Z-12.0000 S1000
G1 F1000 X10.4098 Y9.0109 Z-12.0000 S1000
; Starting inflateGrp: Closed?:true
G1 F300 Z-13.5000
G1 F1000 X10.7570 Y9.2429 Z-13.5000 S1000
G1 F1000 X10.9890 Y9.5901 Z-13.5000 S1000
G1 F1000 X11.0705 Y10.0000 Z-13.5000 S1000
G1 F1000 X10.9890 Y10.4099 Z-13.5000 S1000
G1 F1000 X10.7570 Y10.7571 Z-13.5000 S1000
G1 F1000 X10.4098 Y10.9891 Z-13.5000 S1000
G1 F1000 X9.9999 Y11.0706 Z-13.5000 S1000
G1 F1000 X9.5901 Y10.9891 Z-13.5000 S1000
G1 F1000 X9.2429 Y10.7571 Z-13.5000 S1000
G1 F1000 X9.0109 Y10.4099 Z-13.5000 S1000
G1 F1000 X8.9294 Y10.0000 Z-13.5000 S1000
G1 F1000 X9.0109 Y9.5901 Z-13.5000 S1000
G1 F1000 X9.2429 Y9.2429 Z-13.5000 S1000
G1 F1000 X9.5901 Y9.0109 Z-13.5000 S1000
G1 F1000 X9.9999 Y8.9294 Z-13.5000 S1000
G1 F1000 X10.4098 Y9.0109 Z-13.5000 S1000
; Starting inflateGrp: Closed?:true
G1 F300 Z-15.0000
G1 F1000 X10.7570 Y9.2429 Z-15.0000 S1000
G1 F1000 X10.9890 Y9.5901 Z-15.0000 S1000
G1 F1000 X11.0705 Y10.0000 Z-15.0000 S1000
G1 F1000 X10.9890 Y10.4099 Z-15.0000 S1000
G1 F1000 X10.7570 Y10.7571 Z-15.0000 S1000
G1 F1000 X10.4098 Y10.9891 Z-15.0000 S1000
G1 F1000 X9.9999 Y11.0706 Z-15.0000 S1000
G1 F1000 X9.5901 Y10.9891 Z-15.0000 S1000
G1 F1000 X9.2429 Y10.7571 Z-15.0000 S1000
G1 F1000 X9.0109 Y10.4099 Z-15.0000 S1000
G1 F1000 X8.9294 Y10.0000 Z-15.0000 S1000
G1 F1000 X9.0109 Y9.5901 Z-15.0000 S1000
G1 F1000 X9.2429 Y9.2429 Z-15.0000 S1000
G1 F1000 X9.5901 Y9.0109 Z-15.0000 S1000
G1 F1000 X9.9999 Y8.9294 Z-15.0000 S1000
G1 F1000 X10.4098 Y9.0109 Z-15.0000 S1000
; Starting inflateGrp: Closed?:true
G1 F300 Z-16.5000
G1 F1000 X10.7570 Y9.2429 Z-16.5000 S1000
G1 F1000 X10.9890 Y9.5901 Z-16.5000 S1000
G1 F1000 X11.0705 Y10.0000 Z-16.5000 S1000
G1 F1000 X10.9890 Y10.4099 Z-16.5000 S1000
G1 F1000 X10.7570 Y10.7571 Z-16.5000 S1000
G1 F1000 X10.4098 Y10.9891 Z-16.5000 S1000
G1 F1000 X9.9999 Y11.0706 Z-16.5000 S1000
G1 F1000 X9.5901 Y10.9891 Z-16.5000 S1000
G1 F1000 X9.2429 Y10.7571 Z-16.5000 S1000
G1 F1000 X9.0109 Y10.4099 Z-16.5000 S1000
G1 F1000 X8.9294 Y10.0000 Z-16.5000 S1000
G1 F1000 X9.0109 Y9.5901 Z-16.5000 S1000
G1 F1000 X9.2429 Y9.2429 Z-16.5000 S1000
G1 F1000 X9.5901 Y9.0109 Z-16.5000 S1000
G1 F1000 X9.9999 Y8.9294 Z-16.5000 S1000
G1 F1000 X10.4098 Y9.0109 Z-16.5000 S1000
; Starting inflateGrp: Closed?:true
G1 F300 Z-18.0000
G1 F1000 X10.7570 Y9.2429 Z-18.0000 S1000
G1 F1000 X10.9890 Y9.5901 Z-18.0000 S1000
G1 F1000 X11.0705 Y10.0000 Z-18.0000 S1000
G1 F1000 X10.9890 Y10.4099 Z-18.0000 S1000
G1 F1000 X10.7570 Y10.7571 Z-18.0000 S1000
G1 F1000 X10.4098 Y10.9891 Z-18.0000 S1000
G1 F1000 X9.9999 Y11.0706 Z-18.0000 S1000
G1 F1000 X9.5901 Y10.9891 Z-18.0000 S1000
G1 F1000 X9.2429 Y10.7571 Z-18.0000 S1000
G1 F1000 X9.0109 Y10.4099 Z-18.0000 S1000
G1 F1000 X8.9294 Y10.0000 Z-18.0000 S1000
G1 F1000 X9.0109 Y9.5901 Z-18.0000 S1000
G1 F1000 X9.2429 Y9.2429 Z-18.0000 S1000
G1 F1000 X9.5901 Y9.0109 Z-18.0000 S1000
G1 F1000 X9.9999 Y8.9294 Z-18.0000 S1000
G1 F1000 X10.4098 Y9.0109 Z-18.0000 S1000
; Starting inflateGrp: Closed?:true
G1 F300 Z-19.2000
G1 F1000 X10.7570 Y9.2429 Z-19.2000 S1000
G1 F1000 X10.9890 Y9.5901 Z-19.2000 S1000
G1 F1000 X11.0705 Y10.0000 Z-19.2000 S1000
G1 F1000 X10.9890 Y10.4099 Z-19.2000 S1000
G1 F1000 X10.7570 Y10.7571 Z-19.2000 S1000
G1 F1000 X10.4098 Y10.9891 Z-19.2000 S1000
G1 F1000 X9.9999 Y11.0706 Z-19.2000 S1000
G1 F1000 X9.5901 Y10.9891 Z-19.2000 S1000
G1 F1000 X9.2429 Y10.7571 Z-19.2000 S1000
G1 F1000 X9.0109 Y10.4099 Z-19.2000 S1000
G1 F1000 X8.9294 Y10.0000 Z-19.2000 S1000
G1 F1000 X9.0109 Y9.5901 Z-19.2000 S1000
G1 F1000 X9.2429 Y9.2429 Z-19.2000 S1000
G1 F1000 X9.5901 Y9.0109 Z-19.2000 S1000
G1 F1000 X9.9999 Y8.9294 Z-19.2000 S1000
G1 F1000 X10.4098 Y9.0109 Z-19.2000 S1000
; Starting inflateGrp: Closed?:true

G0 Z10
G0 X130.4098 Y9.0109

G0 Z0
G1 F300 Z-1.5000
G1 F1000 X130.7570 Y9.2429 Z-1.5000 S1000
G1 F1000 X130.9890 Y9.5901 Z-1.5000 S1000
G1 F1000 X131.0705 Y10.0000 Z-1.5000 S1000
G1 F1000 X130.9890 Y10.4099 Z-1.5000 S1000
G1 F1000 X130.7570 Y10.7571 Z-1.5000 S1000
G1 F1000 X130.4098 Y10.9891 Z-1.5000 S1000
G1 F1000 X129.9999 Y11.0706 Z-1.5000 S1000
G1 F1000 X129.5901 Y10.9891 Z-1.5000 S1000
G1 F1000 X129.2429 Y10.7571 Z-1.5000 S1000
G1 F1000 X129.0109 Y10.4099 Z-1.5000 S1000
G1 F1000 X128.9294 Y10.0000 Z-1.5000 S1000
G1 F1000 X129.0109 Y9.5901 Z-1.5000 S1000
G1 F1000 X129.2429 Y9.2429 Z-1.5000 S1000
G1 F1000 X129.5901 Y9.0109 Z-1.5000 S1000
G1 F1000 X129.9999 Y8.9294 Z-1.5000 S1000
G1 F1000 X130.4098 Y9.0109 Z-1.5000 S1000
; Starting inflateGrp: Closed?:true
G1 F300 Z-3.0000
G1 F1000 X130.7570 Y9.2429 Z-3.0000 S1000
G1 F1000 X130.9890 Y9.5901 Z-3.0000 S1000
G1 F1000 X131.0705 Y10.0000 Z-3.0000 S1000
G1 F1000 X130.9890 Y10.4099 Z-3.0000 S1000
G1 F1000 X130.7570 Y10.7571 Z-3.0000 S1000
G1 F1000 X130.4098 Y10.9891 Z-3.0000 S1000
G1 F1000 X129.9999 Y11.0706 Z-3.0000 S1000
G1 F1000 X129.5901 Y10.9891 Z-3.0000 S1000
G1 F1000 X129.2429 Y10.7571 Z-3.0000 S1000
G1 F1000 X129.0109 Y10.4099 Z-3.0000 S1000
G1 F1000 X128.9294 Y10.0000 Z-3.0000 S1000
G1 F1000 X129.0109 Y9.5901 Z-3.0000 S1000
G1 F1000 X129.2429 Y9.2429 Z-3.0000 S1000
G1 F1000 X129.5901 Y9.0109 Z-3.0000 S1000
G1 F1000 X129.9999 Y8.9294 Z-3.0000 S1000
G1 F1000 X130.4098 Y9.0109 Z-3.0000 S1000
; Starting inflateGrp: Closed?:true
G1 F300 Z-4.5000
G1 F1000 X130.7570 Y9.2429 Z-4.5000 S1000
G1 F1000 X130.9890 Y9.5901 Z-4.5000 S1000
G1 F1000 X131.0705 Y10.0000 Z-4.5000 S1000
G1 F1000 X130.9890 Y10.4099 Z-4.5000 S1000
G1 F1000 X130.7570 Y10.7571 Z-4.5000 S1000
G1 F1000 X130.4098 Y10.9891 Z-4.5000 S1000
G1 F1000 X129.9999 Y11.0706 Z-4.5000 S1000
G1 F1000 X129.5901 Y10.9891 Z-4.5000 S1000
G1 F1000 X129.2429 Y10.7571 Z-4.5000 S1000
G1 F1000 X129.0109 Y10.4099 Z-4.5000 S1000
G1 F1000 X128.9294 Y10.0000 Z-4.5000 S1000
G1 F1000 X129.0109 Y9.5901 Z-4.5000 S1000
G1 F1000 X129.2429 Y9.2429 Z-4.5000 S1000
G1 F1000 X129.5901 Y9.0109 Z-4.5000 S1000
G1 F1000 X129.9999 Y8.9294 Z-4.5000 S1000
G1 F1000 X130.4098 Y9.0109 Z-4.5000 S1000
; Starting inflateGrp: Closed?:true
G1 F300 Z-6.0000
G1 F1000 X130.7570 Y9.2429 Z-6.0000 S1000
G1 F1000 X130.9890 Y9.5901 Z-6.0000 S1000
G1 F1000 X131.0705 Y10.0000 Z-6.0000 S1000
G1 F1000 X130.9890 Y10.4099 Z-6.0000 S1000
G1 F1000 X130.7570 Y10.7571 Z-6.0000 S1000
G1 F1000 X130.4098 Y10.9891 Z-6.0000 S1000
G1 F1000 X129.9999 Y11.0706 Z-6.0000 S1000
G1 F1000 X129.5901 Y10.9891 Z-6.0000 S1000
G1 F1000 X129.2429 Y10.7571 Z-6.0000 S1000
G1 F1000 X129.0109 Y10.4099 Z-6.0000 S1000
G1 F1000 X128.9294 Y10.0000 Z-6.0000 S1000
G1 F1000 X129.0109 Y9.5901 Z-6.0000 S1000
G1 F1000 X129.2429 Y9.2429 Z-6.0000 S1000
G1 F1000 X129.5901 Y9.0109 Z-6.0000 S1000
G1 F1000 X129.9999 Y8.9294 Z-6.0000 S1000
G1 F1000 X130.4098 Y9.0109 Z-6.0000 S1000
; Starting inflateGrp: Closed?:true
G1 F300 Z-7.5000
G1 F1000 X130.7570 Y9.2429 Z-7.5000 S1000
G1 F1000 X130.9890 Y9.5901 Z-7.5000 S1000
G1 F1000 X131.0705 Y10.0000 Z-7.5000 S1000
G1 F1000 X130.9890 Y10.4099 Z-7.5000 S1000
G1 F1000 X130.7570 Y10.7571 Z-7.5000 S1000
G1 F1000 X130.4098 Y10.9891 Z-7.5000 S1000
G1 F1000 X129.9999 Y11.0706 Z-7.5000 S1000
G1 F1000 X129.5901 Y10.9891 Z-7.5000 S1000
G1 F1000 X129.2429 Y10.7571 Z-7.5000 S1000
G1 F1000 X129.0109 Y10.4099 Z-7.5000 S1000
G1 F1000 X128.9294 Y10.0000 Z-7.5000 S1000
G1 F1000 X129.0109 Y9.5901 Z-7.5000 S1000
G1 F1000 X129.2429 Y9.2429 Z-7.5000 S1000
G1 F1000 X129.5901 Y9.0109 Z-7.5000 S1000
G1 F1000 X129.9999 Y8.9294 Z-7.5000 S1000
G1 F1000 X130.4098 Y9.0109 Z-7.5000 S1000
; Starting inflateGrp: Closed?:true
G1 F300 Z-9.0000
G1 F1000 X130.7570 Y9.2429 Z-9.0000 S1000
G1 F1000 X130.9890 Y9.5901 Z-9.0000 S1000
G1 F1000 X131.0705 Y10.0000 Z-9.0000 S1000
G1 F1000 X130.9890 Y10.4099 Z-9.0000 S1000
G1 F1000 X130.7570 Y10.7571 Z-9.0000 S1000
G1 F1000 X130.4098 Y10.9891 Z-9.0000 S1000
G1 F1000 X129.9999 Y11.0706 Z-9.0000 S1000
G1 F1000 X129.5901 Y10.9891 Z-9.0000 S1000
G1 F1000 X129.2429 Y10.7571 Z-9.0000 S1000
G1 F1000 X129.0109 Y10.4099 Z-9.0000 S1000
G1 F1000 X128.9294 Y10.0000 Z-9.0000 S1000
G1 F1000 X129.0109 Y9.5901 Z-9.0000 S1000
G1 F1000 X129.2429 Y9.2429 Z-9.0000 S1000
G1 F1000 X129.5901 Y9.0109 Z-9.0000 S1000
G1 F1000 X129.9999 Y8.9294 Z-9.0000 S1000
G1 F1000 X130.4098 Y9.0109 Z-9.0000 S1000
; Starting inflateGrp: Closed?:true
G1 F300 Z-10.5000
G1 F1000 X130.7570 Y9.2429 Z-10.5000 S1000
G1 F1000 X130.9890 Y9.5901 Z-10.5000 S1000
G1 F1000 X131.0705 Y10.0000 Z-10.5000 S1000
G1 F1000 X130.9890 Y10.4099 Z-10.5000 S1000
G1 F1000 X130.7570 Y10.7571 Z-10.5000 S1000
G1 F1000 X130.4098 Y10.9891 Z-10.5000 S1000
G1 F1000 X129.9999 Y11.0706 Z-10.5000 S1000
G1 F1000 X129.5901 Y10.9891 Z-10.5000 S1000
G1 F1000 X129.2429 Y10.7571 Z-10.5000 S1000
G1 F1000 X129.0109 Y10.4099 Z-10.5000 S1000
G1 F1000 X128.9294 Y10.0000 Z-10.5000 S1000
G1 F1000 X129.0109 Y9.5901 Z-10.5000 S1000
G1 F1000 X129.2429 Y9.2429 Z-10.5000 S1000
G1 F1000 X129.5901 Y9.0109 Z-10.5000 S1000
G1 F1000 X129.9999 Y8.9294 Z-10.5000 S1000
G1 F1000 X130.4098 Y9.0109 Z-10.5000 S1000
; Starting inflateGrp: Closed?:true
G1 F300 Z-12.0000
G1 F1000 X130.7570 Y9.2429 Z-12.0000 S1000
G1 F1000 X130.9890 Y9.5901 Z-12.0000 S1000
G1 F1000 X131.0705 Y10.0000 Z-12.0000 S1000
G1 F1000 X130.9890 Y10.4099 Z-12.0000 S1000
G1 F1000 X130.7570 Y10.7571 Z-12.0000 S1000
G1 F1000 X130.4098 Y10.9891 Z-12.0000 S1000
G1 F1000 X129.9999 Y11.0706 Z-12.0000 S1000
G1 F1000 X129.5901 Y10.9891 Z-12.0000 S1000
G1 F1000 X129.2429 Y10.7571 Z-12.0000 S1000
G1 F1000 X129.0109 Y10.4099 Z-12.0000 S1000
G1 F1000 X128.9294 Y10.0000 Z-12.0000 S1000
G1 F1000 X129.0109 Y9.5901 Z-12.0000 S1000
G1 F1000 X129.2429 Y9.2429 Z-12.0000 S1000
G1 F1000 X129.5901 Y9.0109 Z-12.0000 S1000
G1 F1000 X129.9999 Y8.9294 Z-12.0000 S1000
G1 F1000 X130.4098 Y9.0109 Z-12.0000 S1000
; Starting inflateGrp: Closed?:true
G1 F300 Z-13.5000
G1 F1000 X130.7570 Y9.2429 Z-13.5000 S1000
G1 F1000 X130.9890 Y9.5901 Z-13.5000 S1000
G1 F1000 X131.0705 Y10.0000 Z-13.5000 S1000
G1 F1000 X130.9890 Y10.4099 Z-13.5000 S1000
G1 F1000 X130.7570 Y10.7571 Z-13.5000 S1000
G1 F1000 X130.4098 Y10.9891 Z-13.5000 S1000
G1 F1000 X129.9999 Y11.0706 Z-13.5000 S1000
G1 F1000 X129.5901 Y10.9891 Z-13.5000 S1000
G1 F1000 X129.2429 Y10.7571 Z-13.5000 S1000
G1 F1000 X129.0109 Y10.4099 Z-13.5000 S1000
G1 F1000 X128.9294 Y10.0000 Z-13.5000 S1000
G1 F1000 X129.0109 Y9.5901 Z-13.5000 S1000
G1 F1000 X129.2429 Y9.2429 Z-13.5000 S1000
G1 F1000 X129.5901 Y9.0109 Z-13.5000 S1000
G1 F1000 X129.9999 Y8.9294 Z-13.5000 S1000
G1 F1000 X130.4098 Y9.0109 Z-13.5000 S1000
; Starting inflateGrp: Closed?:true
G1 F300 Z-15.0000
G1 F1000 X130.7570 Y9.2429 Z-15.0000 S1000
G1 F1000 X130.9890 Y9.5901 Z-15.0000 S1000
G1 F1000 X131.0705 Y10.0000 Z-15.0000 S1000
G1 F1000 X130.9890 Y10.4099 Z-15.0000 S1000
G1 F1000 X130.7570 Y10.7571 Z-15.0000 S1000
G1 F1000 X130.4098 Y10.9891 Z-15.0000 S1000
G1 F1000 X129.9999 Y11.0706 Z-15.0000 S1000
G1 F1000 X129.5901 Y10.9891 Z-15.0000 S1000
G1 F1000 X129.2429 Y10.7571 Z-15.0000 S1000
G1 F1000 X129.0109 Y10.4099 Z-15.0000 S1000
G1 F1000 X128.9294 Y10.0000 Z-15.0000 S1000
G1 F1000 X129.0109 Y9.5901 Z-15.0000 S1000
G1 F1000 X129.2429 Y9.2429 Z-15.0000 S1000
G1 F1000 X129.5901 Y9.0109 Z-15.0000 S1000
G1 F1000 X129.9999 Y8.9294 Z-15.0000 S1000
G1 F1000 X130.4098 Y9.0109 Z-15.0000 S1000
; Starting inflateGrp: Closed?:true
G1 F300 Z-16.5000
G1 F1000 X130.7570 Y9.2429 Z-16.5000 S1000
G1 F1000 X130.9890 Y9.5901 Z-16.5000 S1000
G1 F1000 X131.0705 Y10.0000 Z-16.5000 S1000
G1 F1000 X130.9890 Y10.4099 Z-16.5000 S1000
G1 F1000 X130.7570 Y10.7571 Z-16.5000 S1000
G1 F1000 X130.4098 Y10.9891 Z-16.5000 S1000
G1 F1000 X129.9999 Y11.0706 Z-16.5000 S1000
G1 F1000 X129.5901 Y10.9891 Z-16.5000 S1000
G1 F1000 X129.2429 Y10.7571 Z-16.5000 S1000
G1 F1000 X129.0109 Y10.4099 Z-16.5000 S1000
G1 F1000 X128.9294 Y10.0000 Z-16.5000 S1000
G1 F1000 X129.0109 Y9.5901 Z-16.5000 S1000
G1 F1000 X129.2429 Y9.2429 Z-16.5000 S1000
G1 F1000 X129.5901 Y9.0109 Z-16.5000 S1000
G1 F1000 X129.9999 Y8.9294 Z-16.5000 S1000
G1 F1000 X130.4098 Y9.0109 Z-16.5000 S1000
; Starting inflateGrp: Closed?:true
G1 F300 Z-18.0000
G1 F1000 X130.7570 Y9.2429 Z-18.0000 S1000
G1 F1000 X130.9890 Y9.5901 Z-18.0000 S1000
G1 F1000 X131.0705 Y10.0000 Z-18.0000 S1000
G1 F1000 X130.9890 Y10.4099 Z-18.0000 S1000
G1 F1000 X130.7570 Y10.7571 Z-18.0000 S1000
G1 F1000 X130.4098 Y10.9891 Z-18.0000 S1000
G1 F1000 X129.9999 Y11.0706 Z-18.0000 S1000
G1 F1000 X129.5901 Y10.9891 Z-18.0000 S1000
G1 F1000 X129.2429 Y10.7571 Z-18.0000 S1000
G1 F1000 X129.0109 Y10.4099 Z-18.0000 S1000
G1 F1000 X128.9294 Y10.0000 Z-18.0000 S1000
G1 F1000 X129.0109 Y9.5901 Z-18.0000 S1000
G1 F1000 X129.2429 Y9.2429 Z-18.0000 S1000
G1 F1000 X129.5901 Y9.0109 Z-18.0000 S1000
G1 F1000 X129.9999 Y8.9294 Z-18.0000 S1000
G1 F1000 X130.4098 Y9.0109 Z-18.0000 S1000
; Starting inflateGrp: Closed?:true
G1 F300 Z-19.2000
G1 F1000 X130.7570 Y9.2429 Z-19.2000 S1000
G1 F1000 X130.9890 Y9.5901 Z-19.2000 S1000
G1 F1000 X131.0705 Y10.0000 Z-19.2000 S1000
G1 F1000 X130.9890 Y10.4099 Z-19.2000 S1000
G1 F1000 X130.7570 Y10.7571 Z-19.2000 S1000
G1 F1000 X130.4098 Y10.9891 Z-19.2000 S1000
G1 F1000 X129.9999 Y11.0706 Z-19.2000 S1000
G1 F1000 X129.5901 Y10.9891 Z-19.2000 S1000
G1 F1000 X129.2429 Y10.7571 Z-19.2000 S1000
G1 F1000 X129.0109 Y10.4099 Z-19.2000 S1000
G1 F1000 X128.9294 Y10.0000 Z-19.2000 S1000
G1 F1000 X129.0109 Y9.5901 Z-19.2000 S1000
G1 F1000 X129.2429 Y9.2429 Z-19.2000 S1000
G1 F1000 X129.5901 Y9.0109 Z-19.2000 S1000
G1 F1000 X129.9999 Y8.9294 Z-19.2000 S1000
G1 F1000 X130.4098 Y9.0109 Z-19.2000 S1000
; Starting inflateGrp: Closed?:true

G0 Z10
G0 X10.4098 Y129.0109

G0 Z0
G1 F300 Z-1.5000
G1 F1000 X10.7570 Y129.2429 Z-1.5000 S1000
G1 F1000 X10.9890 Y129.5901 Z-1.5000 S1000
G1 F1000 X11.0705 Y130.0000 Z-1.5000 S1000
G1 F1000 X10.9890 Y130.4099 Z-1.5000 S1000
G1 F1000 X10.7570 Y130.7571 Z-1.5000 S1000
G1 F1000 X10.4098 Y130.9891 Z-1.5000 S1000
G1 F1000 X9.9999 Y131.0706 Z-1.5000 S1000
G1 F1000 X9.5901 Y130.9891 Z-1.5000 S1000
G1 F1000 X9.2429 Y130.7571 Z-1.5000 S1000
G1 F1000 X9.0109 Y130.4099 Z-1.5000 S1000
G1 F1000 X8.9294 Y130.0000 Z-1.5000 S1000
G1 F1000 X9.0109 Y129.5901 Z-1.5000 S1000
G1 F1000 X9.2429 Y129.2429 Z-1.5000 S1000
G1 F1000 X9.5901 Y129.0109 Z-1.5000 S1000
G1 F1000 X9.9999 Y128.9294 Z-1.5000 S1000
G1 F1000 X10.4098 Y129.0109 Z-1.5000 S1000
; Starting inflateGrp: Closed?:true
G1 F300 Z-3.0000
G1 F1000 X10.7570 Y129.2429 Z-3.0000 S1000
G1 F1000 X10.9890 Y129.5901 Z-3.0000 S1000
G1 F1000 X11.0705 Y130.0000 Z-3.0000 S1000
G1 F1000 X10.9890 Y130.4099 Z-3.0000 S1000
G1 F1000 X10.7570 Y130.7571 Z-3.0000 S1000
G1 F1000 X10.4098 Y130.9891 Z-3.0000 S1000
G1 F1000 X9.9999 Y131.0706 Z-3.0000 S1000
G1 F1000 X9.5901 Y130.9891 Z-3.0000 S1000
G1 F1000 X9.2429 Y130.7571 Z-3.0000 S1000
G1 F1000 X9.0109 Y130.4099 Z-3.0000 S1000
G1 F1000 X8.9294 Y130.0000 Z-3.0000 S1000
G1 F1000 X9.0109 Y129.5901 Z-3.0000 S1000
G1 F1000 X9.2429 Y129.2429 Z-3.0000 S1000
G1 F1000 X9.5901 Y129.0109 Z-3.0000 S1000
G1 F1000 X9.9999 Y128.9294 Z-3.0000 S1000
G1 F1000 X10.4098 Y129.0109 Z-3.0000 S1000
; Starting inflateGrp: Closed?:true
G1 F300 Z-4.5000
G1 F1000 X10.7570 Y129.2429 Z-4.5000 S1000
G1 F1000 X10.9890 Y129.5901 Z-4.5000 S1000
G1 F1000 X11.0705 Y130.0000 Z-4.5000 S1000
G1 F1000 X10.9890 Y130.4099 Z-4.5000 S1000
G1 F1000 X10.7570 Y130.7571 Z-4.5000 S1000
G1 F1000 X10.4098 Y130.9891 Z-4.5000 S1000
G1 F1000 X9.9999 Y131.0706 Z-4.5000 S1000
G1 F1000 X9.5901 Y130.9891 Z-4.5000 S1000
G1 F1000 X9.2429 Y130.7571 Z-4.5000 S1000
G1 F1000 X9.0109 Y130.4099 Z-4.5000 S1000
G1 F1000 X8.9294 Y130.0000 Z-4.5000 S1000
G1 F1000 X9.0109 Y129.5901 Z-4.5000 S1000
G1 F1000 X9.2429 Y129.2429 Z-4.5000 S1000
G1 F1000 X9.5901 Y129.0109 Z-4.5000 S1000
G1 F1000 X9.9999 Y128.9294 Z-4.5000 S1000
G1 F1000 X10.4098 Y129.0109 Z-4.5000 S1000
; Starting inflateGrp: Closed?:true
G1 F300 Z-6.0000
G1 F1000 X10.7570 Y129.2429 Z-6.0000 S1000
G1 F1000 X10.9890 Y129.5901 Z-6.0000 S1000
G1 F1000 X11.0705 Y130.0000 Z-6.0000 S1000
G1 F1000 X10.9890 Y130.4099 Z-6.0000 S1000
G1 F1000 X10.7570 Y130.7571 Z-6.0000 S1000
G1 F1000 X10.4098 Y130.9891 Z-6.0000 S1000
G1 F1000 X9.9999 Y131.0706 Z-6.0000 S1000
G1 F1000 X9.5901 Y130.9891 Z-6.0000 S1000
G1 F1000 X9.2429 Y130.7571 Z-6.0000 S1000
G1 F1000 X9.0109 Y130.4099 Z-6.0000 S1000
G1 F1000 X8.9294 Y130.0000 Z-6.0000 S1000
G1 F1000 X9.0109 Y129.5901 Z-6.0000 S1000
G1 F1000 X9.2429 Y129.2429 Z-6.0000 S1000
G1 F1000 X9.5901 Y129.0109 Z-6.0000 S1000
G1 F1000 X9.9999 Y128.9294 Z-6.0000 S1000
G1 F1000 X10.4098 Y129.0109 Z-6.0000 S1000
; Starting inflateGrp: Closed?:true
G1 F300 Z-7.5000
G1 F1000 X10.7570 Y129.2429 Z-7.5000 S1000
G1 F1000 X10.9890 Y129.5901 Z-7.5000 S1000
G1 F1000 X11.0705 Y130.0000 Z-7.5000 S1000
G1 F1000 X10.9890 Y130.4099 Z-7.5000 S1000
G1 F1000 X10.7570 Y130.7571 Z-7.5000 S1000
G1 F1000 X10.4098 Y130.9891 Z-7.5000 S1000
G1 F1000 X9.9999 Y131.0706 Z-7.5000 S1000
G1 F1000 X9.5901 Y130.9891 Z-7.5000 S1000
G1 F1000 X9.2429 Y130.7571 Z-7.5000 S1000
G1 F1000 X9.0109 Y130.4099 Z-7.5000 S1000
G1 F1000 X8.9294 Y130.0000 Z-7.5000 S1000
G1 F1000 X9.0109 Y129.5901 Z-7.5000 S1000
G1 F1000 X9.2429 Y129.2429 Z-7.5000 S1000
G1 F1000 X9.5901 Y129.0109 Z-7.5000 S1000
G1 F1000 X9.9999 Y128.9294 Z-7.5000 S1000
G1 F1000 X10.4098 Y129.0109 Z-7.5000 S1000
; Starting inflateGrp: Closed?:true
G1 F300 Z-9.0000
G1 F1000 X10.7570 Y129.2429 Z-9.0000 S1000
G1 F1000 X10.9890 Y129.5901 Z-9.0000 S1000
G1 F1000 X11.0705 Y130.0000 Z-9.0000 S1000
G1 F1000 X10.9890 Y130.4099 Z-9.0000 S1000
G1 F1000 X10.7570 Y130.7571 Z-9.0000 S1000
G1 F1000 X10.4098 Y130.9891 Z-9.0000 S1000
G1 F1000 X9.9999 Y131.0706 Z-9.0000 S1000
G1 F1000 X9.5901 Y130.9891 Z-9.0000 S1000
G1 F1000 X9.2429 Y130.7571 Z-9.0000 S1000
G1 F1000 X9.0109 Y130.4099 Z-9.0000 S1000
G1 F1000 X8.9294 Y130.0000 Z-9.0000 S1000
G1 F1000 X9.0109 Y129.5901 Z-9.0000 S1000
G1 F1000 X9.2429 Y129.2429 Z-9.0000 S1000
G1 F1000 X9.5901 Y129.0109 Z-9.0000 S1000
G1 F1000 X9.9999 Y128.9294 Z-9.0000 S1000
G1 F1000 X10.4098 Y129.0109 Z-9.0000 S1000
; Starting inflateGrp: Closed?:true
G1 F300 Z-10.5000
G1 F1000 X10.7570 Y129.2429 Z-10.5000 S1000
G1 F1000 X10.9890 Y129.5901 Z-10.5000 S1000
G1 F1000 X11.0705 Y130.0000 Z-10.5000 S1000
G1 F1000 X10.9890 Y130.4099 Z-10.5000 S1000
G1 F1000 X10.7570 Y130.7571 Z-10.5000 S1000
G1 F1000 X10.4098 Y130.9891 Z-10.5000 S1000
G1 F1000 X9.9999 Y131.0706 Z-10.5000 S1000
G1 F1000 X9.5901 Y130.9891 Z-10.5000 S1000
G1 F1000 X9.2429 Y130.7571 Z-10.5000 S1000
G1 F1000 X9.0109 Y130.4099 Z-10.5000 S1000
G1 F1000 X8.9294 Y130.0000 Z-10.5000 S1000
G1 F1000 X9.0109 Y129.5901 Z-10.5000 S1000
G1 F1000 X9.2429 Y129.2429 Z-10.5000 S1000
G1 F1000 X9.5901 Y129.0109 Z-10.5000 S1000
G1 F1000 X9.9999 Y128.9294 Z-10.5000 S1000
G1 F1000 X10.4098 Y129.0109 Z-10.5000 S1000
; Starting inflateGrp: Closed?:true
G1 F300 Z-12.0000
G1 F1000 X10.7570 Y129.2429 Z-12.0000 S1000
G1 F1000 X10.9890 Y129.5901 Z-12.0000 S1000
G1 F1000 X11.0705 Y130.0000 Z-12.0000 S1000
G1 F1000 X10.9890 Y130.4099 Z-12.0000 S1000
G1 F1000 X10.7570 Y130.7571 Z-12.0000 S1000
G1 F1000 X10.4098 Y130.9891 Z-12.0000 S1000
G1 F1000 X9.9999 Y131.0706 Z-12.0000 S1000
G1 F1000 X9.5901 Y130.9891 Z-12.0000 S1000
G1 F1000 X9.2429 Y130.7571 Z-12.0000 S1000
G1 F1000 X9.0109 Y130.4099 Z-12.0000 S1000
G1 F1000 X8.9294 Y130.0000 Z-12.0000 S1000
G1 F1000 X9.0109 Y129.5901 Z-12.0000 S1000
G1 F1000 X9.2429 Y129.2429 Z-12.0000 S1000
G1 F1000 X9.5901 Y129.0109 Z-12.0000 S1000
G1 F1000 X9.9999 Y128.9294 Z-12.0000 S1000
G1 F1000 X10.4098 Y129.0109 Z-12.0000 S1000
; Starting inflateGrp: Closed?:true
G1 F300 Z-13.5000
G1 F1000 X10.7570 Y129.2429 Z-13.5000 S1000
G1 F1000 X10.9890 Y129.5901 Z-13.5000 S1000
G1 F1000 X11.0705 Y130.0000 Z-13.5000 S1000
G1 F1000 X10.9890 Y130.4099 Z-13.5000 S1000
G1 F1000 X10.7570 Y130.7571 Z-13.5000 S1000
G1 F1000 X10.4098 Y130.9891 Z-13.5000 S1000
G1 F1000 X9.9999 Y131.0706 Z-13.5000 S1000
G1 F1000 X9.5901 Y130.9891 Z-13.5000 S1000
G1 F1000 X9.2429 Y130.7571 Z-13.5000 S1000
G1 F1000 X9.0109 Y130.4099 Z-13.5000 S1000
G1 F1000 X8.9294 Y130.0000 Z-13.5000 S1000
G1 F1000 X9.0109 Y129.5901 Z-13.5000 S1000
G1 F1000 X9.2429 Y129.2429 Z-13.5000 S1000
G1 F1000 X9.5901 Y129.0109 Z-13.5000 S1000
G1 F1000 X9.9999 Y128.9294 Z-13.5000 S1000
G1 F1000 X10.4098 Y129.0109 Z-13.5000 S1000
; Starting inflateGrp: Closed?:true
G1 F300 Z-15.0000
G1 F1000 X10.7570 Y129.2429 Z-15.0000 S1000
G1 F1000 X10.9890 Y129.5901 Z-15.0000 S1000
G1 F1000 X11.0705 Y130.0000 Z-15.0000 S1000
G1 F1000 X10.9890 Y130.4099 Z-15.0000 S1000
G1 F1000 X10.7570 Y130.7571 Z-15.0000 S1000
G1 F1000 X10.4098 Y130.9891 Z-15.0000 S1000
G1 F1000 X9.9999 Y131.0706 Z-15.0000 S1000
G1 F1000 X9.5901 Y130.9891 Z-15.0000 S1000
G1 F1000 X9.2429 Y130.7571 Z-15.0000 S1000
G1 F1000 X9.0109 Y130.4099 Z-15.0000 S1000
G1 F1000 X8.9294 Y130.0000 Z-15.0000 S1000
G1 F1000 X9.0109 Y129.5901 Z-15.0000 S1000
G1 F1000 X9.2429 Y129.2429 Z-15.0000 S1000
G1 F1000 X9.5901 Y129.0109 Z-15.0000 S1000
G1 F1000 X9.9999 Y128.9294 Z-15.0000 S1000
G1 F1000 X10.4098 Y129.0109 Z-15.0000 S1000
; Starting inflateGrp: Closed?:true
G1 F300 Z-16.5000
G1 F1000 X10.7570 Y129.2429 Z-16.5000 S1000
G1 F1000 X10.9890 Y129.5901 Z-16.5000 S1000
G1 F1000 X11.0705 Y130.0000 Z-16.5000 S1000
G1 F1000 X10.9890 Y130.4099 Z-16.5000 S1000
G1 F1000 X10.7570 Y130.7571 Z-16.5000 S1000
G1 F1000 X10.4098 Y130.9891 Z-16.5000 S1000
G1 F1000 X9.9999 Y131.0706 Z-16.5000 S1000
G1 F1000 X9.5901 Y130.9891 Z-16.5000 S1000
G1 F1000 X9.2429 Y130.7571 Z-16.5000 S1000
G1 F1000 X9.0109 Y130.4099 Z-16.5000 S1000
G1 F1000 X8.9294 Y130.0000 Z-16.5000 S1000
G1 F1000 X9.0109 Y129.5901 Z-16.5000 S1000
G1 F1000 X9.2429 Y129.2429 Z-16.5000 S1000
G1 F1000 X9.5901 Y129.0109 Z-16.5000 S1000
G1 F1000 X9.9999 Y128.9294 Z-16.5000 S1000
G1 F1000 X10.4098 Y129.0109 Z-16.5000 S1000
; Starting inflateGrp: Closed?:true
G1 F300 Z-18.0000
G1 F1000 X10.7570 Y129.2429 Z-18.0000 S1000
G1 F1000 X10.9890 Y129.5901 Z-18.0000 S1000
G1 F1000 X11.0705 Y130.0000 Z-18.0000 S1000
G1 F1000 X10.9890 Y130.4099 Z-18.0000 S1000
G1 F1000 X10.7570 Y130.7571 Z-18.0000 S1000
G1 F1000 X10.4098 Y130.9891 Z-18.0000 S1000
G1 F1000 X9.9999 Y131.0706 Z-18.0000 S1000
G1 F1000 X9.5901 Y130.9891 Z-18.0000 S1000
G1 F1000 X9.2429 Y130.7571 Z-18.0000 S1000
G1 F1000 X9.0109 Y130.4099 Z-18.0000 S1000
G1 F1000 X8.9294 Y130.0000 Z-18.0000 S1000
G1 F1000 X9.0109 Y129.5901 Z-18.0000 S1000
G1 F1000 X9.2429 Y129.2429 Z-18.0000 S1000
G1 F1000 X9.5901 Y129.0109 Z-18.0000 S1000
G1 F1000 X9.9999 Y128.9294 Z-18.0000 S1000
G1 F1000 X10.4098 Y129.0109 Z-18.0000 S1000
; Starting inflateGrp: Closed?:true
G1 F300 Z-19.2000
G1 F1000 X10.7570 Y129.2429 Z-19.2000 S1000
G1 F1000 X10.9890 Y129.5901 Z-19.2000 S1000
G1 F1000 X11.0705 Y130.0000 Z-19.2000 S1000
G1 F1000 X10.9890 Y130.4099 Z-19.2000 S1000
G1 F1000 X10.7570 Y130.7571 Z-19.2000 S1000
G1 F1000 X10.4098 Y130.9891 Z-19.2000 S1000
G1 F1000 X9.9999 Y131.0706 Z-19.2000 S1000
G1 F1000 X9.5901 Y130.9891 Z-19.2000 S1000
G1 F1000 X9.2429 Y130.7571 Z-19.2000 S1000
G1 F1000 X9.0109 Y130.4099 Z-19.2000 S1000
G1 F1000 X8.9294 Y130.0000 Z-19.2000 S1000
G1 F1000 X9.0109 Y129.5901 Z-19.2000 S1000
G1 F1000 X9.2429 Y129.2429 Z-19.2000 S1000
G1 F1000 X9.5901 Y129.0109 Z-19.2000 S1000
G1 F1000 X9.9999 Y128.9294 Z-19.2000 S1000
G1 F1000 X10.4098 Y129.0109 Z-19.2000 S1000
; Starting inflateGrp: Closed?:true

G0 Z10
G0 X130.4098 Y129.0109

G0 Z0
G1 F300 Z-1.5000
G1 F1000 X130.7570 Y129.2429 Z-1.5000 S1000
G1 F1000 X130.9890 Y129.5901 Z-1.5000 S1000
G1 F1000 X131.0705 Y130.0000 Z-1.5000 S1000
G1 F1000 X130.9890 Y130.4099 Z-1.5000 S1000
G1 F1000 X130.7570 Y130.7571 Z-1.5000 S1000
G1 F1000 X130.4098 Y130.9891 Z-1.5000 S1000
G1 F1000 X129.9999 Y131.0706 Z-1.5000 S1000
G1 F1000 X129.5901 Y130.9891 Z-1.5000 S1000
G1 F1000 X129.2429 Y130.7571 Z-1.5000 S1000
G1 F1000 X129.0109 Y130.4099 Z-1.5000 S1000
G1 F1000 X128.9294 Y130.0000 Z-1.5000 S1000
G1 F1000 X129.0109 Y129.5901 Z-1.5000 S1000
G1 F1000 X129.2429 Y129.2429 Z-1.5000 S1000
G1 F1000 X129.5901 Y129.0109 Z-1.5000 S1000
G1 F1000 X129.9999 Y128.9294 Z-1.5000 S1000
G1 F1000 X130.4098 Y129.0109 Z-1.5000 S1000
; Starting inflateGrp: Closed?:true
G1 F300 Z-3.0000
G1 F1000 X130.7570 Y129.2429 Z-3.0000 S1000
G1 F1000 X130.9890 Y129.5901 Z-3.0000 S1000
G1 F1000 X131.0705 Y130.0000 Z-3.0000 S1000
G1 F1000 X130.9890 Y130.4099 Z-3.0000 S1000
G1 F1000 X130.7570 Y130.7571 Z-3.0000 S1000
G1 F1000 X130.4098 Y130.9891 Z-3.0000 S1000
G1 F1000 X129.9999 Y131.0706 Z-3.0000 S1000
G1 F1000 X129.5901 Y130.9891 Z-3.0000 S1000
G1 F1000 X129.2429 Y130.7571 Z-3.0000 S1000
G1 F1000 X129.0109 Y130.4099 Z-3.0000 S1000
G1 F1000 X128.9294 Y130.0000 Z-3.0000 S1000
G1 F1000 X129.0109 Y129.5901 Z-3.0000 S1000
G1 F1000 X129.2429 Y129.2429 Z-3.0000 S1000
G1 F1000 X129.5901 Y129.0109 Z-3.0000 S1000
G1 F1000 X129.9999 Y128.9294 Z-3.0000 S1000
G1 F1000 X130.4098 Y129.0109 Z-3.0000 S1000
; Starting inflateGrp: Closed?:true
G1 F300 Z-4.5000
G1 F1000 X130.7570 Y129.2429 Z-4.5000 S1000
G1 F1000 X130.9890 Y129.5901 Z-4.5000 S1000
G1 F1000 X131.0705 Y130.0000 Z-4.5000 S1000
G1 F1000 X130.9890 Y130.4099 Z-4.5000 S1000
G1 F1000 X130.7570 Y130.7571 Z-4.5000 S1000
G1 F1000 X130.4098 Y130.9891 Z-4.5000 S1000
G1 F1000 X129.9999 Y131.0706 Z-4.5000 S1000
G1 F1000 X129.5901 Y130.9891 Z-4.5000 S1000
G1 F1000 X129.2429 Y130.7571 Z-4.5000 S1000
G1 F1000 X129.0109 Y130.4099 Z-4.5000 S1000
G1 F1000 X128.9294 Y130.0000 Z-4.5000 S1000
G1 F1000 X129.0109 Y129.5901 Z-4.5000 S1000
G1 F1000 X129.2429 Y129.2429 Z-4.5000 S1000
G1 F1000 X129.5901 Y129.0109 Z-4.5000 S1000
G1 F1000 X129.9999 Y128.9294 Z-4.5000 S1000
G1 F1000 X130.4098 Y129.0109 Z-4.5000 S1000
; Starting inflateGrp: Closed?:true
G1 F300 Z-6.0000
G1 F1000 X130.7570 Y129.2429 Z-6.0000 S1000
G1 F1000 X130.9890 Y129.5901 Z-6.0000 S1000
G1 F1000 X131.0705 Y130.0000 Z-6.0000 S1000
G1 F1000 X130.9890 Y130.4099 Z-6.0000 S1000
G1 F1000 X130.7570 Y130.7571 Z-6.0000 S1000
G1 F1000 X130.4098 Y130.9891 Z-6.0000 S1000
G1 F1000 X129.9999 Y131.0706 Z-6.0000 S1000
G1 F1000 X129.5901 Y130.9891 Z-6.0000 S1000
G1 F1000 X129.2429 Y130.7571 Z-6.0000 S1000
G1 F1000 X129.0109 Y130.4099 Z-6.0000 S1000
G1 F1000 X128.9294 Y130.0000 Z-6.0000 S1000
G1 F1000 X129.0109 Y129.5901 Z-6.0000 S1000
G1 F1000 X129.2429 Y129.2429 Z-6.0000 S1000
G1 F1000 X129.5901 Y129.0109 Z-6.0000 S1000
G1 F1000 X129.9999 Y128.9294 Z-6.0000 S1000
G1 F1000 X130.4098 Y129.0109 Z-6.0000 S1000
; Starting inflateGrp: Closed?:true
G1 F300 Z-7.5000
G1 F1000 X130.7570 Y129.2429 Z-7.5000 S1000
G1 F1000 X130.9890 Y129.5901 Z-7.5000 S1000
G1 F1000 X131.0705 Y130.0000 Z-7.5000 S1000
G1 F1000 X130.9890 Y130.4099 Z-7.5000 S1000
G1 F1000 X130.7570 Y130.7571 Z-7.5000 S1000
G1 F1000 X130.4098 Y130.9891 Z-7.5000 S1000
G1 F1000 X129.9999 Y131.0706 Z-7.5000 S1000
G1 F1000 X129.5901 Y130.9891 Z-7.5000 S1000
G1 F1000 X129.2429 Y130.7571 Z-7.5000 S1000
G1 F1000 X129.0109 Y130.4099 Z-7.5000 S1000
G1 F1000 X128.9294 Y130.0000 Z-7.5000 S1000
G1 F1000 X129.0109 Y129.5901 Z-7.5000 S1000
G1 F1000 X129.2429 Y129.2429 Z-7.5000 S1000
G1 F1000 X129.5901 Y129.0109 Z-7.5000 S1000
G1 F1000 X129.9999 Y128.9294 Z-7.5000 S1000
G1 F1000 X130.4098 Y129.0109 Z-7.5000 S1000
; Starting inflateGrp: Closed?:true
G1 F300 Z-9.0000
G1 F1000 X130.7570 Y129.2429 Z-9.0000 S1000
G1 F1000 X130.9890 Y129.5901 Z-9.0000 S1000
G1 F1000 X131.0705 Y130.0000 Z-9.0000 S1000
G1 F1000 X130.9890 Y130.4099 Z-9.0000 S1000
G1 F1000 X130.7570 Y130.7571 Z-9.0000 S1000
G1 F1000 X130.4098 Y130.9891 Z-9.0000 S1000
G1 F1000 X129.9999 Y131.0706 Z-9.0000 S1000
G1 F1000 X129.5901 Y130.9891 Z-9.0000 S1000
G1 F1000 X129.2429 Y130.7571 Z-9.0000 S1000
G1 F1000 X129.0109 Y130.4099 Z-9.0000 S1000
G1 F1000 X128.9294 Y130.0000 Z-9.0000 S1000
G1 F1000 X129.0109 Y129.5901 Z-9.0000 S1000
G1 F1000 X129.2429 Y129.2429 Z-9.0000 S1000
G1 F1000 X129.5901 Y129.0109 Z-9.0000 S1000
G1 F1000 X129.9999 Y128.9294 Z-9.0000 S1000
G1 F1000 X130.4098 Y129.0109 Z-9.0000 S1000
; Starting inflateGrp: Closed?:true
G1 F300 Z-10.5000
G1 F1000 X130.7570 Y129.2429 Z-10.5000 S1000
G1 F1000 X130.9890 Y129.5901 Z-10.5000 S1000
G1 F1000 X131.0705 Y130.0000 Z-10.5000 S1000
G1 F1000 X130.9890 Y130.4099 Z-10.5000 S1000
G1 F1000 X130.7570 Y130.7571 Z-10.5000 S1000
G1 F1000 X130.4098 Y130.9891 Z-10.5000 S1000
G1 F1000 X129.9999 Y131.0706 Z-10.5000 S1000
G1 F1000 X129.5901 Y130.9891 Z-10.5000 S1000
G1 F1000 X129.2429 Y130.7571 Z-10.5000 S1000
G1 F1000 X129.0109 Y130.4099 Z-10.5000 S1000
G1 F1000 X128.9294 Y130.0000 Z-10.5000 S1000
G1 F1000 X129.0109 Y129.5901 Z-10.5000 S1000
G1 F1000 X129.2429 Y129.2429 Z-10.5000 S1000
G1 F1000 X129.5901 Y129.0109 Z-10.5000 S1000
G1 F1000 X129.9999 Y128.9294 Z-10.5000 S1000
G1 F1000 X130.4098 Y129.0109 Z-10.5000 S1000
; Starting inflateGrp: Closed?:true
G1 F300 Z-12.0000
G1 F1000 X130.7570 Y129.2429 Z-12.0000 S1000
G1 F1000 X130.9890 Y129.5901 Z-12.0000 S1000
G1 F1000 X131.0705 Y130.0000 Z-12.0000 S1000
G1 F1000 X130.9890 Y130.4099 Z-12.0000 S1000
G1 F1000 X130.7570 Y130.7571 Z-12.0000 S1000
G1 F1000 X130.4098 Y130.9891 Z-12.0000 S1000
G1 F1000 X129.9999 Y131.0706 Z-12.0000 S1000
G1 F1000 X129.5901 Y130.9891 Z-12.0000 S1000
G1 F1000 X129.2429 Y130.7571 Z-12.0000 S1000
G1 F1000 X129.0109 Y130.4099 Z-12.0000 S1000
G1 F1000 X128.9294 Y130.0000 Z-12.0000 S1000
G1 F1000 X129.0109 Y129.5901 Z-12.0000 S1000
G1 F1000 X129.2429 Y129.2429 Z-12.0000 S1000
G1 F1000 X129.5901 Y129.0109 Z-12.0000 S1000
G1 F1000 X129.9999 Y128.9294 Z-12.0000 S1000
G1 F1000 X130.4098 Y129.0109 Z-12.0000 S1000
; Starting inflateGrp: Closed?:true
G1 F300 Z-13.5000
G1 F1000 X130.7570 Y129.2429 Z-13.5000 S1000
G1 F1000 X130.9890 Y129.5901 Z-13.5000 S1000
G1 F1000 X131.0705 Y130.0000 Z-13.5000 S1000
G1 F1000 X130.9890 Y130.4099 Z-13.5000 S1000
G1 F1000 X130.7570 Y130.7571 Z-13.5000 S1000
G1 F1000 X130.4098 Y130.9891 Z-13.5000 S1000
G1 F1000 X129.9999 Y131.0706 Z-13.5000 S1000
G1 F1000 X129.5901 Y130.9891 Z-13.5000 S1000
G1 F1000 X129.2429 Y130.7571 Z-13.5000 S1000
G1 F1000 X129.0109 Y130.4099 Z-13.5000 S1000
G1 F1000 X128.9294 Y130.0000 Z-13.5000 S1000
G1 F1000 X129.0109 Y129.5901 Z-13.5000 S1000
G1 F1000 X129.2429 Y129.2429 Z-13.5000 S1000
G1 F1000 X129.5901 Y129.0109 Z-13.5000 S1000
G1 F1000 X129.9999 Y128.9294 Z-13.5000 S1000
G1 F1000 X130.4098 Y129.0109 Z-13.5000 S1000
; Starting inflateGrp: Closed?:true
G1 F300 Z-15.0000
G1 F1000 X130.7570 Y129.2429 Z-15.0000 S1000
G1 F1000 X130.9890 Y129.5901 Z-15.0000 S1000
G1 F1000 X131.0705 Y130.0000 Z-15.0000 S1000
G1 F1000 X130.9890 Y130.4099 Z-15.0000 S1000
G1 F1000 X130.7570 Y130.7571 Z-15.0000 S1000
G1 F1000 X130.4098 Y130.9891 Z-15.0000 S1000
G1 F1000 X129.9999 Y131.0706 Z-15.0000 S1000
G1 F1000 X129.5901 Y130.9891 Z-15.0000 S1000
G1 F1000 X129.2429 Y130.7571 Z-15.0000 S1000
G1 F1000 X129.0109 Y130.4099 Z-15.0000 S1000
G1 F1000 X128.9294 Y130.0000 Z-15.0000 S1000
G1 F1000 X129.0109 Y129.5901 Z-15.0000 S1000
G1 F1000 X129.2429 Y129.2429 Z-15.0000 S1000
G1 F1000 X129.5901 Y129.0109 Z-15.0000 S1000
G1 F1000 X129.9999 Y128.9294 Z-15.0000 S1000
G1 F1000 X130.4098 Y129.0109 Z-15.0000 S1000
; Starting inflateGrp: Closed?:true
G1 F300 Z-16.5000
G1 F1000 X130.7570 Y129.2429 Z-16.5000 S1000
G1 F1000 X130.9890 Y129.5901 Z-16.5000 S1000
G1 F1000 X131.0705 Y130.0000 Z-16.5000 S1000
G1 F1000 X130.9890 Y130.4099 Z-16.5000 S1000
G1 F1000 X130.7570 Y130.7571 Z-16.5000 S1000
G1 F1000 X130.4098 Y130.9891 Z-16.5000 S1000
G1 F1000 X129.9999 Y131.0706 Z-16.5000 S1000
G1 F1000 X129.5901 Y130.9891 Z-16.5000 S1000
G1 F1000 X129.2429 Y130.7571 Z-16.5000 S1000
G1 F1000 X129.0109 Y130.4099 Z-16.5000 S1000
G1 F1000 X128.9294 Y130.0000 Z-16.5000 S1000
G1 F1000 X129.0109 Y129.5901 Z-16.5000 S1000
G1 F1000 X129.2429 Y129.2429 Z-16.5000 S1000
G1 F1000 X129.5901 Y129.0109 Z-16.5000 S1000
G1 F1000 X129.9999 Y128.9294 Z-16.5000 S1000
G1 F1000 X130.4098 Y129.0109 Z-16.5000 S1000
; Starting inflateGrp: Closed?:true
G1 F300 Z-18.0000
G1 F1000 X130.7570 Y129.2429 Z-18.0000 S1000
G1 F1000 X130.9890 Y129.5901 Z-18.0000 S1000
G1 F1000 X131.0705 Y130.0000 Z-18.0000 S1000
G1 F1000 X130.9890 Y130.4099 Z-18.0000 S1000
G1 F1000 X130.7570 Y130.7571 Z-18.0000 S1000
G1 F1000 X130.4098 Y130.9891 Z-18.0000 S1000
G1 F1000 X129.9999 Y131.0706 Z-18.0000 S1000
G1 F1000 X129.5901 Y130.9891 Z-18.0000 S1000
G1 F1000 X129.2429 Y130.7571 Z-18.0000 S1000
G1 F1000 X129.0109 Y130.4099 Z-18.0000 S1000
G1 F1000 X128.9294 Y130.0000 Z-18.0000 S1000
G1 F1000 X129.0109 Y129.5901 Z-18.0000 S1000
G1 F1000 X129.2429 Y129.2429 Z-18.0000 S1000
G1 F1000 X129.5901 Y129.0109 Z-18.0000 S1000
G1 F1000 X129.9999 Y128.9294 Z-18.0000 S1000
G1 F1000 X130.4098 Y129.0109 Z-18.0000 S1000
; Starting inflateGrp: Closed?:true
G1 F300 Z-19.2000
G1 F1000 X130.7570 Y129.2429 Z-19.2000 S1000
G1 F1000 X130.9890 Y129.5901 Z-19.2000 S1000
G1 F1000 X131.0705 Y130.0000 Z-19.2000 S1000
G1 F1000 X130.9890 Y130.4099 Z-19.2000 S1000
G1 F1000 X130.7570 Y130.7571 Z-19.2000 S1000
G1 F1000 X130.4098 Y130.9891 Z-19.2000 S1000
G1 F1000 X129.9999 Y131.0706 Z-19.2000 S1000
G1 F1000 X129.5901 Y130.9891 Z-19.2000 S1000
G1 F1000 X129.2429 Y130.7571 Z-19.2000 S1000
G1 F1000 X129.0109 Y130.4099 Z-19.2000 S1000
G1 F1000 X128.9294 Y130.0000 Z-19.2000 S1000
G1 F1000 X129.0109 Y129.5901 Z-19.2000 S1000
G1 F1000 X129.2429 Y129.2429 Z-19.2000 S1000
G1 F1000 X129.5901 Y129.0109 Z-19.2000 S1000
G1 F1000 X129.9999 Y128.9294 Z-19.2000 S1000
G1 F1000 X130.4098 Y129.0109 Z-19.2000 S1000
; retracting back to z-safe
G0 Z10

M5 S0; Spindle Off
