; GCODE Generated by cam.openbuilds.com on 2020-09-03 
G21 ; mm-mode
G54; Work Coordinates
G21; mm-mode
G90; Absolute Positioning
M3 S1000; Spindle On

; Operation 0: CNC: Vector (path inside)
; Tool Diameter: 5
; Starting inflateGrp: Closed?:true

G0 Z10
G0 F1000 X10.0196 Y29.9529

G0 Z0
G1 F300 Z-1.2000
G1 F1000 X10.0361 Y29.9639 Z-1.2000 S1000
G1 F1000 X10.0471 Y29.9804 Z-1.2000 S1000
G1 F1000 X10.0510 Y30.0000 Z-1.2000 S1000
G1 F1000 X10.0471 Y30.0196 Z-1.2000 S1000
G1 F1000 X10.0361 Y30.0361 Z-1.2000 S1000
G1 F1000 X10.0196 Y30.0471 Z-1.2000 S1000
G1 F1000 X10.0000 Y30.0510 Z-1.2000 S1000
G1 F1000 X9.9804 Y30.0471 Z-1.2000 S1000
G1 F1000 X9.9639 Y30.0361 Z-1.2000 S1000
G1 F1000 X9.9529 Y30.0196 Z-1.2000 S1000
G1 F1000 X9.9490 Y30.0000 Z-1.2000 S1000
G1 F1000 X9.9529 Y29.9804 Z-1.2000 S1000
G1 F1000 X9.9639 Y29.9639 Z-1.2000 S1000
G1 F1000 X9.9804 Y29.9529 Z-1.2000 S1000
G1 F1000 X10.0000 Y29.9490 Z-1.2000 S1000
G1 F1000 X10.0196 Y29.9529 Z-1.2000 S1000
; Starting inflateGrp: Closed?:true
G1 F300 Z-2.4000
G1 F1000 X10.0361 Y29.9639 Z-2.4000 S1000
G1 F1000 X10.0471 Y29.9804 Z-2.4000 S1000
G1 F1000 X10.0510 Y30.0000 Z-2.4000 S1000
G1 F1000 X10.0471 Y30.0196 Z-2.4000 S1000
G1 F1000 X10.0361 Y30.0361 Z-2.4000 S1000
G1 F1000 X10.0196 Y30.0471 Z-2.4000 S1000
G1 F1000 X10.0000 Y30.0510 Z-2.4000 S1000
G1 F1000 X9.9804 Y30.0471 Z-2.4000 S1000
G1 F1000 X9.9639 Y30.0361 Z-2.4000 S1000
G1 F1000 X9.9529 Y30.0196 Z-2.4000 S1000
G1 F1000 X9.9490 Y30.0000 Z-2.4000 S1000
G1 F1000 X9.9529 Y29.9804 Z-2.4000 S1000
G1 F1000 X9.9639 Y29.9639 Z-2.4000 S1000
G1 F1000 X9.9804 Y29.9529 Z-2.4000 S1000
G1 F1000 X10.0000 Y29.9490 Z-2.4000 S1000
G1 F1000 X10.0196 Y29.9529 Z-2.4000 S1000
; Starting inflateGrp: Closed?:true
G1 F300 Z-3.2000
G1 F1000 X10.0361 Y29.9639 Z-3.2000 S1000
G1 F1000 X10.0471 Y29.9804 Z-3.2000 S1000
G1 F1000 X10.0510 Y30.0000 Z-3.2000 S1000
G1 F1000 X10.0471 Y30.0196 Z-3.2000 S1000
G1 F1000 X10.0361 Y30.0361 Z-3.2000 S1000
G1 F1000 X10.0196 Y30.0471 Z-3.2000 S1000
G1 F1000 X10.0000 Y30.0510 Z-3.2000 S1000
G1 F1000 X9.9804 Y30.0471 Z-3.2000 S1000
G1 F1000 X9.9639 Y30.0361 Z-3.2000 S1000
G1 F1000 X9.9529 Y30.0196 Z-3.2000 S1000
G1 F1000 X9.9490 Y30.0000 Z-3.2000 S1000
G1 F1000 X9.9529 Y29.9804 Z-3.2000 S1000
G1 F1000 X9.9639 Y29.9639 Z-3.2000 S1000
G1 F1000 X9.9804 Y29.9529 Z-3.2000 S1000
G1 F1000 X10.0000 Y29.9490 Z-3.2000 S1000
G1 F1000 X10.0196 Y29.9529 Z-3.2000 S1000
; Starting inflateGrp: Closed?:true

G0 Z10
G0 X10.0196 Y49.9529

G0 Z0
G1 F300 Z-1.2000
G1 F1000 X10.0361 Y49.9639 Z-1.2000 S1000
G1 F1000 X10.0471 Y49.9804 Z-1.2000 S1000
G1 F1000 X10.0510 Y50.0000 Z-1.2000 S1000
G1 F1000 X10.0471 Y50.0196 Z-1.2000 S1000
G1 F1000 X10.0361 Y50.0361 Z-1.2000 S1000
G1 F1000 X10.0196 Y50.0471 Z-1.2000 S1000
G1 F1000 X10.0000 Y50.0510 Z-1.2000 S1000
G1 F1000 X9.9804 Y50.0471 Z-1.2000 S1000
G1 F1000 X9.9639 Y50.0361 Z-1.2000 S1000
G1 F1000 X9.9529 Y50.0196 Z-1.2000 S1000
G1 F1000 X9.9490 Y50.0000 Z-1.2000 S1000
G1 F1000 X9.9529 Y49.9804 Z-1.2000 S1000
G1 F1000 X9.9639 Y49.9639 Z-1.2000 S1000
G1 F1000 X9.9804 Y49.9529 Z-1.2000 S1000
G1 F1000 X10.0000 Y49.9490 Z-1.2000 S1000
G1 F1000 X10.0196 Y49.9529 Z-1.2000 S1000
; Starting inflateGrp: Closed?:true
G1 F300 Z-2.4000
G1 F1000 X10.0361 Y49.9639 Z-2.4000 S1000
G1 F1000 X10.0471 Y49.9804 Z-2.4000 S1000
G1 F1000 X10.0510 Y50.0000 Z-2.4000 S1000
G1 F1000 X10.0471 Y50.0196 Z-2.4000 S1000
G1 F1000 X10.0361 Y50.0361 Z-2.4000 S1000
G1 F1000 X10.0196 Y50.0471 Z-2.4000 S1000
G1 F1000 X10.0000 Y50.0510 Z-2.4000 S1000
G1 F1000 X9.9804 Y50.0471 Z-2.4000 S1000
G1 F1000 X9.9639 Y50.0361 Z-2.4000 S1000
G1 F1000 X9.9529 Y50.0196 Z-2.4000 S1000
G1 F1000 X9.9490 Y50.0000 Z-2.4000 S1000
G1 F1000 X9.9529 Y49.9804 Z-2.4000 S1000
G1 F1000 X9.9639 Y49.9639 Z-2.4000 S1000
G1 F1000 X9.9804 Y49.9529 Z-2.4000 S1000
G1 F1000 X10.0000 Y49.9490 Z-2.4000 S1000
G1 F1000 X10.0196 Y49.9529 Z-2.4000 S1000
; Starting inflateGrp: Closed?:true
G1 F300 Z-3.2000
G1 F1000 X10.0361 Y49.9639 Z-3.2000 S1000
G1 F1000 X10.0471 Y49.9804 Z-3.2000 S1000
G1 F1000 X10.0510 Y50.0000 Z-3.2000 S1000
G1 F1000 X10.0471 Y50.0196 Z-3.2000 S1000
G1 F1000 X10.0361 Y50.0361 Z-3.2000 S1000
G1 F1000 X10.0196 Y50.0471 Z-3.2000 S1000
G1 F1000 X10.0000 Y50.0510 Z-3.2000 S1000
G1 F1000 X9.9804 Y50.0471 Z-3.2000 S1000
G1 F1000 X9.9639 Y50.0361 Z-3.2000 S1000
G1 F1000 X9.9529 Y50.0196 Z-3.2000 S1000
G1 F1000 X9.9490 Y50.0000 Z-3.2000 S1000
G1 F1000 X9.9529 Y49.9804 Z-3.2000 S1000
G1 F1000 X9.9639 Y49.9639 Z-3.2000 S1000
G1 F1000 X9.9804 Y49.9529 Z-3.2000 S1000
G1 F1000 X10.0000 Y49.9490 Z-3.2000 S1000
G1 F1000 X10.0196 Y49.9529 Z-3.2000 S1000
; Starting inflateGrp: Closed?:true

G0 Z10
G0 X50.0196 Y9.9529

G0 Z0
G1 F300 Z-1.2000
G1 F1000 X50.0361 Y9.9639 Z-1.2000 S1000
G1 F1000 X50.0471 Y9.9804 Z-1.2000 S1000
G1 F1000 X50.0510 Y10.0000 Z-1.2000 S1000
G1 F1000 X50.0471 Y10.0196 Z-1.2000 S1000
G1 F1000 X50.0361 Y10.0361 Z-1.2000 S1000
G1 F1000 X50.0196 Y10.0471 Z-1.2000 S1000
G1 F1000 X50.0000 Y10.0510 Z-1.2000 S1000
G1 F1000 X49.9804 Y10.0471 Z-1.2000 S1000
G1 F1000 X49.9639 Y10.0361 Z-1.2000 S1000
G1 F1000 X49.9529 Y10.0196 Z-1.2000 S1000
G1 F1000 X49.9490 Y10.0000 Z-1.2000 S1000
G1 F1000 X49.9529 Y9.9804 Z-1.2000 S1000
G1 F1000 X49.9639 Y9.9639 Z-1.2000 S1000
G1 F1000 X49.9804 Y9.9529 Z-1.2000 S1000
G1 F1000 X50.0000 Y9.9490 Z-1.2000 S1000
G1 F1000 X50.0196 Y9.9529 Z-1.2000 S1000
; Starting inflateGrp: Closed?:true
G1 F300 Z-2.4000
G1 F1000 X50.0361 Y9.9639 Z-2.4000 S1000
G1 F1000 X50.0471 Y9.9804 Z-2.4000 S1000
G1 F1000 X50.0510 Y10.0000 Z-2.4000 S1000
G1 F1000 X50.0471 Y10.0196 Z-2.4000 S1000
G1 F1000 X50.0361 Y10.0361 Z-2.4000 S1000
G1 F1000 X50.0196 Y10.0471 Z-2.4000 S1000
G1 F1000 X50.0000 Y10.0510 Z-2.4000 S1000
G1 F1000 X49.9804 Y10.0471 Z-2.4000 S1000
G1 F1000 X49.9639 Y10.0361 Z-2.4000 S1000
G1 F1000 X49.9529 Y10.0196 Z-2.4000 S1000
G1 F1000 X49.9490 Y10.0000 Z-2.4000 S1000
G1 F1000 X49.9529 Y9.9804 Z-2.4000 S1000
G1 F1000 X49.9639 Y9.9639 Z-2.4000 S1000
G1 F1000 X49.9804 Y9.9529 Z-2.4000 S1000
G1 F1000 X50.0000 Y9.9490 Z-2.4000 S1000
G1 F1000 X50.0196 Y9.9529 Z-2.4000 S1000
; Starting inflateGrp: Closed?:true
G1 F300 Z-3.2000
G1 F1000 X50.0361 Y9.9639 Z-3.2000 S1000
G1 F1000 X50.0471 Y9.9804 Z-3.2000 S1000
G1 F1000 X50.0510 Y10.0000 Z-3.2000 S1000
G1 F1000 X50.0471 Y10.0196 Z-3.2000 S1000
G1 F1000 X50.0361 Y10.0361 Z-3.2000 S1000
G1 F1000 X50.0196 Y10.0471 Z-3.2000 S1000
G1 F1000 X50.0000 Y10.0510 Z-3.2000 S1000
G1 F1000 X49.9804 Y10.0471 Z-3.2000 S1000
G1 F1000 X49.9639 Y10.0361 Z-3.2000 S1000
G1 F1000 X49.9529 Y10.0196 Z-3.2000 S1000
G1 F1000 X49.9490 Y10.0000 Z-3.2000 S1000
G1 F1000 X49.9529 Y9.9804 Z-3.2000 S1000
G1 F1000 X49.9639 Y9.9639 Z-3.2000 S1000
G1 F1000 X49.9804 Y9.9529 Z-3.2000 S1000
G1 F1000 X50.0000 Y9.9490 Z-3.2000 S1000
G1 F1000 X50.0196 Y9.9529 Z-3.2000 S1000
; Starting inflateGrp: Closed?:true

G0 Z10
G0 X10.0196 Y9.9529

G0 Z0
G1 F300 Z-1.2000
G1 F1000 X10.0361 Y9.9639 Z-1.2000 S1000
G1 F1000 X10.0471 Y9.9804 Z-1.2000 S1000
G1 F1000 X10.0510 Y10.0000 Z-1.2000 S1000
G1 F1000 X10.0471 Y10.0196 Z-1.2000 S1000
G1 F1000 X10.0361 Y10.0361 Z-1.2000 S1000
G1 F1000 X10.0196 Y10.0471 Z-1.2000 S1000
G1 F1000 X10.0000 Y10.0510 Z-1.2000 S1000
G1 F1000 X9.9804 Y10.0471 Z-1.2000 S1000
G1 F1000 X9.9639 Y10.0361 Z-1.2000 S1000
G1 F1000 X9.9529 Y10.0196 Z-1.2000 S1000
G1 F1000 X9.9490 Y10.0000 Z-1.2000 S1000
G1 F1000 X9.9529 Y9.9804 Z-1.2000 S1000
G1 F1000 X9.9639 Y9.9639 Z-1.2000 S1000
G1 F1000 X9.9804 Y9.9529 Z-1.2000 S1000
G1 F1000 X10.0000 Y9.9490 Z-1.2000 S1000
G1 F1000 X10.0196 Y9.9529 Z-1.2000 S1000
; Starting inflateGrp: Closed?:true
G1 F300 Z-2.4000
G1 F1000 X10.0361 Y9.9639 Z-2.4000 S1000
G1 F1000 X10.0471 Y9.9804 Z-2.4000 S1000
G1 F1000 X10.0510 Y10.0000 Z-2.4000 S1000
G1 F1000 X10.0471 Y10.0196 Z-2.4000 S1000
G1 F1000 X10.0361 Y10.0361 Z-2.4000 S1000
G1 F1000 X10.0196 Y10.0471 Z-2.4000 S1000
G1 F1000 X10.0000 Y10.0510 Z-2.4000 S1000
G1 F1000 X9.9804 Y10.0471 Z-2.4000 S1000
G1 F1000 X9.9639 Y10.0361 Z-2.4000 S1000
G1 F1000 X9.9529 Y10.0196 Z-2.4000 S1000
G1 F1000 X9.9490 Y10.0000 Z-2.4000 S1000
G1 F1000 X9.9529 Y9.9804 Z-2.4000 S1000
G1 F1000 X9.9639 Y9.9639 Z-2.4000 S1000
G1 F1000 X9.9804 Y9.9529 Z-2.4000 S1000
G1 F1000 X10.0000 Y9.9490 Z-2.4000 S1000
G1 F1000 X10.0196 Y9.9529 Z-2.4000 S1000
; Starting inflateGrp: Closed?:true
G1 F300 Z-3.2000
G1 F1000 X10.0361 Y9.9639 Z-3.2000 S1000
G1 F1000 X10.0471 Y9.9804 Z-3.2000 S1000
G1 F1000 X10.0510 Y10.0000 Z-3.2000 S1000
G1 F1000 X10.0471 Y10.0196 Z-3.2000 S1000
G1 F1000 X10.0361 Y10.0361 Z-3.2000 S1000
G1 F1000 X10.0196 Y10.0471 Z-3.2000 S1000
G1 F1000 X10.0000 Y10.0510 Z-3.2000 S1000
G1 F1000 X9.9804 Y10.0471 Z-3.2000 S1000
G1 F1000 X9.9639 Y10.0361 Z-3.2000 S1000
G1 F1000 X9.9529 Y10.0196 Z-3.2000 S1000
G1 F1000 X9.9490 Y10.0000 Z-3.2000 S1000
G1 F1000 X9.9529 Y9.9804 Z-3.2000 S1000
G1 F1000 X9.9639 Y9.9639 Z-3.2000 S1000
G1 F1000 X9.9804 Y9.9529 Z-3.2000 S1000
G1 F1000 X10.0000 Y9.9490 Z-3.2000 S1000
G1 F1000 X10.0196 Y9.9529 Z-3.2000 S1000
; Starting inflateGrp: Closed?:true

G0 Z10
G0 X30.0196 Y9.9529

G0 Z0
G1 F300 Z-1.2000
G1 F1000 X30.0361 Y9.9639 Z-1.2000 S1000
G1 F1000 X30.0471 Y9.9804 Z-1.2000 S1000
G1 F1000 X30.0510 Y10.0000 Z-1.2000 S1000
G1 F1000 X30.0471 Y10.0196 Z-1.2000 S1000
G1 F1000 X30.0361 Y10.0361 Z-1.2000 S1000
G1 F1000 X30.0196 Y10.0471 Z-1.2000 S1000
G1 F1000 X30.0000 Y10.0510 Z-1.2000 S1000
G1 F1000 X29.9804 Y10.0471 Z-1.2000 S1000
G1 F1000 X29.9639 Y10.0361 Z-1.2000 S1000
G1 F1000 X29.9529 Y10.0196 Z-1.2000 S1000
G1 F1000 X29.9490 Y10.0000 Z-1.2000 S1000
G1 F1000 X29.9529 Y9.9804 Z-1.2000 S1000
G1 F1000 X29.9639 Y9.9639 Z-1.2000 S1000
G1 F1000 X29.9804 Y9.9529 Z-1.2000 S1000
G1 F1000 X30.0000 Y9.9490 Z-1.2000 S1000
G1 F1000 X30.0196 Y9.9529 Z-1.2000 S1000
; Starting inflateGrp: Closed?:true
G1 F300 Z-2.4000
G1 F1000 X30.0361 Y9.9639 Z-2.4000 S1000
G1 F1000 X30.0471 Y9.9804 Z-2.4000 S1000
G1 F1000 X30.0510 Y10.0000 Z-2.4000 S1000
G1 F1000 X30.0471 Y10.0196 Z-2.4000 S1000
G1 F1000 X30.0361 Y10.0361 Z-2.4000 S1000
G1 F1000 X30.0196 Y10.0471 Z-2.4000 S1000
G1 F1000 X30.0000 Y10.0510 Z-2.4000 S1000
G1 F1000 X29.9804 Y10.0471 Z-2.4000 S1000
G1 F1000 X29.9639 Y10.0361 Z-2.4000 S1000
G1 F1000 X29.9529 Y10.0196 Z-2.4000 S1000
G1 F1000 X29.9490 Y10.0000 Z-2.4000 S1000
G1 F1000 X29.9529 Y9.9804 Z-2.4000 S1000
G1 F1000 X29.9639 Y9.9639 Z-2.4000 S1000
G1 F1000 X29.9804 Y9.9529 Z-2.4000 S1000
G1 F1000 X30.0000 Y9.9490 Z-2.4000 S1000
G1 F1000 X30.0196 Y9.9529 Z-2.4000 S1000
; Starting inflateGrp: Closed?:true
G1 F300 Z-3.2000
G1 F1000 X30.0361 Y9.9639 Z-3.2000 S1000
G1 F1000 X30.0471 Y9.9804 Z-3.2000 S1000
G1 F1000 X30.0510 Y10.0000 Z-3.2000 S1000
G1 F1000 X30.0471 Y10.0196 Z-3.2000 S1000
G1 F1000 X30.0361 Y10.0361 Z-3.2000 S1000
G1 F1000 X30.0196 Y10.0471 Z-3.2000 S1000
G1 F1000 X30.0000 Y10.0510 Z-3.2000 S1000
G1 F1000 X29.9804 Y10.0471 Z-3.2000 S1000
G1 F1000 X29.9639 Y10.0361 Z-3.2000 S1000
G1 F1000 X29.9529 Y10.0196 Z-3.2000 S1000
G1 F1000 X29.9490 Y10.0000 Z-3.2000 S1000
G1 F1000 X29.9529 Y9.9804 Z-3.2000 S1000
G1 F1000 X29.9639 Y9.9639 Z-3.2000 S1000
G1 F1000 X29.9804 Y9.9529 Z-3.2000 S1000
G1 F1000 X30.0000 Y9.9490 Z-3.2000 S1000
G1 F1000 X30.0196 Y9.9529 Z-3.2000 S1000
; retracting back to z-safe
G0 Z10
; Operation 1: CNC: Vector (path outside)
; Tool Diameter: 5
; Starting inflateGrp: Closed?:true

G0 Z10
G0 F1000 X60.0000 Y-2.5000

G0 Z0
G1 F300 Z-1.2000
G1 F1000 X0.0000 Y-2.5000 Z-1.2000 S1000
G1 F1000 X-0.7508 Y-2.3846 Z-1.2000 S1000
G1 F1000 X-1.3241 Y-2.1205 Z-1.2000 S1000
G1 F1000 X-1.8130 Y-1.7213 Z-1.2000 S1000
G1 F1000 X-2.1864 Y-1.2124 Z-1.2000 S1000
G1 F1000 X-2.4203 Y-0.6261 Z-1.2000 S1000
G1 F1000 X-2.5000 Y0.0000 Z-1.2000 S1000
G1 F1000 X-2.5000 Y60.0000 Z-1.2000 S1000
G1 F1000 X-2.3846 Y60.7508 Z-1.2000 S1000
G1 F1000 X-2.1205 Y61.3241 Z-1.2000 S1000
G1 F1000 X-1.7213 Y61.8130 Z-1.2000 S1000
G1 F1000 X-1.2124 Y62.1864 Z-1.2000 S1000
G1 F1000 X-0.6261 Y62.4203 Z-1.2000 S1000
G1 F1000 X0.0000 Y62.5000 Z-1.2000 S1000
G1 F1000 X20.0000 Y62.5000 Z-1.2000 S1000
G1 F1000 X20.6887 Y62.4033 Z-1.2000 S1000
G1 F1000 X21.2687 Y62.1542 Z-1.2000 S1000
G1 F1000 X21.7678 Y61.7678 Z-1.2000 S1000
G1 F1000 X61.7678 Y21.7678 Z-1.2000 S1000
G1 F1000 X62.1864 Y21.2124 Z-1.2000 S1000
G1 F1000 X62.4203 Y20.6261 Z-1.2000 S1000
G1 F1000 X62.5000 Y20.0000 Z-1.2000 S1000
G1 F1000 X62.5000 Y0.0000 Z-1.2000 S1000
G1 F1000 X62.3846 Y-0.7508 Z-1.2000 S1000
G1 F1000 X62.1205 Y-1.3241 Z-1.2000 S1000
G1 F1000 X61.7213 Y-1.8130 Z-1.2000 S1000
G1 F1000 X61.2124 Y-2.1864 Z-1.2000 S1000
G1 F1000 X60.6261 Y-2.4203 Z-1.2000 S1000
G1 F1000 X60.0000 Y-2.5000 Z-1.2000 S1000
; Starting inflateGrp: Closed?:true
G1 F300 Z-2.4000
G1 F1000 X0.0000 Y-2.5000 Z-2.4000 S1000
G1 F1000 X-0.7508 Y-2.3846 Z-2.4000 S1000
G1 F1000 X-1.3241 Y-2.1205 Z-2.4000 S1000
G1 F1000 X-1.8130 Y-1.7213 Z-2.4000 S1000
G1 F1000 X-2.1864 Y-1.2124 Z-2.4000 S1000
G1 F1000 X-2.4203 Y-0.6261 Z-2.4000 S1000
G1 F1000 X-2.5000 Y0.0000 Z-2.4000 S1000
G1 F1000 X-2.5000 Y60.0000 Z-2.4000 S1000
G1 F1000 X-2.3846 Y60.7508 Z-2.4000 S1000
G1 F1000 X-2.1205 Y61.3241 Z-2.4000 S1000
G1 F1000 X-1.7213 Y61.8130 Z-2.4000 S1000
G1 F1000 X-1.2124 Y62.1864 Z-2.4000 S1000
G1 F1000 X-0.6261 Y62.4203 Z-2.4000 S1000
G1 F1000 X0.0000 Y62.5000 Z-2.4000 S1000
G1 F1000 X20.0000 Y62.5000 Z-2.4000 S1000
G1 F1000 X20.6887 Y62.4033 Z-2.4000 S1000
G1 F1000 X21.2687 Y62.1542 Z-2.4000 S1000
G1 F1000 X21.7678 Y61.7678 Z-2.4000 S1000
G1 F1000 X61.7678 Y21.7678 Z-2.4000 S1000
G1 F1000 X62.1864 Y21.2124 Z-2.4000 S1000
G1 F1000 X62.4203 Y20.6261 Z-2.4000 S1000
G1 F1000 X62.5000 Y20.0000 Z-2.4000 S1000
G1 F1000 X62.5000 Y0.0000 Z-2.4000 S1000
G1 F1000 X62.3846 Y-0.7508 Z-2.4000 S1000
G1 F1000 X62.1205 Y-1.3241 Z-2.4000 S1000
G1 F1000 X61.7213 Y-1.8130 Z-2.4000 S1000
G1 F1000 X61.2124 Y-2.1864 Z-2.4000 S1000
G1 F1000 X60.6261 Y-2.4203 Z-2.4000 S1000
G1 F1000 X60.0000 Y-2.5000 Z-2.4000 S1000
; Starting inflateGrp: Closed?:true
G1 F300 Z-3.2000
G1 F1000 X0.0000 Y-2.5000 Z-3.2000 S1000
G1 F1000 X-0.7508 Y-2.3846 Z-3.2000 S1000
G1 F1000 X-1.3241 Y-2.1205 Z-3.2000 S1000
G1 F1000 X-1.8130 Y-1.7213 Z-3.2000 S1000
G1 F1000 X-2.1864 Y-1.2124 Z-3.2000 S1000
G1 F1000 X-2.4203 Y-0.6261 Z-3.2000 S1000
G1 F1000 X-2.5000 Y0.0000 Z-3.2000 S1000
G1 F1000 X-2.5000 Y60.0000 Z-3.2000 S1000
G1 F1000 X-2.3846 Y60.7508 Z-3.2000 S1000
G1 F1000 X-2.1205 Y61.3241 Z-3.2000 S1000
G1 F1000 X-1.7213 Y61.8130 Z-3.2000 S1000
G1 F1000 X-1.2124 Y62.1864 Z-3.2000 S1000
G1 F1000 X-0.6261 Y62.4203 Z-3.2000 S1000
G1 F1000 X0.0000 Y62.5000 Z-3.2000 S1000
G1 F1000 X20.0000 Y62.5000 Z-3.2000 S1000
G1 F1000 X20.6887 Y62.4033 Z-3.2000 S1000
G1 F1000 X21.2687 Y62.1542 Z-3.2000 S1000
G1 F1000 X21.7678 Y61.7678 Z-3.2000 S1000
G1 F1000 X61.7678 Y21.7678 Z-3.2000 S1000
G1 F1000 X62.1864 Y21.2124 Z-3.2000 S1000
G1 F1000 X62.4203 Y20.6261 Z-3.2000 S1000
G1 F1000 X62.5000 Y20.0000 Z-3.2000 S1000
G1 F1000 X62.5000 Y0.0000 Z-3.2000 S1000
G1 F1000 X62.3846 Y-0.7508 Z-3.2000 S1000
G1 F1000 X62.1205 Y-1.3241 Z-3.2000 S1000
G1 F1000 X61.7213 Y-1.8130 Z-3.2000 S1000
G1 F1000 X61.2124 Y-2.1864 Z-3.2000 S1000
G1 F1000 X60.6261 Y-2.4203 Z-3.2000 S1000
G1 F1000 X60.0000 Y-2.5000 Z-3.2000 S1000
; retracting back to z-safe
G0 Z10

M5 S0; Spindle Off
