; GCODE Generated by cam.openbuilds.com on 2020-09-06 
G21 ; mm-mode
G54; Work Coordinates
G21; mm-mode
G90; Absolute Positioning
M3 S1000; Spindle On

; Operation 0: Drill: Peck (Centered)
; Tool Diameter: 6.35
; Starting : Closed?:true

G0 Z10
G0 F1000 X66.0409 Y56.0469

G0 Z0
G1 F100 Z0.0000
G1 F1000 X66.0409 Y56.0469 Z0.0000 S1000
G1 F1000 X66.0409 Y56.0469 Z0.0000 S1000
; Starting : Closed?:true
G1 F100 Z0.0000
G1 F1000 X66.0409 Y56.0469 Z-1.0000 S1000
G1 F1000 X66.0409 Y56.0469 Z0.0000 S1000
; Starting : Closed?:true
G1 F100 Z-1.0000
G1 F1000 X66.0409 Y56.0469 Z-2.0000 S1000
G1 F1000 X66.0409 Y56.0469 Z0.0000 S1000
; Starting : Closed?:true

G0 Z10
G0 X34.0331 Y24.0438

G0 Z0
G1 F100 Z0.0000
G1 F1000 X34.0331 Y24.0438 Z0.0000 S1000
G1 F1000 X34.0331 Y24.0438 Z0.0000 S1000
; Starting : Closed?:true
G1 F100 Z0.0000
G1 F1000 X34.0331 Y24.0438 Z-1.0000 S1000
G1 F1000 X34.0331 Y24.0438 Z0.0000 S1000
; Starting : Closed?:true
G1 F100 Z-1.0000
G1 F1000 X34.0331 Y24.0438 Z-2.0000 S1000
G1 F1000 X34.0331 Y24.0438 Z0.0000 S1000
; Starting : Closed?:true

G0 Z10
G0 X34.0235 Y56.0269

G0 Z0
G1 F100 Z0.0000
G1 F1000 X34.0235 Y56.0269 Z0.0000 S1000
G1 F1000 X34.0235 Y56.0269 Z0.0000 S1000
; Starting : Closed?:true
G1 F100 Z0.0000
G1 F1000 X34.0235 Y56.0269 Z-1.0000 S1000
G1 F1000 X34.0235 Y56.0269 Z0.0000 S1000
; Starting : Closed?:true
G1 F100 Z-1.0000
G1 F1000 X34.0235 Y56.0269 Z-2.0000 S1000
G1 F1000 X34.0235 Y56.0269 Z0.0000 S1000
; Starting : Closed?:true

G0 Z10
G0 X66.0155 Y24.0301

G0 Z0
G1 F100 Z0.0000
G1 F1000 X66.0155 Y24.0301 Z0.0000 S1000
G1 F1000 X66.0155 Y24.0301 Z0.0000 S1000
; Starting : Closed?:true
G1 F100 Z0.0000
G1 F1000 X66.0155 Y24.0301 Z-1.0000 S1000
G1 F1000 X66.0155 Y24.0301 Z0.0000 S1000
; Starting : Closed?:true
G1 F100 Z-1.0000
G1 F1000 X66.0155 Y24.0301 Z-2.0000 S1000
G1 F1000 X66.0155 Y24.0301 Z0.0000 S1000
; Starting : Closed?:true

G0 Z10
G0 X90.0000 Y12.6000

G0 Z0
G1 F100 Z0.0000
G1 F1000 X90.0000 Y12.6000 Z0.0000 S1000
G1 F1000 X90.0000 Y12.6000 Z0.0000 S1000
; Starting : Closed?:true
G1 F100 Z0.0000
G1 F1000 X90.0000 Y12.6000 Z-1.0000 S1000
G1 F1000 X90.0000 Y12.6000 Z0.0000 S1000
; Starting : Closed?:true
G1 F100 Z-1.0000
G1 F1000 X90.0000 Y12.6000 Z-2.0000 S1000
G1 F1000 X90.0000 Y12.6000 Z0.0000 S1000
; Starting : Closed?:true

G0 Z10
G0 X90.0000 Y67.4000

G0 Z0
G1 F100 Z0.0000
G1 F1000 X90.0000 Y67.4000 Z0.0000 S1000
G1 F1000 X90.0000 Y67.4000 Z0.0000 S1000
; Starting : Closed?:true
G1 F100 Z0.0000
G1 F1000 X90.0000 Y67.4000 Z-1.0000 S1000
G1 F1000 X90.0000 Y67.4000 Z0.0000 S1000
; Starting : Closed?:true
G1 F100 Z-1.0000
G1 F1000 X90.0000 Y67.4000 Z-2.0000 S1000
G1 F1000 X90.0000 Y67.4000 Z0.0000 S1000
; Starting : Closed?:true

G0 Z10
G0 X10.0000 Y67.4000

G0 Z0
G1 F100 Z0.0000
G1 F1000 X10.0000 Y67.4000 Z0.0000 S1000
G1 F1000 X10.0000 Y67.4000 Z0.0000 S1000
; Starting : Closed?:true
G1 F100 Z0.0000
G1 F1000 X10.0000 Y67.4000 Z-1.0000 S1000
G1 F1000 X10.0000 Y67.4000 Z0.0000 S1000
; Starting : Closed?:true
G1 F100 Z-1.0000
G1 F1000 X10.0000 Y67.4000 Z-2.0000 S1000
G1 F1000 X10.0000 Y67.4000 Z0.0000 S1000
; Starting : Closed?:true

G0 Z10
G0 X10.0000 Y12.6000

G0 Z0
G1 F100 Z0.0000
G1 F1000 X10.0000 Y12.6000 Z0.0000 S1000
G1 F1000 X10.0000 Y12.6000 Z0.0000 S1000
; Starting : Closed?:true
G1 F100 Z0.0000
G1 F1000 X10.0000 Y12.6000 Z-1.0000 S1000
G1 F1000 X10.0000 Y12.6000 Z0.0000 S1000
; Starting : Closed?:true
G1 F100 Z-1.0000
G1 F1000 X10.0000 Y12.6000 Z-2.0000 S1000
G1 F1000 X10.0000 Y12.6000 Z0.0000 S1000
; retracting back to z-safe
G0 Z10
; Operation 1: CNC: Vector (path inside)
; Tool Diameter: 6
; Starting inflateGrp: Closed?:true

G0 Z10
G0 F1000 X50.8218 Y26.9273

G0 Z0
G1 F100 Z-3.0000
G1 F1000 X51.6415 Y27.0048 Z-3.0000 S1000
G1 F1000 X52.4547 Y27.1336 Z-3.0000 S1000
G1 F1000 X53.2574 Y27.3130 Z-3.0000 S1000
G1 F1000 X54.0487 Y27.5429 Z-3.0000 S1000
G1 F1000 X54.8217 Y27.8212 Z-3.0000 S1000
G1 F1000 X55.5765 Y28.1479 Z-3.0000 S1000
G1 F1000 X56.3102 Y28.5217 Z-3.0000 S1000
G1 F1000 X57.0187 Y28.9406 Z-3.0000 S1000
G1 F1000 X57.6988 Y29.4029 Z-3.0000 S1000
G1 F1000 X58.3492 Y29.9074 Z-3.0000 S1000
G1 F1000 X58.9671 Y30.4521 Z-3.0000 S1000
G1 F1000 X59.5479 Y31.0329 Z-3.0000 S1000
G1 F1000 X60.0926 Y31.6508 Z-3.0000 S1000
G1 F1000 X60.5971 Y32.3012 Z-3.0000 S1000
G1 F1000 X61.0594 Y32.9813 Z-3.0000 S1000
G1 F1000 X61.4783 Y33.6898 Z-3.0000 S1000
G1 F1000 X61.8521 Y34.4235 Z-3.0000 S1000
G1 F1000 X62.1788 Y35.1783 Z-3.0000 S1000
G1 F1000 X62.4571 Y35.9513 Z-3.0000 S1000
G1 F1000 X62.6870 Y36.7426 Z-3.0000 S1000
G1 F1000 X62.8664 Y37.5453 Z-3.0000 S1000
G1 F1000 X62.9952 Y38.3585 Z-3.0000 S1000
G1 F1000 X63.0727 Y39.1782 Z-3.0000 S1000
G1 F1000 X63.0985 Y40.0000 Z-3.0000 S1000
G1 F1000 X63.0727 Y40.8218 Z-3.0000 S1000
G1 F1000 X62.9952 Y41.6415 Z-3.0000 S1000
G1 F1000 X62.8664 Y42.4547 Z-3.0000 S1000
G1 F1000 X62.6870 Y43.2574 Z-3.0000 S1000
G1 F1000 X62.4571 Y44.0487 Z-3.0000 S1000
G1 F1000 X62.1788 Y44.8217 Z-3.0000 S1000
G1 F1000 X61.8521 Y45.5765 Z-3.0000 S1000
G1 F1000 X61.4783 Y46.3102 Z-3.0000 S1000
G1 F1000 X61.0594 Y47.0187 Z-3.0000 S1000
G1 F1000 X60.5971 Y47.6988 Z-3.0000 S1000
G1 F1000 X60.0926 Y48.3492 Z-3.0000 S1000
G1 F1000 X59.5479 Y48.9671 Z-3.0000 S1000
G1 F1000 X58.9671 Y49.5479 Z-3.0000 S1000
G1 F1000 X58.3492 Y50.0926 Z-3.0000 S1000
G1 F1000 X57.6988 Y50.5971 Z-3.0000 S1000
G1 F1000 X57.0187 Y51.0594 Z-3.0000 S1000
G1 F1000 X56.3102 Y51.4783 Z-3.0000 S1000
G1 F1000 X55.5765 Y51.8521 Z-3.0000 S1000
G1 F1000 X54.8217 Y52.1788 Z-3.0000 S1000
G1 F1000 X54.0487 Y52.4571 Z-3.0000 S1000
G1 F1000 X53.2574 Y52.6870 Z-3.0000 S1000
G1 F1000 X52.4547 Y52.8664 Z-3.0000 S1000
G1 F1000 X51.6415 Y52.9952 Z-3.0000 S1000
G1 F1000 X50.8218 Y53.0727 Z-3.0000 S1000
G1 F1000 X50.0000 Y53.0985 Z-3.0000 S1000
G1 F1000 X49.1782 Y53.0727 Z-3.0000 S1000
G1 F1000 X48.3585 Y52.9952 Z-3.0000 S1000
G1 F1000 X47.5453 Y52.8664 Z-3.0000 S1000
G1 F1000 X46.7426 Y52.6870 Z-3.0000 S1000
G1 F1000 X45.9513 Y52.4571 Z-3.0000 S1000
G1 F1000 X45.1783 Y52.1788 Z-3.0000 S1000
G1 F1000 X44.4235 Y51.8521 Z-3.0000 S1000
G1 F1000 X43.6898 Y51.4783 Z-3.0000 S1000
G1 F1000 X42.9813 Y51.0594 Z-3.0000 S1000
G1 F1000 X42.3012 Y50.5971 Z-3.0000 S1000
G1 F1000 X41.6508 Y50.0926 Z-3.0000 S1000
G1 F1000 X41.0329 Y49.5479 Z-3.0000 S1000
G1 F1000 X40.4521 Y48.9671 Z-3.0000 S1000
G1 F1000 X39.9074 Y48.3492 Z-3.0000 S1000
G1 F1000 X39.4029 Y47.6988 Z-3.0000 S1000
G1 F1000 X38.9406 Y47.0187 Z-3.0000 S1000
G1 F1000 X38.5217 Y46.3102 Z-3.0000 S1000
G1 F1000 X38.1479 Y45.5765 Z-3.0000 S1000
G1 F1000 X37.8212 Y44.8217 Z-3.0000 S1000
G1 F1000 X37.5429 Y44.0487 Z-3.0000 S1000
G1 F1000 X37.3130 Y43.2574 Z-3.0000 S1000
G1 F1000 X37.1336 Y42.4547 Z-3.0000 S1000
G1 F1000 X37.0048 Y41.6415 Z-3.0000 S1000
G1 F1000 X36.9273 Y40.8218 Z-3.0000 S1000
G1 F1000 X36.9015 Y40.0000 Z-3.0000 S1000
G1 F1000 X36.9273 Y39.1782 Z-3.0000 S1000
G1 F1000 X37.0048 Y38.3585 Z-3.0000 S1000
G1 F1000 X37.1336 Y37.5453 Z-3.0000 S1000
G1 F1000 X37.3130 Y36.7426 Z-3.0000 S1000
G1 F1000 X37.5429 Y35.9513 Z-3.0000 S1000
G1 F1000 X37.8212 Y35.1783 Z-3.0000 S1000
G1 F1000 X38.1479 Y34.4235 Z-3.0000 S1000
G1 F1000 X38.5217 Y33.6898 Z-3.0000 S1000
G1 F1000 X38.9406 Y32.9813 Z-3.0000 S1000
G1 F1000 X39.4029 Y32.3012 Z-3.0000 S1000
G1 F1000 X39.9074 Y31.6508 Z-3.0000 S1000
G1 F1000 X40.4521 Y31.0329 Z-3.0000 S1000
G1 F1000 X41.0329 Y30.4521 Z-3.0000 S1000
G1 F1000 X41.6508 Y29.9074 Z-3.0000 S1000
G1 F1000 X42.3012 Y29.4029 Z-3.0000 S1000
G1 F1000 X42.9813 Y28.9406 Z-3.0000 S1000
G1 F1000 X43.6898 Y28.5217 Z-3.0000 S1000
G1 F1000 X44.4235 Y28.1479 Z-3.0000 S1000
G1 F1000 X45.1783 Y27.8212 Z-3.0000 S1000
G1 F1000 X45.9513 Y27.5429 Z-3.0000 S1000
G1 F1000 X46.7426 Y27.3130 Z-3.0000 S1000
G1 F1000 X47.5453 Y27.1336 Z-3.0000 S1000
G1 F1000 X48.3585 Y27.0048 Z-3.0000 S1000
G1 F1000 X49.1782 Y26.9273 Z-3.0000 S1000
G1 F1000 X50.0000 Y26.9015 Z-3.0000 S1000
G1 F1000 X50.8218 Y26.9273 Z-3.0000 S1000
; Starting inflateGrp: Closed?:true
G1 F100 Z-6.0000
G1 F1000 X51.6415 Y27.0048 Z-6.0000 S1000
G1 F1000 X52.4547 Y27.1336 Z-6.0000 S1000
G1 F1000 X53.2574 Y27.3130 Z-6.0000 S1000
G1 F1000 X54.0487 Y27.5429 Z-6.0000 S1000
G1 F1000 X54.8217 Y27.8212 Z-6.0000 S1000
G1 F1000 X55.5765 Y28.1479 Z-6.0000 S1000
G1 F1000 X56.3102 Y28.5217 Z-6.0000 S1000
G1 F1000 X57.0187 Y28.9406 Z-6.0000 S1000
G1 F1000 X57.6988 Y29.4029 Z-6.0000 S1000
G1 F1000 X58.3492 Y29.9074 Z-6.0000 S1000
G1 F1000 X58.9671 Y30.4521 Z-6.0000 S1000
G1 F1000 X59.5479 Y31.0329 Z-6.0000 S1000
G1 F1000 X60.0926 Y31.6508 Z-6.0000 S1000
G1 F1000 X60.5971 Y32.3012 Z-6.0000 S1000
G1 F1000 X61.0594 Y32.9813 Z-6.0000 S1000
G1 F1000 X61.4783 Y33.6898 Z-6.0000 S1000
G1 F1000 X61.8521 Y34.4235 Z-6.0000 S1000
G1 F1000 X62.1788 Y35.1783 Z-6.0000 S1000
G1 F1000 X62.4571 Y35.9513 Z-6.0000 S1000
G1 F1000 X62.6870 Y36.7426 Z-6.0000 S1000
G1 F1000 X62.8664 Y37.5453 Z-6.0000 S1000
G1 F1000 X62.9952 Y38.3585 Z-6.0000 S1000
G1 F1000 X63.0727 Y39.1782 Z-6.0000 S1000
G1 F1000 X63.0985 Y40.0000 Z-6.0000 S1000
G1 F1000 X63.0727 Y40.8218 Z-6.0000 S1000
G1 F1000 X62.9952 Y41.6415 Z-6.0000 S1000
G1 F1000 X62.8664 Y42.4547 Z-6.0000 S1000
G1 F1000 X62.6870 Y43.2574 Z-6.0000 S1000
G1 F1000 X62.4571 Y44.0487 Z-6.0000 S1000
G1 F1000 X62.1788 Y44.8217 Z-6.0000 S1000
G1 F1000 X61.8521 Y45.5765 Z-6.0000 S1000
G1 F1000 X61.4783 Y46.3102 Z-6.0000 S1000
G1 F1000 X61.0594 Y47.0187 Z-6.0000 S1000
G1 F1000 X60.5971 Y47.6988 Z-6.0000 S1000
G1 F1000 X60.0926 Y48.3492 Z-6.0000 S1000
G1 F1000 X59.5479 Y48.9671 Z-6.0000 S1000
G1 F1000 X58.9671 Y49.5479 Z-6.0000 S1000
G1 F1000 X58.3492 Y50.0926 Z-6.0000 S1000
G1 F1000 X57.6988 Y50.5971 Z-6.0000 S1000
G1 F1000 X57.0187 Y51.0594 Z-6.0000 S1000
G1 F1000 X56.3102 Y51.4783 Z-6.0000 S1000
G1 F1000 X55.5765 Y51.8521 Z-6.0000 S1000
G1 F1000 X54.8217 Y52.1788 Z-6.0000 S1000
G1 F1000 X54.0487 Y52.4571 Z-6.0000 S1000
G1 F1000 X53.2574 Y52.6870 Z-6.0000 S1000
G1 F1000 X52.4547 Y52.8664 Z-6.0000 S1000
G1 F1000 X51.6415 Y52.9952 Z-6.0000 S1000
G1 F1000 X50.8218 Y53.0727 Z-6.0000 S1000
G1 F1000 X50.0000 Y53.0985 Z-6.0000 S1000
G1 F1000 X49.1782 Y53.0727 Z-6.0000 S1000
G1 F1000 X48.3585 Y52.9952 Z-6.0000 S1000
G1 F1000 X47.5453 Y52.8664 Z-6.0000 S1000
G1 F1000 X46.7426 Y52.6870 Z-6.0000 S1000
G1 F1000 X45.9513 Y52.4571 Z-6.0000 S1000
G1 F1000 X45.1783 Y52.1788 Z-6.0000 S1000
G1 F1000 X44.4235 Y51.8521 Z-6.0000 S1000
G1 F1000 X43.6898 Y51.4783 Z-6.0000 S1000
G1 F1000 X42.9813 Y51.0594 Z-6.0000 S1000
G1 F1000 X42.3012 Y50.5971 Z-6.0000 S1000
G1 F1000 X41.6508 Y50.0926 Z-6.0000 S1000
G1 F1000 X41.0329 Y49.5479 Z-6.0000 S1000
G1 F1000 X40.4521 Y48.9671 Z-6.0000 S1000
G1 F1000 X39.9074 Y48.3492 Z-6.0000 S1000
G1 F1000 X39.4029 Y47.6988 Z-6.0000 S1000
G1 F1000 X38.9406 Y47.0187 Z-6.0000 S1000
G1 F1000 X38.5217 Y46.3102 Z-6.0000 S1000
G1 F1000 X38.1479 Y45.5765 Z-6.0000 S1000
G1 F1000 X37.8212 Y44.8217 Z-6.0000 S1000
G1 F1000 X37.5429 Y44.0487 Z-6.0000 S1000
G1 F1000 X37.3130 Y43.2574 Z-6.0000 S1000
G1 F1000 X37.1336 Y42.4547 Z-6.0000 S1000
G1 F1000 X37.0048 Y41.6415 Z-6.0000 S1000
G1 F1000 X36.9273 Y40.8218 Z-6.0000 S1000
G1 F1000 X36.9015 Y40.0000 Z-6.0000 S1000
G1 F1000 X36.9273 Y39.1782 Z-6.0000 S1000
G1 F1000 X37.0048 Y38.3585 Z-6.0000 S1000
G1 F1000 X37.1336 Y37.5453 Z-6.0000 S1000
G1 F1000 X37.3130 Y36.7426 Z-6.0000 S1000
G1 F1000 X37.5429 Y35.9513 Z-6.0000 S1000
G1 F1000 X37.8212 Y35.1783 Z-6.0000 S1000
G1 F1000 X38.1479 Y34.4235 Z-6.0000 S1000
G1 F1000 X38.5217 Y33.6898 Z-6.0000 S1000
G1 F1000 X38.9406 Y32.9813 Z-6.0000 S1000
G1 F1000 X39.4029 Y32.3012 Z-6.0000 S1000
G1 F1000 X39.9074 Y31.6508 Z-6.0000 S1000
G1 F1000 X40.4521 Y31.0329 Z-6.0000 S1000
G1 F1000 X41.0329 Y30.4521 Z-6.0000 S1000
G1 F1000 X41.6508 Y29.9074 Z-6.0000 S1000
G1 F1000 X42.3012 Y29.4029 Z-6.0000 S1000
G1 F1000 X42.9813 Y28.9406 Z-6.0000 S1000
G1 F1000 X43.6898 Y28.5217 Z-6.0000 S1000
G1 F1000 X44.4235 Y28.1479 Z-6.0000 S1000
G1 F1000 X45.1783 Y27.8212 Z-6.0000 S1000
G1 F1000 X45.9513 Y27.5429 Z-6.0000 S1000
G1 F1000 X46.7426 Y27.3130 Z-6.0000 S1000
G1 F1000 X47.5453 Y27.1336 Z-6.0000 S1000
G1 F1000 X48.3585 Y27.0048 Z-6.0000 S1000
G1 F1000 X49.1782 Y26.9273 Z-6.0000 S1000
G1 F1000 X50.0000 Y26.9015 Z-6.0000 S1000
G1 F1000 X50.8218 Y26.9273 Z-6.0000 S1000
; Starting inflateGrp: Closed?:true
G1 F100 Z-8.3000
G1 F1000 X51.6415 Y27.0048 Z-8.3000 S1000
G1 F1000 X52.4547 Y27.1336 Z-8.3000 S1000
G1 F1000 X53.2574 Y27.3130 Z-8.3000 S1000
G1 F1000 X54.0487 Y27.5429 Z-8.3000 S1000
G1 F1000 X54.8217 Y27.8212 Z-8.3000 S1000
G1 F1000 X55.5765 Y28.1479 Z-8.3000 S1000
G1 F1000 X56.3102 Y28.5217 Z-8.3000 S1000
G1 F1000 X57.0187 Y28.9406 Z-8.3000 S1000
G1 F1000 X57.6988 Y29.4029 Z-8.3000 S1000
G1 F1000 X58.3492 Y29.9074 Z-8.3000 S1000
G1 F1000 X58.9671 Y30.4521 Z-8.3000 S1000
G1 F1000 X59.5479 Y31.0329 Z-8.3000 S1000
G1 F1000 X60.0926 Y31.6508 Z-8.3000 S1000
G1 F1000 X60.5971 Y32.3012 Z-8.3000 S1000
G1 F1000 X61.0594 Y32.9813 Z-8.3000 S1000
G1 F1000 X61.4783 Y33.6898 Z-8.3000 S1000
G1 F1000 X61.8521 Y34.4235 Z-8.3000 S1000
G1 F1000 X62.1788 Y35.1783 Z-8.3000 S1000
G1 F1000 X62.4571 Y35.9513 Z-8.3000 S1000
G1 F1000 X62.6870 Y36.7426 Z-8.3000 S1000
G1 F1000 X62.8664 Y37.5453 Z-8.3000 S1000
G1 F1000 X62.9952 Y38.3585 Z-8.3000 S1000
G1 F1000 X63.0727 Y39.1782 Z-8.3000 S1000
G1 F1000 X63.0985 Y40.0000 Z-8.3000 S1000
G1 F1000 X63.0727 Y40.8218 Z-8.3000 S1000
G1 F1000 X62.9952 Y41.6415 Z-8.3000 S1000
G1 F1000 X62.8664 Y42.4547 Z-8.3000 S1000
G1 F1000 X62.6870 Y43.2574 Z-8.3000 S1000
G1 F1000 X62.4571 Y44.0487 Z-8.3000 S1000
G1 F1000 X62.1788 Y44.8217 Z-8.3000 S1000
G1 F1000 X61.8521 Y45.5765 Z-8.3000 S1000
G1 F1000 X61.4783 Y46.3102 Z-8.3000 S1000
G1 F1000 X61.0594 Y47.0187 Z-8.3000 S1000
G1 F1000 X60.5971 Y47.6988 Z-8.3000 S1000
G1 F1000 X60.0926 Y48.3492 Z-8.3000 S1000
G1 F1000 X59.5479 Y48.9671 Z-8.3000 S1000
G1 F1000 X58.9671 Y49.5479 Z-8.3000 S1000
G1 F1000 X58.3492 Y50.0926 Z-8.3000 S1000
G1 F1000 X57.6988 Y50.5971 Z-8.3000 S1000
G1 F1000 X57.0187 Y51.0594 Z-8.3000 S1000
G1 F1000 X56.3102 Y51.4783 Z-8.3000 S1000
G1 F1000 X55.5765 Y51.8521 Z-8.3000 S1000
G1 F1000 X54.8217 Y52.1788 Z-8.3000 S1000
G1 F1000 X54.0487 Y52.4571 Z-8.3000 S1000
G1 F1000 X53.2574 Y52.6870 Z-8.3000 S1000
G1 F1000 X52.4547 Y52.8664 Z-8.3000 S1000
G1 F1000 X51.6415 Y52.9952 Z-8.3000 S1000
G1 F1000 X50.8218 Y53.0727 Z-8.3000 S1000
G1 F1000 X50.0000 Y53.0985 Z-8.3000 S1000
G1 F1000 X49.1782 Y53.0727 Z-8.3000 S1000
G1 F1000 X48.3585 Y52.9952 Z-8.3000 S1000
G1 F1000 X47.5453 Y52.8664 Z-8.3000 S1000
G1 F1000 X46.7426 Y52.6870 Z-8.3000 S1000
G1 F1000 X45.9513 Y52.4571 Z-8.3000 S1000
G1 F1000 X45.1783 Y52.1788 Z-8.3000 S1000
G1 F1000 X44.4235 Y51.8521 Z-8.3000 S1000
G1 F1000 X43.6898 Y51.4783 Z-8.3000 S1000
G1 F1000 X42.9813 Y51.0594 Z-8.3000 S1000
G1 F1000 X42.3012 Y50.5971 Z-8.3000 S1000
G1 F1000 X41.6508 Y50.0926 Z-8.3000 S1000
G1 F1000 X41.0329 Y49.5479 Z-8.3000 S1000
G1 F1000 X40.4521 Y48.9671 Z-8.3000 S1000
G1 F1000 X39.9074 Y48.3492 Z-8.3000 S1000
G1 F1000 X39.4029 Y47.6988 Z-8.3000 S1000
G1 F1000 X38.9406 Y47.0187 Z-8.3000 S1000
G1 F1000 X38.5217 Y46.3102 Z-8.3000 S1000
G1 F1000 X38.1479 Y45.5765 Z-8.3000 S1000
G1 F1000 X37.8212 Y44.8217 Z-8.3000 S1000
G1 F1000 X37.5429 Y44.0487 Z-8.3000 S1000
G1 F1000 X37.3130 Y43.2574 Z-8.3000 S1000
G1 F1000 X37.1336 Y42.4547 Z-8.3000 S1000
G1 F1000 X37.0048 Y41.6415 Z-8.3000 S1000
G1 F1000 X36.9273 Y40.8218 Z-8.3000 S1000
G1 F1000 X36.9015 Y40.0000 Z-8.3000 S1000
G1 F1000 X36.9273 Y39.1782 Z-8.3000 S1000
G1 F1000 X37.0048 Y38.3585 Z-8.3000 S1000
G1 F1000 X37.1336 Y37.5453 Z-8.3000 S1000
G1 F1000 X37.3130 Y36.7426 Z-8.3000 S1000
G1 F1000 X37.5429 Y35.9513 Z-8.3000 S1000
G1 F1000 X37.8212 Y35.1783 Z-8.3000 S1000
G1 F1000 X38.1479 Y34.4235 Z-8.3000 S1000
G1 F1000 X38.5217 Y33.6898 Z-8.3000 S1000
G1 F1000 X38.9406 Y32.9813 Z-8.3000 S1000
G1 F1000 X39.4029 Y32.3012 Z-8.3000 S1000
G1 F1000 X39.9074 Y31.6508 Z-8.3000 S1000
G1 F1000 X40.4521 Y31.0329 Z-8.3000 S1000
G1 F1000 X41.0329 Y30.4521 Z-8.3000 S1000
G1 F1000 X41.6508 Y29.9074 Z-8.3000 S1000
G1 F1000 X42.3012 Y29.4029 Z-8.3000 S1000
G1 F1000 X42.9813 Y28.9406 Z-8.3000 S1000
G1 F1000 X43.6898 Y28.5217 Z-8.3000 S1000
G1 F1000 X44.4235 Y28.1479 Z-8.3000 S1000
G1 F1000 X45.1783 Y27.8212 Z-8.3000 S1000
G1 F1000 X45.9513 Y27.5429 Z-8.3000 S1000
G1 F1000 X46.7426 Y27.3130 Z-8.3000 S1000
G1 F1000 X47.5453 Y27.1336 Z-8.3000 S1000
G1 F1000 X48.3585 Y27.0048 Z-8.3000 S1000
G1 F1000 X49.1782 Y26.9273 Z-8.3000 S1000
G1 F1000 X50.0000 Y26.9015 Z-8.3000 S1000
G1 F1000 X50.8218 Y26.9273 Z-8.3000 S1000
; retracting back to z-safe
G0 Z10
; Operation 2: CNC: Vector (path outside)
; Tool Diameter: 6
; Starting inflateGrp: Closed?:true

G0 Z10
G0 F1000 X100.0000 Y-3.0000

G0 Z0
G1 F100 Z-3.0000
G1 F1000 X0.0000 Y-3.0000 Z-3.0000 S1000
G1 F1000 X-0.5500 Y-2.9491 Z-3.0000 S1000
G1 F1000 X-1.2108 Y-2.7448 Z-3.0000 S1000
G1 F1000 X-1.8072 Y-2.3946 Z-3.0000 S1000
G1 F1000 X-2.3076 Y-1.9170 Z-3.0000 S1000
G1 F1000 X-2.6853 Y-1.3376 Z-3.0000 S1000
G1 F1000 X-2.9203 Y-0.6871 Z-3.0000 S1000
G1 F1000 X-3.0000 Y0.0000 Z-3.0000 S1000
G1 F1000 X-3.0000 Y80.0000 Z-3.0000 S1000
G1 F1000 X-2.9491 Y80.5500 Z-3.0000 S1000
G1 F1000 X-2.7448 Y81.2108 Z-3.0000 S1000
G1 F1000 X-2.3946 Y81.8072 Z-3.0000 S1000
G1 F1000 X-1.9170 Y82.3076 Z-3.0000 S1000
G1 F1000 X-1.3376 Y82.6853 Z-3.0000 S1000
G1 F1000 X-0.6871 Y82.9203 Z-3.0000 S1000
G1 F1000 X0.0000 Y83.0000 Z-3.0000 S1000
G1 F1000 X100.0000 Y83.0000 Z-3.0000 S1000
G1 F1000 X100.5500 Y82.9491 Z-3.0000 S1000
G1 F1000 X101.2108 Y82.7448 Z-3.0000 S1000
G1 F1000 X101.8072 Y82.3946 Z-3.0000 S1000
G1 F1000 X102.3076 Y81.9170 Z-3.0000 S1000
G1 F1000 X102.6853 Y81.3376 Z-3.0000 S1000
G1 F1000 X102.9203 Y80.6871 Z-3.0000 S1000
G1 F1000 X103.0000 Y80.0000 Z-3.0000 S1000
G1 F1000 X103.0000 Y0.0000 Z-3.0000 S1000
G1 F1000 X102.9491 Y-0.5500 Z-3.0000 S1000
G1 F1000 X102.7448 Y-1.2108 Z-3.0000 S1000
G1 F1000 X102.3946 Y-1.8072 Z-3.0000 S1000
G1 F1000 X101.9170 Y-2.3076 Z-3.0000 S1000
G1 F1000 X101.3376 Y-2.6853 Z-3.0000 S1000
G1 F1000 X100.6871 Y-2.9203 Z-3.0000 S1000
G1 F1000 X100.0000 Y-3.0000 Z-3.0000 S1000
; Starting inflateGrp: Closed?:true
G1 F100 Z-6.0000
G1 F1000 X56.0000 Y-3.0000 Z-6.0000 S1000
G1 F1000 X56.0000 Y-3.0000 Z-4.3000 S1000
G1 F1000 X44.0000 Y-3.0000 Z-4.3000 S1000
G1 F1000 X44.0000 Y-3.0000 Z-6.0000 S1000
G1 F1000 X0.0000 Y-3.0000 Z-6.0000 S1000
G1 F1000 X0.0000 Y-3.0000 Z-6.0000 S1000
G1 F1000 X-0.5500 Y-2.9491 Z-6.0000 S1000
G1 F1000 X-1.2108 Y-2.7448 Z-6.0000 S1000
G1 F1000 X-1.8072 Y-2.3946 Z-6.0000 S1000
G1 F1000 X-2.3076 Y-1.9170 Z-6.0000 S1000
G1 F1000 X-2.6853 Y-1.3376 Z-6.0000 S1000
G1 F1000 X-2.9203 Y-0.6871 Z-6.0000 S1000
G1 F1000 X-3.0000 Y0.0000 Z-6.0000 S1000
G1 F1000 X-3.0000 Y34.0000 Z-6.0000 S1000
G1 F1000 X-3.0000 Y34.0000 Z-4.3000 S1000
G1 F1000 X-3.0000 Y46.0000 Z-4.3000 S1000
G1 F1000 X-3.0000 Y46.0000 Z-6.0000 S1000
G1 F1000 X-3.0000 Y80.0000 Z-6.0000 S1000
G1 F1000 X-3.0000 Y80.0000 Z-6.0000 S1000
G1 F1000 X-2.9491 Y80.5500 Z-6.0000 S1000
G1 F1000 X-2.7448 Y81.2108 Z-6.0000 S1000
G1 F1000 X-2.3946 Y81.8072 Z-6.0000 S1000
G1 F1000 X-1.9170 Y82.3076 Z-6.0000 S1000
G1 F1000 X-1.3376 Y82.6853 Z-6.0000 S1000
G1 F1000 X-0.6871 Y82.9203 Z-6.0000 S1000
G1 F1000 X0.0000 Y83.0000 Z-6.0000 S1000
G1 F1000 X100.0000 Y83.0000 Z-6.0000 S1000
G1 F1000 X100.5500 Y82.9491 Z-6.0000 S1000
G1 F1000 X101.2108 Y82.7448 Z-6.0000 S1000
G1 F1000 X101.8072 Y82.3946 Z-6.0000 S1000
G1 F1000 X102.3076 Y81.9170 Z-6.0000 S1000
G1 F1000 X102.6853 Y81.3376 Z-6.0000 S1000
G1 F1000 X102.9203 Y80.6871 Z-6.0000 S1000
G1 F1000 X103.0000 Y80.0000 Z-6.0000 S1000
G1 F1000 X103.0000 Y46.0000 Z-6.0000 S1000
G1 F1000 X103.0000 Y46.0000 Z-4.3000 S1000
G1 F1000 X103.0000 Y34.0000 Z-4.3000 S1000
G1 F1000 X103.0000 Y34.0000 Z-6.0000 S1000
G1 F1000 X103.0000 Y0.0000 Z-6.0000 S1000
G1 F1000 X103.0000 Y0.0000 Z-6.0000 S1000
G1 F1000 X102.9491 Y-0.5500 Z-6.0000 S1000
G1 F1000 X102.7448 Y-1.2108 Z-6.0000 S1000
G1 F1000 X102.3946 Y-1.8072 Z-6.0000 S1000
G1 F1000 X101.9170 Y-2.3076 Z-6.0000 S1000
G1 F1000 X101.3376 Y-2.6853 Z-6.0000 S1000
G1 F1000 X100.6871 Y-2.9203 Z-6.0000 S1000
G1 F1000 X100.0000 Y-3.0000 Z-6.0000 S1000
; Starting inflateGrp: Closed?:true
G1 F100 Z-8.3000
G1 F1000 X56.0000 Y-3.0000 Z-8.3000 S1000
G1 F1000 X56.0000 Y-3.0000 Z-4.3000 S1000
G1 F1000 X44.0000 Y-3.0000 Z-4.3000 S1000
G1 F1000 X44.0000 Y-3.0000 Z-8.3000 S1000
G1 F1000 X0.0000 Y-3.0000 Z-8.3000 S1000
G1 F1000 X0.0000 Y-3.0000 Z-8.3000 S1000
G1 F1000 X-0.5500 Y-2.9491 Z-8.3000 S1000
G1 F1000 X-1.2108 Y-2.7448 Z-8.3000 S1000
G1 F1000 X-1.8072 Y-2.3946 Z-8.3000 S1000
G1 F1000 X-2.3076 Y-1.9170 Z-8.3000 S1000
G1 F1000 X-2.6853 Y-1.3376 Z-8.3000 S1000
G1 F1000 X-2.9203 Y-0.6871 Z-8.3000 S1000
G1 F1000 X-3.0000 Y0.0000 Z-8.3000 S1000
G1 F1000 X-3.0000 Y34.0000 Z-8.3000 S1000
G1 F1000 X-3.0000 Y34.0000 Z-4.3000 S1000
G1 F1000 X-3.0000 Y46.0000 Z-4.3000 S1000
G1 F1000 X-3.0000 Y46.0000 Z-8.3000 S1000
G1 F1000 X-3.0000 Y80.0000 Z-8.3000 S1000
G1 F1000 X-3.0000 Y80.0000 Z-8.3000 S1000
G1 F1000 X-2.9491 Y80.5500 Z-8.3000 S1000
G1 F1000 X-2.7448 Y81.2108 Z-8.3000 S1000
G1 F1000 X-2.3946 Y81.8072 Z-8.3000 S1000
G1 F1000 X-1.9170 Y82.3076 Z-8.3000 S1000
G1 F1000 X-1.3376 Y82.6853 Z-8.3000 S1000
G1 F1000 X-0.6871 Y82.9203 Z-8.3000 S1000
G1 F1000 X0.0000 Y83.0000 Z-8.3000 S1000
G1 F1000 X100.0000 Y83.0000 Z-8.3000 S1000
G1 F1000 X100.5500 Y82.9491 Z-8.3000 S1000
G1 F1000 X101.2108 Y82.7448 Z-8.3000 S1000
G1 F1000 X101.8072 Y82.3946 Z-8.3000 S1000
G1 F1000 X102.3076 Y81.9170 Z-8.3000 S1000
G1 F1000 X102.6853 Y81.3376 Z-8.3000 S1000
G1 F1000 X102.9203 Y80.6871 Z-8.3000 S1000
G1 F1000 X103.0000 Y80.0000 Z-8.3000 S1000
G1 F1000 X103.0000 Y46.0000 Z-8.3000 S1000
G1 F1000 X103.0000 Y46.0000 Z-4.3000 S1000
G1 F1000 X103.0000 Y34.0000 Z-4.3000 S1000
G1 F1000 X103.0000 Y34.0000 Z-8.3000 S1000
G1 F1000 X103.0000 Y0.0000 Z-8.3000 S1000
G1 F1000 X103.0000 Y0.0000 Z-8.3000 S1000
G1 F1000 X102.9491 Y-0.5500 Z-8.3000 S1000
G1 F1000 X102.7448 Y-1.2108 Z-8.3000 S1000
G1 F1000 X102.3946 Y-1.8072 Z-8.3000 S1000
G1 F1000 X101.9170 Y-2.3076 Z-8.3000 S1000
G1 F1000 X101.3376 Y-2.6853 Z-8.3000 S1000
G1 F1000 X100.6871 Y-2.9203 Z-8.3000 S1000
G1 F1000 X100.0000 Y-3.0000 Z-8.3000 S1000
; retracting back to z-safe
G0 Z10

M5 S0; Spindle Off
