; GCODE Generated by cam.openbuilds.com on 2020-09-02 
G21 ; mm-mode
G54; Work Coordinates
G21; mm-mode
G90; Absolute Positioning
M3 S1000; Spindle On

; Operation 0: CNC: Vector (path inside)
; Tool Diameter: 3
; Starting inflateGrp: Closed?:true

G0 Z10
G0 F1000 X10.4099 Y9.0109

G0 Z0
G1 F300 Z-1.5000
G1 F1000 X10.7570 Y9.2429 Z-1.5000 S1000
G1 F1000 X10.9891 Y9.5902 Z-1.5000 S1000
G1 F1000 X11.0706 Y10.0000 Z-1.5000 S1000
G1 F1000 X10.9891 Y10.4099 Z-1.5000 S1000
G1 F1000 X10.7571 Y10.7571 Z-1.5000 S1000
G1 F1000 X10.4099 Y10.9891 Z-1.5000 S1000
G1 F1000 X10.0000 Y11.0706 Z-1.5000 S1000
G1 F1000 X9.5902 Y10.9891 Z-1.5000 S1000
G1 F1000 X9.2429 Y10.7570 Z-1.5000 S1000
G1 F1000 X9.0109 Y10.4099 Z-1.5000 S1000
G1 F1000 X8.9294 Y10.0000 Z-1.5000 S1000
G1 F1000 X9.0109 Y9.5902 Z-1.5000 S1000
G1 F1000 X9.2430 Y9.2430 Z-1.5000 S1000
G1 F1000 X9.5902 Y9.0109 Z-1.5000 S1000
G1 F1000 X10.0000 Y8.9294 Z-1.5000 S1000
G1 F1000 X10.4099 Y9.0109 Z-1.5000 S1000
; Starting inflateGrp: Closed?:true
G1 F300 Z-3.0000
G1 F1000 X10.7570 Y9.2429 Z-3.0000 S1000
G1 F1000 X10.9891 Y9.5902 Z-3.0000 S1000
G1 F1000 X11.0706 Y10.0000 Z-3.0000 S1000
G1 F1000 X10.9891 Y10.4099 Z-3.0000 S1000
G1 F1000 X10.7571 Y10.7571 Z-3.0000 S1000
G1 F1000 X10.4099 Y10.9891 Z-3.0000 S1000
G1 F1000 X10.0000 Y11.0706 Z-3.0000 S1000
G1 F1000 X9.5902 Y10.9891 Z-3.0000 S1000
G1 F1000 X9.2429 Y10.7570 Z-3.0000 S1000
G1 F1000 X9.0109 Y10.4099 Z-3.0000 S1000
G1 F1000 X8.9294 Y10.0000 Z-3.0000 S1000
G1 F1000 X9.0109 Y9.5902 Z-3.0000 S1000
G1 F1000 X9.2430 Y9.2430 Z-3.0000 S1000
G1 F1000 X9.5902 Y9.0109 Z-3.0000 S1000
G1 F1000 X10.0000 Y8.9294 Z-3.0000 S1000
G1 F1000 X10.4099 Y9.0109 Z-3.0000 S1000
; Starting inflateGrp: Closed?:true
G1 F300 Z-4.5000
G1 F1000 X10.7570 Y9.2429 Z-4.5000 S1000
G1 F1000 X10.9891 Y9.5902 Z-4.5000 S1000
G1 F1000 X11.0706 Y10.0000 Z-4.5000 S1000
G1 F1000 X10.9891 Y10.4099 Z-4.5000 S1000
G1 F1000 X10.7571 Y10.7571 Z-4.5000 S1000
G1 F1000 X10.4099 Y10.9891 Z-4.5000 S1000
G1 F1000 X10.0000 Y11.0706 Z-4.5000 S1000
G1 F1000 X9.5902 Y10.9891 Z-4.5000 S1000
G1 F1000 X9.2429 Y10.7570 Z-4.5000 S1000
G1 F1000 X9.0109 Y10.4099 Z-4.5000 S1000
G1 F1000 X8.9294 Y10.0000 Z-4.5000 S1000
G1 F1000 X9.0109 Y9.5902 Z-4.5000 S1000
G1 F1000 X9.2430 Y9.2430 Z-4.5000 S1000
G1 F1000 X9.5902 Y9.0109 Z-4.5000 S1000
G1 F1000 X10.0000 Y8.9294 Z-4.5000 S1000
G1 F1000 X10.4099 Y9.0109 Z-4.5000 S1000
; Starting inflateGrp: Closed?:true
G1 F300 Z-6.0000
G1 F1000 X10.7570 Y9.2429 Z-6.0000 S1000
G1 F1000 X10.9891 Y9.5902 Z-6.0000 S1000
G1 F1000 X11.0706 Y10.0000 Z-6.0000 S1000
G1 F1000 X10.9891 Y10.4099 Z-6.0000 S1000
G1 F1000 X10.7571 Y10.7571 Z-6.0000 S1000
G1 F1000 X10.4099 Y10.9891 Z-6.0000 S1000
G1 F1000 X10.0000 Y11.0706 Z-6.0000 S1000
G1 F1000 X9.5902 Y10.9891 Z-6.0000 S1000
G1 F1000 X9.2429 Y10.7570 Z-6.0000 S1000
G1 F1000 X9.0109 Y10.4099 Z-6.0000 S1000
G1 F1000 X8.9294 Y10.0000 Z-6.0000 S1000
G1 F1000 X9.0109 Y9.5902 Z-6.0000 S1000
G1 F1000 X9.2430 Y9.2430 Z-6.0000 S1000
G1 F1000 X9.5902 Y9.0109 Z-6.0000 S1000
G1 F1000 X10.0000 Y8.9294 Z-6.0000 S1000
G1 F1000 X10.4099 Y9.0109 Z-6.0000 S1000
; Starting inflateGrp: Closed?:true
G1 F300 Z-7.5000
G1 F1000 X10.7570 Y9.2429 Z-7.5000 S1000
G1 F1000 X10.9891 Y9.5902 Z-7.5000 S1000
G1 F1000 X11.0706 Y10.0000 Z-7.5000 S1000
G1 F1000 X10.9891 Y10.4099 Z-7.5000 S1000
G1 F1000 X10.7571 Y10.7571 Z-7.5000 S1000
G1 F1000 X10.4099 Y10.9891 Z-7.5000 S1000
G1 F1000 X10.0000 Y11.0706 Z-7.5000 S1000
G1 F1000 X9.5902 Y10.9891 Z-7.5000 S1000
G1 F1000 X9.2429 Y10.7570 Z-7.5000 S1000
G1 F1000 X9.0109 Y10.4099 Z-7.5000 S1000
G1 F1000 X8.9294 Y10.0000 Z-7.5000 S1000
G1 F1000 X9.0109 Y9.5902 Z-7.5000 S1000
G1 F1000 X9.2430 Y9.2430 Z-7.5000 S1000
G1 F1000 X9.5902 Y9.0109 Z-7.5000 S1000
G1 F1000 X10.0000 Y8.9294 Z-7.5000 S1000
G1 F1000 X10.4099 Y9.0109 Z-7.5000 S1000
; Starting inflateGrp: Closed?:true
G1 F300 Z-9.0000
G1 F1000 X10.7570 Y9.2429 Z-9.0000 S1000
G1 F1000 X10.9891 Y9.5902 Z-9.0000 S1000
G1 F1000 X11.0706 Y10.0000 Z-9.0000 S1000
G1 F1000 X10.9891 Y10.4099 Z-9.0000 S1000
G1 F1000 X10.7571 Y10.7571 Z-9.0000 S1000
G1 F1000 X10.4099 Y10.9891 Z-9.0000 S1000
G1 F1000 X10.0000 Y11.0706 Z-9.0000 S1000
G1 F1000 X9.5902 Y10.9891 Z-9.0000 S1000
G1 F1000 X9.2429 Y10.7570 Z-9.0000 S1000
G1 F1000 X9.0109 Y10.4099 Z-9.0000 S1000
G1 F1000 X8.9294 Y10.0000 Z-9.0000 S1000
G1 F1000 X9.0109 Y9.5902 Z-9.0000 S1000
G1 F1000 X9.2430 Y9.2430 Z-9.0000 S1000
G1 F1000 X9.5902 Y9.0109 Z-9.0000 S1000
G1 F1000 X10.0000 Y8.9294 Z-9.0000 S1000
G1 F1000 X10.4099 Y9.0109 Z-9.0000 S1000
; Starting inflateGrp: Closed?:true
G1 F300 Z-10.5000
G1 F1000 X10.7570 Y9.2429 Z-10.5000 S1000
G1 F1000 X10.9891 Y9.5902 Z-10.5000 S1000
G1 F1000 X11.0706 Y10.0000 Z-10.5000 S1000
G1 F1000 X10.9891 Y10.4099 Z-10.5000 S1000
G1 F1000 X10.7571 Y10.7571 Z-10.5000 S1000
G1 F1000 X10.4099 Y10.9891 Z-10.5000 S1000
G1 F1000 X10.0000 Y11.0706 Z-10.5000 S1000
G1 F1000 X9.5902 Y10.9891 Z-10.5000 S1000
G1 F1000 X9.2429 Y10.7570 Z-10.5000 S1000
G1 F1000 X9.0109 Y10.4099 Z-10.5000 S1000
G1 F1000 X8.9294 Y10.0000 Z-10.5000 S1000
G1 F1000 X9.0109 Y9.5902 Z-10.5000 S1000
G1 F1000 X9.2430 Y9.2430 Z-10.5000 S1000
G1 F1000 X9.5902 Y9.0109 Z-10.5000 S1000
G1 F1000 X10.0000 Y8.9294 Z-10.5000 S1000
G1 F1000 X10.4099 Y9.0109 Z-10.5000 S1000
; Starting inflateGrp: Closed?:true
G1 F300 Z-12.0000
G1 F1000 X10.7570 Y9.2429 Z-12.0000 S1000
G1 F1000 X10.9891 Y9.5902 Z-12.0000 S1000
G1 F1000 X11.0706 Y10.0000 Z-12.0000 S1000
G1 F1000 X10.9891 Y10.4099 Z-12.0000 S1000
G1 F1000 X10.7571 Y10.7571 Z-12.0000 S1000
G1 F1000 X10.4099 Y10.9891 Z-12.0000 S1000
G1 F1000 X10.0000 Y11.0706 Z-12.0000 S1000
G1 F1000 X9.5902 Y10.9891 Z-12.0000 S1000
G1 F1000 X9.2429 Y10.7570 Z-12.0000 S1000
G1 F1000 X9.0109 Y10.4099 Z-12.0000 S1000
G1 F1000 X8.9294 Y10.0000 Z-12.0000 S1000
G1 F1000 X9.0109 Y9.5902 Z-12.0000 S1000
G1 F1000 X9.2430 Y9.2430 Z-12.0000 S1000
G1 F1000 X9.5902 Y9.0109 Z-12.0000 S1000
G1 F1000 X10.0000 Y8.9294 Z-12.0000 S1000
G1 F1000 X10.4099 Y9.0109 Z-12.0000 S1000
; Starting inflateGrp: Closed?:true
G1 F300 Z-13.5000
G1 F1000 X10.7570 Y9.2429 Z-13.5000 S1000
G1 F1000 X10.9891 Y9.5902 Z-13.5000 S1000
G1 F1000 X11.0706 Y10.0000 Z-13.5000 S1000
G1 F1000 X10.9891 Y10.4099 Z-13.5000 S1000
G1 F1000 X10.7571 Y10.7571 Z-13.5000 S1000
G1 F1000 X10.4099 Y10.9891 Z-13.5000 S1000
G1 F1000 X10.0000 Y11.0706 Z-13.5000 S1000
G1 F1000 X9.5902 Y10.9891 Z-13.5000 S1000
G1 F1000 X9.2429 Y10.7570 Z-13.5000 S1000
G1 F1000 X9.0109 Y10.4099 Z-13.5000 S1000
G1 F1000 X8.9294 Y10.0000 Z-13.5000 S1000
G1 F1000 X9.0109 Y9.5902 Z-13.5000 S1000
G1 F1000 X9.2430 Y9.2430 Z-13.5000 S1000
G1 F1000 X9.5902 Y9.0109 Z-13.5000 S1000
G1 F1000 X10.0000 Y8.9294 Z-13.5000 S1000
G1 F1000 X10.4099 Y9.0109 Z-13.5000 S1000
; Starting inflateGrp: Closed?:true
G1 F300 Z-15.0000
G1 F1000 X10.7570 Y9.2429 Z-15.0000 S1000
G1 F1000 X10.9891 Y9.5902 Z-15.0000 S1000
G1 F1000 X11.0706 Y10.0000 Z-15.0000 S1000
G1 F1000 X10.9891 Y10.4099 Z-15.0000 S1000
G1 F1000 X10.7571 Y10.7571 Z-15.0000 S1000
G1 F1000 X10.4099 Y10.9891 Z-15.0000 S1000
G1 F1000 X10.0000 Y11.0706 Z-15.0000 S1000
G1 F1000 X9.5902 Y10.9891 Z-15.0000 S1000
G1 F1000 X9.2429 Y10.7570 Z-15.0000 S1000
G1 F1000 X9.0109 Y10.4099 Z-15.0000 S1000
G1 F1000 X8.9294 Y10.0000 Z-15.0000 S1000
G1 F1000 X9.0109 Y9.5902 Z-15.0000 S1000
G1 F1000 X9.2430 Y9.2430 Z-15.0000 S1000
G1 F1000 X9.5902 Y9.0109 Z-15.0000 S1000
G1 F1000 X10.0000 Y8.9294 Z-15.0000 S1000
G1 F1000 X10.4099 Y9.0109 Z-15.0000 S1000
; Starting inflateGrp: Closed?:true
G1 F300 Z-16.5000
G1 F1000 X10.7570 Y9.2429 Z-16.5000 S1000
G1 F1000 X10.9891 Y9.5902 Z-16.5000 S1000
G1 F1000 X11.0706 Y10.0000 Z-16.5000 S1000
G1 F1000 X10.9891 Y10.4099 Z-16.5000 S1000
G1 F1000 X10.7571 Y10.7571 Z-16.5000 S1000
G1 F1000 X10.4099 Y10.9891 Z-16.5000 S1000
G1 F1000 X10.0000 Y11.0706 Z-16.5000 S1000
G1 F1000 X9.5902 Y10.9891 Z-16.5000 S1000
G1 F1000 X9.2429 Y10.7570 Z-16.5000 S1000
G1 F1000 X9.0109 Y10.4099 Z-16.5000 S1000
G1 F1000 X8.9294 Y10.0000 Z-16.5000 S1000
G1 F1000 X9.0109 Y9.5902 Z-16.5000 S1000
G1 F1000 X9.2430 Y9.2430 Z-16.5000 S1000
G1 F1000 X9.5902 Y9.0109 Z-16.5000 S1000
G1 F1000 X10.0000 Y8.9294 Z-16.5000 S1000
G1 F1000 X10.4099 Y9.0109 Z-16.5000 S1000
; Starting inflateGrp: Closed?:true
G1 F300 Z-18.0000
G1 F1000 X10.7570 Y9.2429 Z-18.0000 S1000
G1 F1000 X10.9891 Y9.5902 Z-18.0000 S1000
G1 F1000 X11.0706 Y10.0000 Z-18.0000 S1000
G1 F1000 X10.9891 Y10.4099 Z-18.0000 S1000
G1 F1000 X10.7571 Y10.7571 Z-18.0000 S1000
G1 F1000 X10.4099 Y10.9891 Z-18.0000 S1000
G1 F1000 X10.0000 Y11.0706 Z-18.0000 S1000
G1 F1000 X9.5902 Y10.9891 Z-18.0000 S1000
G1 F1000 X9.2429 Y10.7570 Z-18.0000 S1000
G1 F1000 X9.0109 Y10.4099 Z-18.0000 S1000
G1 F1000 X8.9294 Y10.0000 Z-18.0000 S1000
G1 F1000 X9.0109 Y9.5902 Z-18.0000 S1000
G1 F1000 X9.2430 Y9.2430 Z-18.0000 S1000
G1 F1000 X9.5902 Y9.0109 Z-18.0000 S1000
G1 F1000 X10.0000 Y8.9294 Z-18.0000 S1000
G1 F1000 X10.4099 Y9.0109 Z-18.0000 S1000
; Starting inflateGrp: Closed?:true
G1 F300 Z-19.2000
G1 F1000 X10.7570 Y9.2429 Z-19.2000 S1000
G1 F1000 X10.9891 Y9.5902 Z-19.2000 S1000
G1 F1000 X11.0706 Y10.0000 Z-19.2000 S1000
G1 F1000 X10.9891 Y10.4099 Z-19.2000 S1000
G1 F1000 X10.7571 Y10.7571 Z-19.2000 S1000
G1 F1000 X10.4099 Y10.9891 Z-19.2000 S1000
G1 F1000 X10.0000 Y11.0706 Z-19.2000 S1000
G1 F1000 X9.5902 Y10.9891 Z-19.2000 S1000
G1 F1000 X9.2429 Y10.7570 Z-19.2000 S1000
G1 F1000 X9.0109 Y10.4099 Z-19.2000 S1000
G1 F1000 X8.9294 Y10.0000 Z-19.2000 S1000
G1 F1000 X9.0109 Y9.5902 Z-19.2000 S1000
G1 F1000 X9.2430 Y9.2430 Z-19.2000 S1000
G1 F1000 X9.5902 Y9.0109 Z-19.2000 S1000
G1 F1000 X10.0000 Y8.9294 Z-19.2000 S1000
G1 F1000 X10.4099 Y9.0109 Z-19.2000 S1000
; Starting inflateGrp: Closed?:true

G0 Z10
G0 X30.4099 Y9.0109

G0 Z0
G1 F300 Z-1.5000
G1 F1000 X30.7570 Y9.2429 Z-1.5000 S1000
G1 F1000 X30.9891 Y9.5902 Z-1.5000 S1000
G1 F1000 X31.0706 Y10.0000 Z-1.5000 S1000
G1 F1000 X30.9891 Y10.4099 Z-1.5000 S1000
G1 F1000 X30.7571 Y10.7571 Z-1.5000 S1000
G1 F1000 X30.4099 Y10.9891 Z-1.5000 S1000
G1 F1000 X30.0000 Y11.0706 Z-1.5000 S1000
G1 F1000 X29.5902 Y10.9891 Z-1.5000 S1000
G1 F1000 X29.2429 Y10.7570 Z-1.5000 S1000
G1 F1000 X29.0109 Y10.4099 Z-1.5000 S1000
G1 F1000 X28.9294 Y10.0000 Z-1.5000 S1000
G1 F1000 X29.0109 Y9.5902 Z-1.5000 S1000
G1 F1000 X29.2430 Y9.2430 Z-1.5000 S1000
G1 F1000 X29.5902 Y9.0109 Z-1.5000 S1000
G1 F1000 X30.0000 Y8.9294 Z-1.5000 S1000
G1 F1000 X30.4099 Y9.0109 Z-1.5000 S1000
; Starting inflateGrp: Closed?:true
G1 F300 Z-3.0000
G1 F1000 X30.7570 Y9.2429 Z-3.0000 S1000
G1 F1000 X30.9891 Y9.5902 Z-3.0000 S1000
G1 F1000 X31.0706 Y10.0000 Z-3.0000 S1000
G1 F1000 X30.9891 Y10.4099 Z-3.0000 S1000
G1 F1000 X30.7571 Y10.7571 Z-3.0000 S1000
G1 F1000 X30.4099 Y10.9891 Z-3.0000 S1000
G1 F1000 X30.0000 Y11.0706 Z-3.0000 S1000
G1 F1000 X29.5902 Y10.9891 Z-3.0000 S1000
G1 F1000 X29.2429 Y10.7570 Z-3.0000 S1000
G1 F1000 X29.0109 Y10.4099 Z-3.0000 S1000
G1 F1000 X28.9294 Y10.0000 Z-3.0000 S1000
G1 F1000 X29.0109 Y9.5902 Z-3.0000 S1000
G1 F1000 X29.2430 Y9.2430 Z-3.0000 S1000
G1 F1000 X29.5902 Y9.0109 Z-3.0000 S1000
G1 F1000 X30.0000 Y8.9294 Z-3.0000 S1000
G1 F1000 X30.4099 Y9.0109 Z-3.0000 S1000
; Starting inflateGrp: Closed?:true
G1 F300 Z-4.5000
G1 F1000 X30.7570 Y9.2429 Z-4.5000 S1000
G1 F1000 X30.9891 Y9.5902 Z-4.5000 S1000
G1 F1000 X31.0706 Y10.0000 Z-4.5000 S1000
G1 F1000 X30.9891 Y10.4099 Z-4.5000 S1000
G1 F1000 X30.7571 Y10.7571 Z-4.5000 S1000
G1 F1000 X30.4099 Y10.9891 Z-4.5000 S1000
G1 F1000 X30.0000 Y11.0706 Z-4.5000 S1000
G1 F1000 X29.5902 Y10.9891 Z-4.5000 S1000
G1 F1000 X29.2429 Y10.7570 Z-4.5000 S1000
G1 F1000 X29.0109 Y10.4099 Z-4.5000 S1000
G1 F1000 X28.9294 Y10.0000 Z-4.5000 S1000
G1 F1000 X29.0109 Y9.5902 Z-4.5000 S1000
G1 F1000 X29.2430 Y9.2430 Z-4.5000 S1000
G1 F1000 X29.5902 Y9.0109 Z-4.5000 S1000
G1 F1000 X30.0000 Y8.9294 Z-4.5000 S1000
G1 F1000 X30.4099 Y9.0109 Z-4.5000 S1000
; Starting inflateGrp: Closed?:true
G1 F300 Z-6.0000
G1 F1000 X30.7570 Y9.2429 Z-6.0000 S1000
G1 F1000 X30.9891 Y9.5902 Z-6.0000 S1000
G1 F1000 X31.0706 Y10.0000 Z-6.0000 S1000
G1 F1000 X30.9891 Y10.4099 Z-6.0000 S1000
G1 F1000 X30.7571 Y10.7571 Z-6.0000 S1000
G1 F1000 X30.4099 Y10.9891 Z-6.0000 S1000
G1 F1000 X30.0000 Y11.0706 Z-6.0000 S1000
G1 F1000 X29.5902 Y10.9891 Z-6.0000 S1000
G1 F1000 X29.2429 Y10.7570 Z-6.0000 S1000
G1 F1000 X29.0109 Y10.4099 Z-6.0000 S1000
G1 F1000 X28.9294 Y10.0000 Z-6.0000 S1000
G1 F1000 X29.0109 Y9.5902 Z-6.0000 S1000
G1 F1000 X29.2430 Y9.2430 Z-6.0000 S1000
G1 F1000 X29.5902 Y9.0109 Z-6.0000 S1000
G1 F1000 X30.0000 Y8.9294 Z-6.0000 S1000
G1 F1000 X30.4099 Y9.0109 Z-6.0000 S1000
; Starting inflateGrp: Closed?:true
G1 F300 Z-7.5000
G1 F1000 X30.7570 Y9.2429 Z-7.5000 S1000
G1 F1000 X30.9891 Y9.5902 Z-7.5000 S1000
G1 F1000 X31.0706 Y10.0000 Z-7.5000 S1000
G1 F1000 X30.9891 Y10.4099 Z-7.5000 S1000
G1 F1000 X30.7571 Y10.7571 Z-7.5000 S1000
G1 F1000 X30.4099 Y10.9891 Z-7.5000 S1000
G1 F1000 X30.0000 Y11.0706 Z-7.5000 S1000
G1 F1000 X29.5902 Y10.9891 Z-7.5000 S1000
G1 F1000 X29.2429 Y10.7570 Z-7.5000 S1000
G1 F1000 X29.0109 Y10.4099 Z-7.5000 S1000
G1 F1000 X28.9294 Y10.0000 Z-7.5000 S1000
G1 F1000 X29.0109 Y9.5902 Z-7.5000 S1000
G1 F1000 X29.2430 Y9.2430 Z-7.5000 S1000
G1 F1000 X29.5902 Y9.0109 Z-7.5000 S1000
G1 F1000 X30.0000 Y8.9294 Z-7.5000 S1000
G1 F1000 X30.4099 Y9.0109 Z-7.5000 S1000
; Starting inflateGrp: Closed?:true
G1 F300 Z-9.0000
G1 F1000 X30.7570 Y9.2429 Z-9.0000 S1000
G1 F1000 X30.9891 Y9.5902 Z-9.0000 S1000
G1 F1000 X31.0706 Y10.0000 Z-9.0000 S1000
G1 F1000 X30.9891 Y10.4099 Z-9.0000 S1000
G1 F1000 X30.7571 Y10.7571 Z-9.0000 S1000
G1 F1000 X30.4099 Y10.9891 Z-9.0000 S1000
G1 F1000 X30.0000 Y11.0706 Z-9.0000 S1000
G1 F1000 X29.5902 Y10.9891 Z-9.0000 S1000
G1 F1000 X29.2429 Y10.7570 Z-9.0000 S1000
G1 F1000 X29.0109 Y10.4099 Z-9.0000 S1000
G1 F1000 X28.9294 Y10.0000 Z-9.0000 S1000
G1 F1000 X29.0109 Y9.5902 Z-9.0000 S1000
G1 F1000 X29.2430 Y9.2430 Z-9.0000 S1000
G1 F1000 X29.5902 Y9.0109 Z-9.0000 S1000
G1 F1000 X30.0000 Y8.9294 Z-9.0000 S1000
G1 F1000 X30.4099 Y9.0109 Z-9.0000 S1000
; Starting inflateGrp: Closed?:true
G1 F300 Z-10.5000
G1 F1000 X30.7570 Y9.2429 Z-10.5000 S1000
G1 F1000 X30.9891 Y9.5902 Z-10.5000 S1000
G1 F1000 X31.0706 Y10.0000 Z-10.5000 S1000
G1 F1000 X30.9891 Y10.4099 Z-10.5000 S1000
G1 F1000 X30.7571 Y10.7571 Z-10.5000 S1000
G1 F1000 X30.4099 Y10.9891 Z-10.5000 S1000
G1 F1000 X30.0000 Y11.0706 Z-10.5000 S1000
G1 F1000 X29.5902 Y10.9891 Z-10.5000 S1000
G1 F1000 X29.2429 Y10.7570 Z-10.5000 S1000
G1 F1000 X29.0109 Y10.4099 Z-10.5000 S1000
G1 F1000 X28.9294 Y10.0000 Z-10.5000 S1000
G1 F1000 X29.0109 Y9.5902 Z-10.5000 S1000
G1 F1000 X29.2430 Y9.2430 Z-10.5000 S1000
G1 F1000 X29.5902 Y9.0109 Z-10.5000 S1000
G1 F1000 X30.0000 Y8.9294 Z-10.5000 S1000
G1 F1000 X30.4099 Y9.0109 Z-10.5000 S1000
; Starting inflateGrp: Closed?:true
G1 F300 Z-12.0000
G1 F1000 X30.7570 Y9.2429 Z-12.0000 S1000
G1 F1000 X30.9891 Y9.5902 Z-12.0000 S1000
G1 F1000 X31.0706 Y10.0000 Z-12.0000 S1000
G1 F1000 X30.9891 Y10.4099 Z-12.0000 S1000
G1 F1000 X30.7571 Y10.7571 Z-12.0000 S1000
G1 F1000 X30.4099 Y10.9891 Z-12.0000 S1000
G1 F1000 X30.0000 Y11.0706 Z-12.0000 S1000
G1 F1000 X29.5902 Y10.9891 Z-12.0000 S1000
G1 F1000 X29.2429 Y10.7570 Z-12.0000 S1000
G1 F1000 X29.0109 Y10.4099 Z-12.0000 S1000
G1 F1000 X28.9294 Y10.0000 Z-12.0000 S1000
G1 F1000 X29.0109 Y9.5902 Z-12.0000 S1000
G1 F1000 X29.2430 Y9.2430 Z-12.0000 S1000
G1 F1000 X29.5902 Y9.0109 Z-12.0000 S1000
G1 F1000 X30.0000 Y8.9294 Z-12.0000 S1000
G1 F1000 X30.4099 Y9.0109 Z-12.0000 S1000
; Starting inflateGrp: Closed?:true
G1 F300 Z-13.5000
G1 F1000 X30.7570 Y9.2429 Z-13.5000 S1000
G1 F1000 X30.9891 Y9.5902 Z-13.5000 S1000
G1 F1000 X31.0706 Y10.0000 Z-13.5000 S1000
G1 F1000 X30.9891 Y10.4099 Z-13.5000 S1000
G1 F1000 X30.7571 Y10.7571 Z-13.5000 S1000
G1 F1000 X30.4099 Y10.9891 Z-13.5000 S1000
G1 F1000 X30.0000 Y11.0706 Z-13.5000 S1000
G1 F1000 X29.5902 Y10.9891 Z-13.5000 S1000
G1 F1000 X29.2429 Y10.7570 Z-13.5000 S1000
G1 F1000 X29.0109 Y10.4099 Z-13.5000 S1000
G1 F1000 X28.9294 Y10.0000 Z-13.5000 S1000
G1 F1000 X29.0109 Y9.5902 Z-13.5000 S1000
G1 F1000 X29.2430 Y9.2430 Z-13.5000 S1000
G1 F1000 X29.5902 Y9.0109 Z-13.5000 S1000
G1 F1000 X30.0000 Y8.9294 Z-13.5000 S1000
G1 F1000 X30.4099 Y9.0109 Z-13.5000 S1000
; Starting inflateGrp: Closed?:true
G1 F300 Z-15.0000
G1 F1000 X30.7570 Y9.2429 Z-15.0000 S1000
G1 F1000 X30.9891 Y9.5902 Z-15.0000 S1000
G1 F1000 X31.0706 Y10.0000 Z-15.0000 S1000
G1 F1000 X30.9891 Y10.4099 Z-15.0000 S1000
G1 F1000 X30.7571 Y10.7571 Z-15.0000 S1000
G1 F1000 X30.4099 Y10.9891 Z-15.0000 S1000
G1 F1000 X30.0000 Y11.0706 Z-15.0000 S1000
G1 F1000 X29.5902 Y10.9891 Z-15.0000 S1000
G1 F1000 X29.2429 Y10.7570 Z-15.0000 S1000
G1 F1000 X29.0109 Y10.4099 Z-15.0000 S1000
G1 F1000 X28.9294 Y10.0000 Z-15.0000 S1000
G1 F1000 X29.0109 Y9.5902 Z-15.0000 S1000
G1 F1000 X29.2430 Y9.2430 Z-15.0000 S1000
G1 F1000 X29.5902 Y9.0109 Z-15.0000 S1000
G1 F1000 X30.0000 Y8.9294 Z-15.0000 S1000
G1 F1000 X30.4099 Y9.0109 Z-15.0000 S1000
; Starting inflateGrp: Closed?:true
G1 F300 Z-16.5000
G1 F1000 X30.7570 Y9.2429 Z-16.5000 S1000
G1 F1000 X30.9891 Y9.5902 Z-16.5000 S1000
G1 F1000 X31.0706 Y10.0000 Z-16.5000 S1000
G1 F1000 X30.9891 Y10.4099 Z-16.5000 S1000
G1 F1000 X30.7571 Y10.7571 Z-16.5000 S1000
G1 F1000 X30.4099 Y10.9891 Z-16.5000 S1000
G1 F1000 X30.0000 Y11.0706 Z-16.5000 S1000
G1 F1000 X29.5902 Y10.9891 Z-16.5000 S1000
G1 F1000 X29.2429 Y10.7570 Z-16.5000 S1000
G1 F1000 X29.0109 Y10.4099 Z-16.5000 S1000
G1 F1000 X28.9294 Y10.0000 Z-16.5000 S1000
G1 F1000 X29.0109 Y9.5902 Z-16.5000 S1000
G1 F1000 X29.2430 Y9.2430 Z-16.5000 S1000
G1 F1000 X29.5902 Y9.0109 Z-16.5000 S1000
G1 F1000 X30.0000 Y8.9294 Z-16.5000 S1000
G1 F1000 X30.4099 Y9.0109 Z-16.5000 S1000
; Starting inflateGrp: Closed?:true
G1 F300 Z-18.0000
G1 F1000 X30.7570 Y9.2429 Z-18.0000 S1000
G1 F1000 X30.9891 Y9.5902 Z-18.0000 S1000
G1 F1000 X31.0706 Y10.0000 Z-18.0000 S1000
G1 F1000 X30.9891 Y10.4099 Z-18.0000 S1000
G1 F1000 X30.7571 Y10.7571 Z-18.0000 S1000
G1 F1000 X30.4099 Y10.9891 Z-18.0000 S1000
G1 F1000 X30.0000 Y11.0706 Z-18.0000 S1000
G1 F1000 X29.5902 Y10.9891 Z-18.0000 S1000
G1 F1000 X29.2429 Y10.7570 Z-18.0000 S1000
G1 F1000 X29.0109 Y10.4099 Z-18.0000 S1000
G1 F1000 X28.9294 Y10.0000 Z-18.0000 S1000
G1 F1000 X29.0109 Y9.5902 Z-18.0000 S1000
G1 F1000 X29.2430 Y9.2430 Z-18.0000 S1000
G1 F1000 X29.5902 Y9.0109 Z-18.0000 S1000
G1 F1000 X30.0000 Y8.9294 Z-18.0000 S1000
G1 F1000 X30.4099 Y9.0109 Z-18.0000 S1000
; Starting inflateGrp: Closed?:true
G1 F300 Z-19.2000
G1 F1000 X30.7570 Y9.2429 Z-19.2000 S1000
G1 F1000 X30.9891 Y9.5902 Z-19.2000 S1000
G1 F1000 X31.0706 Y10.0000 Z-19.2000 S1000
G1 F1000 X30.9891 Y10.4099 Z-19.2000 S1000
G1 F1000 X30.7571 Y10.7571 Z-19.2000 S1000
G1 F1000 X30.4099 Y10.9891 Z-19.2000 S1000
G1 F1000 X30.0000 Y11.0706 Z-19.2000 S1000
G1 F1000 X29.5902 Y10.9891 Z-19.2000 S1000
G1 F1000 X29.2429 Y10.7570 Z-19.2000 S1000
G1 F1000 X29.0109 Y10.4099 Z-19.2000 S1000
G1 F1000 X28.9294 Y10.0000 Z-19.2000 S1000
G1 F1000 X29.0109 Y9.5902 Z-19.2000 S1000
G1 F1000 X29.2430 Y9.2430 Z-19.2000 S1000
G1 F1000 X29.5902 Y9.0109 Z-19.2000 S1000
G1 F1000 X30.0000 Y8.9294 Z-19.2000 S1000
G1 F1000 X30.4099 Y9.0109 Z-19.2000 S1000
; Starting inflateGrp: Closed?:true

G0 Z10
G0 X481.4099 Y9.0110

G0 Z0
G1 F300 Z-1.5000
G1 F1000 X481.7571 Y9.2430 Z-1.5000 S1000
G1 F1000 X481.9891 Y9.5902 Z-1.5000 S1000
G1 F1000 X482.0706 Y10.0001 Z-1.5000 S1000
G1 F1000 X481.9891 Y10.4099 Z-1.5000 S1000
G1 F1000 X481.7571 Y10.7571 Z-1.5000 S1000
G1 F1000 X481.4099 Y10.9891 Z-1.5000 S1000
G1 F1000 X481.0000 Y11.0706 Z-1.5000 S1000
G1 F1000 X480.5902 Y10.9891 Z-1.5000 S1000
G1 F1000 X480.2429 Y10.7570 Z-1.5000 S1000
G1 F1000 X480.0109 Y10.4099 Z-1.5000 S1000
G1 F1000 X479.9294 Y10.0001 Z-1.5000 S1000
G1 F1000 X480.0109 Y9.5902 Z-1.5000 S1000
G1 F1000 X480.2429 Y9.2431 Z-1.5000 S1000
G1 F1000 X480.5902 Y9.0110 Z-1.5000 S1000
G1 F1000 X481.0000 Y8.9295 Z-1.5000 S1000
G1 F1000 X481.4099 Y9.0110 Z-1.5000 S1000
; Starting inflateGrp: Closed?:true
G1 F300 Z-3.0000
G1 F1000 X481.7571 Y9.2430 Z-3.0000 S1000
G1 F1000 X481.9891 Y9.5902 Z-3.0000 S1000
G1 F1000 X482.0706 Y10.0001 Z-3.0000 S1000
G1 F1000 X481.9891 Y10.4099 Z-3.0000 S1000
G1 F1000 X481.7571 Y10.7571 Z-3.0000 S1000
G1 F1000 X481.4099 Y10.9891 Z-3.0000 S1000
G1 F1000 X481.0000 Y11.0706 Z-3.0000 S1000
G1 F1000 X480.5902 Y10.9891 Z-3.0000 S1000
G1 F1000 X480.2429 Y10.7570 Z-3.0000 S1000
G1 F1000 X480.0109 Y10.4099 Z-3.0000 S1000
G1 F1000 X479.9294 Y10.0001 Z-3.0000 S1000
G1 F1000 X480.0109 Y9.5902 Z-3.0000 S1000
G1 F1000 X480.2429 Y9.2431 Z-3.0000 S1000
G1 F1000 X480.5902 Y9.0110 Z-3.0000 S1000
G1 F1000 X481.0000 Y8.9295 Z-3.0000 S1000
G1 F1000 X481.4099 Y9.0110 Z-3.0000 S1000
; Starting inflateGrp: Closed?:true
G1 F300 Z-4.5000
G1 F1000 X481.7571 Y9.2430 Z-4.5000 S1000
G1 F1000 X481.9891 Y9.5902 Z-4.5000 S1000
G1 F1000 X482.0706 Y10.0001 Z-4.5000 S1000
G1 F1000 X481.9891 Y10.4099 Z-4.5000 S1000
G1 F1000 X481.7571 Y10.7571 Z-4.5000 S1000
G1 F1000 X481.4099 Y10.9891 Z-4.5000 S1000
G1 F1000 X481.0000 Y11.0706 Z-4.5000 S1000
G1 F1000 X480.5902 Y10.9891 Z-4.5000 S1000
G1 F1000 X480.2429 Y10.7570 Z-4.5000 S1000
G1 F1000 X480.0109 Y10.4099 Z-4.5000 S1000
G1 F1000 X479.9294 Y10.0001 Z-4.5000 S1000
G1 F1000 X480.0109 Y9.5902 Z-4.5000 S1000
G1 F1000 X480.2429 Y9.2431 Z-4.5000 S1000
G1 F1000 X480.5902 Y9.0110 Z-4.5000 S1000
G1 F1000 X481.0000 Y8.9295 Z-4.5000 S1000
G1 F1000 X481.4099 Y9.0110 Z-4.5000 S1000
; Starting inflateGrp: Closed?:true
G1 F300 Z-6.0000
G1 F1000 X481.7571 Y9.2430 Z-6.0000 S1000
G1 F1000 X481.9891 Y9.5902 Z-6.0000 S1000
G1 F1000 X482.0706 Y10.0001 Z-6.0000 S1000
G1 F1000 X481.9891 Y10.4099 Z-6.0000 S1000
G1 F1000 X481.7571 Y10.7571 Z-6.0000 S1000
G1 F1000 X481.4099 Y10.9891 Z-6.0000 S1000
G1 F1000 X481.0000 Y11.0706 Z-6.0000 S1000
G1 F1000 X480.5902 Y10.9891 Z-6.0000 S1000
G1 F1000 X480.2429 Y10.7570 Z-6.0000 S1000
G1 F1000 X480.0109 Y10.4099 Z-6.0000 S1000
G1 F1000 X479.9294 Y10.0001 Z-6.0000 S1000
G1 F1000 X480.0109 Y9.5902 Z-6.0000 S1000
G1 F1000 X480.2429 Y9.2431 Z-6.0000 S1000
G1 F1000 X480.5902 Y9.0110 Z-6.0000 S1000
G1 F1000 X481.0000 Y8.9295 Z-6.0000 S1000
G1 F1000 X481.4099 Y9.0110 Z-6.0000 S1000
; Starting inflateGrp: Closed?:true
G1 F300 Z-7.5000
G1 F1000 X481.7571 Y9.2430 Z-7.5000 S1000
G1 F1000 X481.9891 Y9.5902 Z-7.5000 S1000
G1 F1000 X482.0706 Y10.0001 Z-7.5000 S1000
G1 F1000 X481.9891 Y10.4099 Z-7.5000 S1000
G1 F1000 X481.7571 Y10.7571 Z-7.5000 S1000
G1 F1000 X481.4099 Y10.9891 Z-7.5000 S1000
G1 F1000 X481.0000 Y11.0706 Z-7.5000 S1000
G1 F1000 X480.5902 Y10.9891 Z-7.5000 S1000
G1 F1000 X480.2429 Y10.7570 Z-7.5000 S1000
G1 F1000 X480.0109 Y10.4099 Z-7.5000 S1000
G1 F1000 X479.9294 Y10.0001 Z-7.5000 S1000
G1 F1000 X480.0109 Y9.5902 Z-7.5000 S1000
G1 F1000 X480.2429 Y9.2431 Z-7.5000 S1000
G1 F1000 X480.5902 Y9.0110 Z-7.5000 S1000
G1 F1000 X481.0000 Y8.9295 Z-7.5000 S1000
G1 F1000 X481.4099 Y9.0110 Z-7.5000 S1000
; Starting inflateGrp: Closed?:true
G1 F300 Z-9.0000
G1 F1000 X481.7571 Y9.2430 Z-9.0000 S1000
G1 F1000 X481.9891 Y9.5902 Z-9.0000 S1000
G1 F1000 X482.0706 Y10.0001 Z-9.0000 S1000
G1 F1000 X481.9891 Y10.4099 Z-9.0000 S1000
G1 F1000 X481.7571 Y10.7571 Z-9.0000 S1000
G1 F1000 X481.4099 Y10.9891 Z-9.0000 S1000
G1 F1000 X481.0000 Y11.0706 Z-9.0000 S1000
G1 F1000 X480.5902 Y10.9891 Z-9.0000 S1000
G1 F1000 X480.2429 Y10.7570 Z-9.0000 S1000
G1 F1000 X480.0109 Y10.4099 Z-9.0000 S1000
G1 F1000 X479.9294 Y10.0001 Z-9.0000 S1000
G1 F1000 X480.0109 Y9.5902 Z-9.0000 S1000
G1 F1000 X480.2429 Y9.2431 Z-9.0000 S1000
G1 F1000 X480.5902 Y9.0110 Z-9.0000 S1000
G1 F1000 X481.0000 Y8.9295 Z-9.0000 S1000
G1 F1000 X481.4099 Y9.0110 Z-9.0000 S1000
; Starting inflateGrp: Closed?:true
G1 F300 Z-10.5000
G1 F1000 X481.7571 Y9.2430 Z-10.5000 S1000
G1 F1000 X481.9891 Y9.5902 Z-10.5000 S1000
G1 F1000 X482.0706 Y10.0001 Z-10.5000 S1000
G1 F1000 X481.9891 Y10.4099 Z-10.5000 S1000
G1 F1000 X481.7571 Y10.7571 Z-10.5000 S1000
G1 F1000 X481.4099 Y10.9891 Z-10.5000 S1000
G1 F1000 X481.0000 Y11.0706 Z-10.5000 S1000
G1 F1000 X480.5902 Y10.9891 Z-10.5000 S1000
G1 F1000 X480.2429 Y10.7570 Z-10.5000 S1000
G1 F1000 X480.0109 Y10.4099 Z-10.5000 S1000
G1 F1000 X479.9294 Y10.0001 Z-10.5000 S1000
G1 F1000 X480.0109 Y9.5902 Z-10.5000 S1000
G1 F1000 X480.2429 Y9.2431 Z-10.5000 S1000
G1 F1000 X480.5902 Y9.0110 Z-10.5000 S1000
G1 F1000 X481.0000 Y8.9295 Z-10.5000 S1000
G1 F1000 X481.4099 Y9.0110 Z-10.5000 S1000
; Starting inflateGrp: Closed?:true
G1 F300 Z-12.0000
G1 F1000 X481.7571 Y9.2430 Z-12.0000 S1000
G1 F1000 X481.9891 Y9.5902 Z-12.0000 S1000
G1 F1000 X482.0706 Y10.0001 Z-12.0000 S1000
G1 F1000 X481.9891 Y10.4099 Z-12.0000 S1000
G1 F1000 X481.7571 Y10.7571 Z-12.0000 S1000
G1 F1000 X481.4099 Y10.9891 Z-12.0000 S1000
G1 F1000 X481.0000 Y11.0706 Z-12.0000 S1000
G1 F1000 X480.5902 Y10.9891 Z-12.0000 S1000
G1 F1000 X480.2429 Y10.7570 Z-12.0000 S1000
G1 F1000 X480.0109 Y10.4099 Z-12.0000 S1000
G1 F1000 X479.9294 Y10.0001 Z-12.0000 S1000
G1 F1000 X480.0109 Y9.5902 Z-12.0000 S1000
G1 F1000 X480.2429 Y9.2431 Z-12.0000 S1000
G1 F1000 X480.5902 Y9.0110 Z-12.0000 S1000
G1 F1000 X481.0000 Y8.9295 Z-12.0000 S1000
G1 F1000 X481.4099 Y9.0110 Z-12.0000 S1000
; Starting inflateGrp: Closed?:true
G1 F300 Z-13.5000
G1 F1000 X481.7571 Y9.2430 Z-13.5000 S1000
G1 F1000 X481.9891 Y9.5902 Z-13.5000 S1000
G1 F1000 X482.0706 Y10.0001 Z-13.5000 S1000
G1 F1000 X481.9891 Y10.4099 Z-13.5000 S1000
G1 F1000 X481.7571 Y10.7571 Z-13.5000 S1000
G1 F1000 X481.4099 Y10.9891 Z-13.5000 S1000
G1 F1000 X481.0000 Y11.0706 Z-13.5000 S1000
G1 F1000 X480.5902 Y10.9891 Z-13.5000 S1000
G1 F1000 X480.2429 Y10.7570 Z-13.5000 S1000
G1 F1000 X480.0109 Y10.4099 Z-13.5000 S1000
G1 F1000 X479.9294 Y10.0001 Z-13.5000 S1000
G1 F1000 X480.0109 Y9.5902 Z-13.5000 S1000
G1 F1000 X480.2429 Y9.2431 Z-13.5000 S1000
G1 F1000 X480.5902 Y9.0110 Z-13.5000 S1000
G1 F1000 X481.0000 Y8.9295 Z-13.5000 S1000
G1 F1000 X481.4099 Y9.0110 Z-13.5000 S1000
; Starting inflateGrp: Closed?:true
G1 F300 Z-15.0000
G1 F1000 X481.7571 Y9.2430 Z-15.0000 S1000
G1 F1000 X481.9891 Y9.5902 Z-15.0000 S1000
G1 F1000 X482.0706 Y10.0001 Z-15.0000 S1000
G1 F1000 X481.9891 Y10.4099 Z-15.0000 S1000
G1 F1000 X481.7571 Y10.7571 Z-15.0000 S1000
G1 F1000 X481.4099 Y10.9891 Z-15.0000 S1000
G1 F1000 X481.0000 Y11.0706 Z-15.0000 S1000
G1 F1000 X480.5902 Y10.9891 Z-15.0000 S1000
G1 F1000 X480.2429 Y10.7570 Z-15.0000 S1000
G1 F1000 X480.0109 Y10.4099 Z-15.0000 S1000
G1 F1000 X479.9294 Y10.0001 Z-15.0000 S1000
G1 F1000 X480.0109 Y9.5902 Z-15.0000 S1000
G1 F1000 X480.2429 Y9.2431 Z-15.0000 S1000
G1 F1000 X480.5902 Y9.0110 Z-15.0000 S1000
G1 F1000 X481.0000 Y8.9295 Z-15.0000 S1000
G1 F1000 X481.4099 Y9.0110 Z-15.0000 S1000
; Starting inflateGrp: Closed?:true
G1 F300 Z-16.5000
G1 F1000 X481.7571 Y9.2430 Z-16.5000 S1000
G1 F1000 X481.9891 Y9.5902 Z-16.5000 S1000
G1 F1000 X482.0706 Y10.0001 Z-16.5000 S1000
G1 F1000 X481.9891 Y10.4099 Z-16.5000 S1000
G1 F1000 X481.7571 Y10.7571 Z-16.5000 S1000
G1 F1000 X481.4099 Y10.9891 Z-16.5000 S1000
G1 F1000 X481.0000 Y11.0706 Z-16.5000 S1000
G1 F1000 X480.5902 Y10.9891 Z-16.5000 S1000
G1 F1000 X480.2429 Y10.7570 Z-16.5000 S1000
G1 F1000 X480.0109 Y10.4099 Z-16.5000 S1000
G1 F1000 X479.9294 Y10.0001 Z-16.5000 S1000
G1 F1000 X480.0109 Y9.5902 Z-16.5000 S1000
G1 F1000 X480.2429 Y9.2431 Z-16.5000 S1000
G1 F1000 X480.5902 Y9.0110 Z-16.5000 S1000
G1 F1000 X481.0000 Y8.9295 Z-16.5000 S1000
G1 F1000 X481.4099 Y9.0110 Z-16.5000 S1000
; Starting inflateGrp: Closed?:true
G1 F300 Z-18.0000
G1 F1000 X481.7571 Y9.2430 Z-18.0000 S1000
G1 F1000 X481.9891 Y9.5902 Z-18.0000 S1000
G1 F1000 X482.0706 Y10.0001 Z-18.0000 S1000
G1 F1000 X481.9891 Y10.4099 Z-18.0000 S1000
G1 F1000 X481.7571 Y10.7571 Z-18.0000 S1000
G1 F1000 X481.4099 Y10.9891 Z-18.0000 S1000
G1 F1000 X481.0000 Y11.0706 Z-18.0000 S1000
G1 F1000 X480.5902 Y10.9891 Z-18.0000 S1000
G1 F1000 X480.2429 Y10.7570 Z-18.0000 S1000
G1 F1000 X480.0109 Y10.4099 Z-18.0000 S1000
G1 F1000 X479.9294 Y10.0001 Z-18.0000 S1000
G1 F1000 X480.0109 Y9.5902 Z-18.0000 S1000
G1 F1000 X480.2429 Y9.2431 Z-18.0000 S1000
G1 F1000 X480.5902 Y9.0110 Z-18.0000 S1000
G1 F1000 X481.0000 Y8.9295 Z-18.0000 S1000
G1 F1000 X481.4099 Y9.0110 Z-18.0000 S1000
; Starting inflateGrp: Closed?:true
G1 F300 Z-19.2000
G1 F1000 X481.7571 Y9.2430 Z-19.2000 S1000
G1 F1000 X481.9891 Y9.5902 Z-19.2000 S1000
G1 F1000 X482.0706 Y10.0001 Z-19.2000 S1000
G1 F1000 X481.9891 Y10.4099 Z-19.2000 S1000
G1 F1000 X481.7571 Y10.7571 Z-19.2000 S1000
G1 F1000 X481.4099 Y10.9891 Z-19.2000 S1000
G1 F1000 X481.0000 Y11.0706 Z-19.2000 S1000
G1 F1000 X480.5902 Y10.9891 Z-19.2000 S1000
G1 F1000 X480.2429 Y10.7570 Z-19.2000 S1000
G1 F1000 X480.0109 Y10.4099 Z-19.2000 S1000
G1 F1000 X479.9294 Y10.0001 Z-19.2000 S1000
G1 F1000 X480.0109 Y9.5902 Z-19.2000 S1000
G1 F1000 X480.2429 Y9.2431 Z-19.2000 S1000
G1 F1000 X480.5902 Y9.0110 Z-19.2000 S1000
G1 F1000 X481.0000 Y8.9295 Z-19.2000 S1000
G1 F1000 X481.4099 Y9.0110 Z-19.2000 S1000
; Starting inflateGrp: Closed?:true

G0 Z10
G0 X501.4099 Y9.0110

G0 Z0
G1 F300 Z-1.5000
G1 F1000 X501.7571 Y9.2430 Z-1.5000 S1000
G1 F1000 X501.9891 Y9.5902 Z-1.5000 S1000
G1 F1000 X502.0706 Y10.0001 Z-1.5000 S1000
G1 F1000 X501.9891 Y10.4099 Z-1.5000 S1000
G1 F1000 X501.7571 Y10.7571 Z-1.5000 S1000
G1 F1000 X501.4099 Y10.9891 Z-1.5000 S1000
G1 F1000 X501.0000 Y11.0706 Z-1.5000 S1000
G1 F1000 X500.5902 Y10.9891 Z-1.5000 S1000
G1 F1000 X500.2429 Y10.7570 Z-1.5000 S1000
G1 F1000 X500.0109 Y10.4099 Z-1.5000 S1000
G1 F1000 X499.9294 Y10.0001 Z-1.5000 S1000
G1 F1000 X500.0109 Y9.5902 Z-1.5000 S1000
G1 F1000 X500.2429 Y9.2431 Z-1.5000 S1000
G1 F1000 X500.5902 Y9.0110 Z-1.5000 S1000
G1 F1000 X501.0000 Y8.9295 Z-1.5000 S1000
G1 F1000 X501.4099 Y9.0110 Z-1.5000 S1000
; Starting inflateGrp: Closed?:true
G1 F300 Z-3.0000
G1 F1000 X501.7571 Y9.2430 Z-3.0000 S1000
G1 F1000 X501.9891 Y9.5902 Z-3.0000 S1000
G1 F1000 X502.0706 Y10.0001 Z-3.0000 S1000
G1 F1000 X501.9891 Y10.4099 Z-3.0000 S1000
G1 F1000 X501.7571 Y10.7571 Z-3.0000 S1000
G1 F1000 X501.4099 Y10.9891 Z-3.0000 S1000
G1 F1000 X501.0000 Y11.0706 Z-3.0000 S1000
G1 F1000 X500.5902 Y10.9891 Z-3.0000 S1000
G1 F1000 X500.2429 Y10.7570 Z-3.0000 S1000
G1 F1000 X500.0109 Y10.4099 Z-3.0000 S1000
G1 F1000 X499.9294 Y10.0001 Z-3.0000 S1000
G1 F1000 X500.0109 Y9.5902 Z-3.0000 S1000
G1 F1000 X500.2429 Y9.2431 Z-3.0000 S1000
G1 F1000 X500.5902 Y9.0110 Z-3.0000 S1000
G1 F1000 X501.0000 Y8.9295 Z-3.0000 S1000
G1 F1000 X501.4099 Y9.0110 Z-3.0000 S1000
; Starting inflateGrp: Closed?:true
G1 F300 Z-4.5000
G1 F1000 X501.7571 Y9.2430 Z-4.5000 S1000
G1 F1000 X501.9891 Y9.5902 Z-4.5000 S1000
G1 F1000 X502.0706 Y10.0001 Z-4.5000 S1000
G1 F1000 X501.9891 Y10.4099 Z-4.5000 S1000
G1 F1000 X501.7571 Y10.7571 Z-4.5000 S1000
G1 F1000 X501.4099 Y10.9891 Z-4.5000 S1000
G1 F1000 X501.0000 Y11.0706 Z-4.5000 S1000
G1 F1000 X500.5902 Y10.9891 Z-4.5000 S1000
G1 F1000 X500.2429 Y10.7570 Z-4.5000 S1000
G1 F1000 X500.0109 Y10.4099 Z-4.5000 S1000
G1 F1000 X499.9294 Y10.0001 Z-4.5000 S1000
G1 F1000 X500.0109 Y9.5902 Z-4.5000 S1000
G1 F1000 X500.2429 Y9.2431 Z-4.5000 S1000
G1 F1000 X500.5902 Y9.0110 Z-4.5000 S1000
G1 F1000 X501.0000 Y8.9295 Z-4.5000 S1000
G1 F1000 X501.4099 Y9.0110 Z-4.5000 S1000
; Starting inflateGrp: Closed?:true
G1 F300 Z-6.0000
G1 F1000 X501.7571 Y9.2430 Z-6.0000 S1000
G1 F1000 X501.9891 Y9.5902 Z-6.0000 S1000
G1 F1000 X502.0706 Y10.0001 Z-6.0000 S1000
G1 F1000 X501.9891 Y10.4099 Z-6.0000 S1000
G1 F1000 X501.7571 Y10.7571 Z-6.0000 S1000
G1 F1000 X501.4099 Y10.9891 Z-6.0000 S1000
G1 F1000 X501.0000 Y11.0706 Z-6.0000 S1000
G1 F1000 X500.5902 Y10.9891 Z-6.0000 S1000
G1 F1000 X500.2429 Y10.7570 Z-6.0000 S1000
G1 F1000 X500.0109 Y10.4099 Z-6.0000 S1000
G1 F1000 X499.9294 Y10.0001 Z-6.0000 S1000
G1 F1000 X500.0109 Y9.5902 Z-6.0000 S1000
G1 F1000 X500.2429 Y9.2431 Z-6.0000 S1000
G1 F1000 X500.5902 Y9.0110 Z-6.0000 S1000
G1 F1000 X501.0000 Y8.9295 Z-6.0000 S1000
G1 F1000 X501.4099 Y9.0110 Z-6.0000 S1000
; Starting inflateGrp: Closed?:true
G1 F300 Z-7.5000
G1 F1000 X501.7571 Y9.2430 Z-7.5000 S1000
G1 F1000 X501.9891 Y9.5902 Z-7.5000 S1000
G1 F1000 X502.0706 Y10.0001 Z-7.5000 S1000
G1 F1000 X501.9891 Y10.4099 Z-7.5000 S1000
G1 F1000 X501.7571 Y10.7571 Z-7.5000 S1000
G1 F1000 X501.4099 Y10.9891 Z-7.5000 S1000
G1 F1000 X501.0000 Y11.0706 Z-7.5000 S1000
G1 F1000 X500.5902 Y10.9891 Z-7.5000 S1000
G1 F1000 X500.2429 Y10.7570 Z-7.5000 S1000
G1 F1000 X500.0109 Y10.4099 Z-7.5000 S1000
G1 F1000 X499.9294 Y10.0001 Z-7.5000 S1000
G1 F1000 X500.0109 Y9.5902 Z-7.5000 S1000
G1 F1000 X500.2429 Y9.2431 Z-7.5000 S1000
G1 F1000 X500.5902 Y9.0110 Z-7.5000 S1000
G1 F1000 X501.0000 Y8.9295 Z-7.5000 S1000
G1 F1000 X501.4099 Y9.0110 Z-7.5000 S1000
; Starting inflateGrp: Closed?:true
G1 F300 Z-9.0000
G1 F1000 X501.7571 Y9.2430 Z-9.0000 S1000
G1 F1000 X501.9891 Y9.5902 Z-9.0000 S1000
G1 F1000 X502.0706 Y10.0001 Z-9.0000 S1000
G1 F1000 X501.9891 Y10.4099 Z-9.0000 S1000
G1 F1000 X501.7571 Y10.7571 Z-9.0000 S1000
G1 F1000 X501.4099 Y10.9891 Z-9.0000 S1000
G1 F1000 X501.0000 Y11.0706 Z-9.0000 S1000
G1 F1000 X500.5902 Y10.9891 Z-9.0000 S1000
G1 F1000 X500.2429 Y10.7570 Z-9.0000 S1000
G1 F1000 X500.0109 Y10.4099 Z-9.0000 S1000
G1 F1000 X499.9294 Y10.0001 Z-9.0000 S1000
G1 F1000 X500.0109 Y9.5902 Z-9.0000 S1000
G1 F1000 X500.2429 Y9.2431 Z-9.0000 S1000
G1 F1000 X500.5902 Y9.0110 Z-9.0000 S1000
G1 F1000 X501.0000 Y8.9295 Z-9.0000 S1000
G1 F1000 X501.4099 Y9.0110 Z-9.0000 S1000
; Starting inflateGrp: Closed?:true
G1 F300 Z-10.5000
G1 F1000 X501.7571 Y9.2430 Z-10.5000 S1000
G1 F1000 X501.9891 Y9.5902 Z-10.5000 S1000
G1 F1000 X502.0706 Y10.0001 Z-10.5000 S1000
G1 F1000 X501.9891 Y10.4099 Z-10.5000 S1000
G1 F1000 X501.7571 Y10.7571 Z-10.5000 S1000
G1 F1000 X501.4099 Y10.9891 Z-10.5000 S1000
G1 F1000 X501.0000 Y11.0706 Z-10.5000 S1000
G1 F1000 X500.5902 Y10.9891 Z-10.5000 S1000
G1 F1000 X500.2429 Y10.7570 Z-10.5000 S1000
G1 F1000 X500.0109 Y10.4099 Z-10.5000 S1000
G1 F1000 X499.9294 Y10.0001 Z-10.5000 S1000
G1 F1000 X500.0109 Y9.5902 Z-10.5000 S1000
G1 F1000 X500.2429 Y9.2431 Z-10.5000 S1000
G1 F1000 X500.5902 Y9.0110 Z-10.5000 S1000
G1 F1000 X501.0000 Y8.9295 Z-10.5000 S1000
G1 F1000 X501.4099 Y9.0110 Z-10.5000 S1000
; Starting inflateGrp: Closed?:true
G1 F300 Z-12.0000
G1 F1000 X501.7571 Y9.2430 Z-12.0000 S1000
G1 F1000 X501.9891 Y9.5902 Z-12.0000 S1000
G1 F1000 X502.0706 Y10.0001 Z-12.0000 S1000
G1 F1000 X501.9891 Y10.4099 Z-12.0000 S1000
G1 F1000 X501.7571 Y10.7571 Z-12.0000 S1000
G1 F1000 X501.4099 Y10.9891 Z-12.0000 S1000
G1 F1000 X501.0000 Y11.0706 Z-12.0000 S1000
G1 F1000 X500.5902 Y10.9891 Z-12.0000 S1000
G1 F1000 X500.2429 Y10.7570 Z-12.0000 S1000
G1 F1000 X500.0109 Y10.4099 Z-12.0000 S1000
G1 F1000 X499.9294 Y10.0001 Z-12.0000 S1000
G1 F1000 X500.0109 Y9.5902 Z-12.0000 S1000
G1 F1000 X500.2429 Y9.2431 Z-12.0000 S1000
G1 F1000 X500.5902 Y9.0110 Z-12.0000 S1000
G1 F1000 X501.0000 Y8.9295 Z-12.0000 S1000
G1 F1000 X501.4099 Y9.0110 Z-12.0000 S1000
; Starting inflateGrp: Closed?:true
G1 F300 Z-13.5000
G1 F1000 X501.7571 Y9.2430 Z-13.5000 S1000
G1 F1000 X501.9891 Y9.5902 Z-13.5000 S1000
G1 F1000 X502.0706 Y10.0001 Z-13.5000 S1000
G1 F1000 X501.9891 Y10.4099 Z-13.5000 S1000
G1 F1000 X501.7571 Y10.7571 Z-13.5000 S1000
G1 F1000 X501.4099 Y10.9891 Z-13.5000 S1000
G1 F1000 X501.0000 Y11.0706 Z-13.5000 S1000
G1 F1000 X500.5902 Y10.9891 Z-13.5000 S1000
G1 F1000 X500.2429 Y10.7570 Z-13.5000 S1000
G1 F1000 X500.0109 Y10.4099 Z-13.5000 S1000
G1 F1000 X499.9294 Y10.0001 Z-13.5000 S1000
G1 F1000 X500.0109 Y9.5902 Z-13.5000 S1000
G1 F1000 X500.2429 Y9.2431 Z-13.5000 S1000
G1 F1000 X500.5902 Y9.0110 Z-13.5000 S1000
G1 F1000 X501.0000 Y8.9295 Z-13.5000 S1000
G1 F1000 X501.4099 Y9.0110 Z-13.5000 S1000
; Starting inflateGrp: Closed?:true
G1 F300 Z-15.0000
G1 F1000 X501.7571 Y9.2430 Z-15.0000 S1000
G1 F1000 X501.9891 Y9.5902 Z-15.0000 S1000
G1 F1000 X502.0706 Y10.0001 Z-15.0000 S1000
G1 F1000 X501.9891 Y10.4099 Z-15.0000 S1000
G1 F1000 X501.7571 Y10.7571 Z-15.0000 S1000
G1 F1000 X501.4099 Y10.9891 Z-15.0000 S1000
G1 F1000 X501.0000 Y11.0706 Z-15.0000 S1000
G1 F1000 X500.5902 Y10.9891 Z-15.0000 S1000
G1 F1000 X500.2429 Y10.7570 Z-15.0000 S1000
G1 F1000 X500.0109 Y10.4099 Z-15.0000 S1000
G1 F1000 X499.9294 Y10.0001 Z-15.0000 S1000
G1 F1000 X500.0109 Y9.5902 Z-15.0000 S1000
G1 F1000 X500.2429 Y9.2431 Z-15.0000 S1000
G1 F1000 X500.5902 Y9.0110 Z-15.0000 S1000
G1 F1000 X501.0000 Y8.9295 Z-15.0000 S1000
G1 F1000 X501.4099 Y9.0110 Z-15.0000 S1000
; Starting inflateGrp: Closed?:true
G1 F300 Z-16.5000
G1 F1000 X501.7571 Y9.2430 Z-16.5000 S1000
G1 F1000 X501.9891 Y9.5902 Z-16.5000 S1000
G1 F1000 X502.0706 Y10.0001 Z-16.5000 S1000
G1 F1000 X501.9891 Y10.4099 Z-16.5000 S1000
G1 F1000 X501.7571 Y10.7571 Z-16.5000 S1000
G1 F1000 X501.4099 Y10.9891 Z-16.5000 S1000
G1 F1000 X501.0000 Y11.0706 Z-16.5000 S1000
G1 F1000 X500.5902 Y10.9891 Z-16.5000 S1000
G1 F1000 X500.2429 Y10.7570 Z-16.5000 S1000
G1 F1000 X500.0109 Y10.4099 Z-16.5000 S1000
G1 F1000 X499.9294 Y10.0001 Z-16.5000 S1000
G1 F1000 X500.0109 Y9.5902 Z-16.5000 S1000
G1 F1000 X500.2429 Y9.2431 Z-16.5000 S1000
G1 F1000 X500.5902 Y9.0110 Z-16.5000 S1000
G1 F1000 X501.0000 Y8.9295 Z-16.5000 S1000
G1 F1000 X501.4099 Y9.0110 Z-16.5000 S1000
; Starting inflateGrp: Closed?:true
G1 F300 Z-18.0000
G1 F1000 X501.7571 Y9.2430 Z-18.0000 S1000
G1 F1000 X501.9891 Y9.5902 Z-18.0000 S1000
G1 F1000 X502.0706 Y10.0001 Z-18.0000 S1000
G1 F1000 X501.9891 Y10.4099 Z-18.0000 S1000
G1 F1000 X501.7571 Y10.7571 Z-18.0000 S1000
G1 F1000 X501.4099 Y10.9891 Z-18.0000 S1000
G1 F1000 X501.0000 Y11.0706 Z-18.0000 S1000
G1 F1000 X500.5902 Y10.9891 Z-18.0000 S1000
G1 F1000 X500.2429 Y10.7570 Z-18.0000 S1000
G1 F1000 X500.0109 Y10.4099 Z-18.0000 S1000
G1 F1000 X499.9294 Y10.0001 Z-18.0000 S1000
G1 F1000 X500.0109 Y9.5902 Z-18.0000 S1000
G1 F1000 X500.2429 Y9.2431 Z-18.0000 S1000
G1 F1000 X500.5902 Y9.0110 Z-18.0000 S1000
G1 F1000 X501.0000 Y8.9295 Z-18.0000 S1000
G1 F1000 X501.4099 Y9.0110 Z-18.0000 S1000
; Starting inflateGrp: Closed?:true
G1 F300 Z-19.2000
G1 F1000 X501.7571 Y9.2430 Z-19.2000 S1000
G1 F1000 X501.9891 Y9.5902 Z-19.2000 S1000
G1 F1000 X502.0706 Y10.0001 Z-19.2000 S1000
G1 F1000 X501.9891 Y10.4099 Z-19.2000 S1000
G1 F1000 X501.7571 Y10.7571 Z-19.2000 S1000
G1 F1000 X501.4099 Y10.9891 Z-19.2000 S1000
G1 F1000 X501.0000 Y11.0706 Z-19.2000 S1000
G1 F1000 X500.5902 Y10.9891 Z-19.2000 S1000
G1 F1000 X500.2429 Y10.7570 Z-19.2000 S1000
G1 F1000 X500.0109 Y10.4099 Z-19.2000 S1000
G1 F1000 X499.9294 Y10.0001 Z-19.2000 S1000
G1 F1000 X500.0109 Y9.5902 Z-19.2000 S1000
G1 F1000 X500.2429 Y9.2431 Z-19.2000 S1000
G1 F1000 X500.5902 Y9.0110 Z-19.2000 S1000
G1 F1000 X501.0000 Y8.9295 Z-19.2000 S1000
G1 F1000 X501.4099 Y9.0110 Z-19.2000 S1000
; retracting back to z-safe
G0 Z10

M5 S0; Spindle Off
