; GCODE Generated by cam.openbuilds.com on 2020-09-04 
G21 ; mm-mode
G54; Work Coordinates
G21; mm-mode
G90; Absolute Positioning
M3 S1000; Spindle On

; Operation 0: CNC: Vector (path inside)
; Tool Diameter: 6
; Starting inflateGrp: Closed?:true

G0 Z10
G0 F1000 X138.8195 Y43.6905

G0 Z0
G1 F300 Z-3.0000
G1 F1000 X138.8368 Y43.6993 Z-3.0000 S1000
G1 F1000 X138.8507 Y43.7132 Z-3.0000 S1000
G1 F1000 X138.8595 Y43.7305 Z-3.0000 S1000
G1 F1000 X138.8626 Y43.7500 Z-3.0000 S1000
G1 F1000 X138.8595 Y43.7695 Z-3.0000 S1000
G1 F1000 X138.8507 Y43.7868 Z-3.0000 S1000
G1 F1000 X138.8368 Y43.8007 Z-3.0000 S1000
G1 F1000 X138.8195 Y43.8095 Z-3.0000 S1000
G1 F1000 X138.8000 Y43.8126 Z-3.0000 S1000
G1 F1000 X138.7805 Y43.8095 Z-3.0000 S1000
G1 F1000 X138.7632 Y43.8007 Z-3.0000 S1000
G1 F1000 X138.7493 Y43.7868 Z-3.0000 S1000
G1 F1000 X138.7405 Y43.7695 Z-3.0000 S1000
G1 F1000 X138.7374 Y43.7500 Z-3.0000 S1000
G1 F1000 X138.7405 Y43.7305 Z-3.0000 S1000
G1 F1000 X138.7493 Y43.7132 Z-3.0000 S1000
G1 F1000 X138.7632 Y43.6993 Z-3.0000 S1000
G1 F1000 X138.7805 Y43.6905 Z-3.0000 S1000
G1 F1000 X138.8000 Y43.6874 Z-3.0000 S1000
G1 F1000 X138.8195 Y43.6905 Z-3.0000 S1000
; Starting inflateGrp: Closed?:true
G1 F300 Z-6.0000
G1 F1000 X138.8368 Y43.6993 Z-6.0000 S1000
G1 F1000 X138.8507 Y43.7132 Z-6.0000 S1000
G1 F1000 X138.8595 Y43.7305 Z-6.0000 S1000
G1 F1000 X138.8626 Y43.7500 Z-6.0000 S1000
G1 F1000 X138.8595 Y43.7695 Z-6.0000 S1000
G1 F1000 X138.8507 Y43.7868 Z-6.0000 S1000
G1 F1000 X138.8368 Y43.8007 Z-6.0000 S1000
G1 F1000 X138.8195 Y43.8095 Z-6.0000 S1000
G1 F1000 X138.8000 Y43.8126 Z-6.0000 S1000
G1 F1000 X138.7805 Y43.8095 Z-6.0000 S1000
G1 F1000 X138.7632 Y43.8007 Z-6.0000 S1000
G1 F1000 X138.7493 Y43.7868 Z-6.0000 S1000
G1 F1000 X138.7405 Y43.7695 Z-6.0000 S1000
G1 F1000 X138.7374 Y43.7500 Z-6.0000 S1000
G1 F1000 X138.7405 Y43.7305 Z-6.0000 S1000
G1 F1000 X138.7493 Y43.7132 Z-6.0000 S1000
G1 F1000 X138.7632 Y43.6993 Z-6.0000 S1000
G1 F1000 X138.7805 Y43.6905 Z-6.0000 S1000
G1 F1000 X138.8000 Y43.6874 Z-6.0000 S1000
G1 F1000 X138.8195 Y43.6905 Z-6.0000 S1000
; Starting inflateGrp: Closed?:true
G1 F300 Z-9.0000
G1 F1000 X138.8368 Y43.6993 Z-9.0000 S1000
G1 F1000 X138.8507 Y43.7132 Z-9.0000 S1000
G1 F1000 X138.8595 Y43.7305 Z-9.0000 S1000
G1 F1000 X138.8626 Y43.7500 Z-9.0000 S1000
G1 F1000 X138.8595 Y43.7695 Z-9.0000 S1000
G1 F1000 X138.8507 Y43.7868 Z-9.0000 S1000
G1 F1000 X138.8368 Y43.8007 Z-9.0000 S1000
G1 F1000 X138.8195 Y43.8095 Z-9.0000 S1000
G1 F1000 X138.8000 Y43.8126 Z-9.0000 S1000
G1 F1000 X138.7805 Y43.8095 Z-9.0000 S1000
G1 F1000 X138.7632 Y43.8007 Z-9.0000 S1000
G1 F1000 X138.7493 Y43.7868 Z-9.0000 S1000
G1 F1000 X138.7405 Y43.7695 Z-9.0000 S1000
G1 F1000 X138.7374 Y43.7500 Z-9.0000 S1000
G1 F1000 X138.7405 Y43.7305 Z-9.0000 S1000
G1 F1000 X138.7493 Y43.7132 Z-9.0000 S1000
G1 F1000 X138.7632 Y43.6993 Z-9.0000 S1000
G1 F1000 X138.7805 Y43.6905 Z-9.0000 S1000
G1 F1000 X138.8000 Y43.6874 Z-9.0000 S1000
G1 F1000 X138.8195 Y43.6905 Z-9.0000 S1000
; Starting inflateGrp: Closed?:true
G1 F300 Z-12.0000
G1 F1000 X138.8368 Y43.6993 Z-12.0000 S1000
G1 F1000 X138.8507 Y43.7132 Z-12.0000 S1000
G1 F1000 X138.8595 Y43.7305 Z-12.0000 S1000
G1 F1000 X138.8626 Y43.7500 Z-12.0000 S1000
G1 F1000 X138.8595 Y43.7695 Z-12.0000 S1000
G1 F1000 X138.8507 Y43.7868 Z-12.0000 S1000
G1 F1000 X138.8368 Y43.8007 Z-12.0000 S1000
G1 F1000 X138.8195 Y43.8095 Z-12.0000 S1000
G1 F1000 X138.8000 Y43.8126 Z-12.0000 S1000
G1 F1000 X138.7805 Y43.8095 Z-12.0000 S1000
G1 F1000 X138.7632 Y43.8007 Z-12.0000 S1000
G1 F1000 X138.7493 Y43.7868 Z-12.0000 S1000
G1 F1000 X138.7405 Y43.7695 Z-12.0000 S1000
G1 F1000 X138.7374 Y43.7500 Z-12.0000 S1000
G1 F1000 X138.7405 Y43.7305 Z-12.0000 S1000
G1 F1000 X138.7493 Y43.7132 Z-12.0000 S1000
G1 F1000 X138.7632 Y43.6993 Z-12.0000 S1000
G1 F1000 X138.7805 Y43.6905 Z-12.0000 S1000
G1 F1000 X138.8000 Y43.6874 Z-12.0000 S1000
G1 F1000 X138.8195 Y43.6905 Z-12.0000 S1000
; Starting inflateGrp: Closed?:true
G1 F300 Z-15.0000
G1 F1000 X138.8368 Y43.6993 Z-15.0000 S1000
G1 F1000 X138.8507 Y43.7132 Z-15.0000 S1000
G1 F1000 X138.8595 Y43.7305 Z-15.0000 S1000
G1 F1000 X138.8626 Y43.7500 Z-15.0000 S1000
G1 F1000 X138.8595 Y43.7695 Z-15.0000 S1000
G1 F1000 X138.8507 Y43.7868 Z-15.0000 S1000
G1 F1000 X138.8368 Y43.8007 Z-15.0000 S1000
G1 F1000 X138.8195 Y43.8095 Z-15.0000 S1000
G1 F1000 X138.8000 Y43.8126 Z-15.0000 S1000
G1 F1000 X138.7805 Y43.8095 Z-15.0000 S1000
G1 F1000 X138.7632 Y43.8007 Z-15.0000 S1000
G1 F1000 X138.7493 Y43.7868 Z-15.0000 S1000
G1 F1000 X138.7405 Y43.7695 Z-15.0000 S1000
G1 F1000 X138.7374 Y43.7500 Z-15.0000 S1000
G1 F1000 X138.7405 Y43.7305 Z-15.0000 S1000
G1 F1000 X138.7493 Y43.7132 Z-15.0000 S1000
G1 F1000 X138.7632 Y43.6993 Z-15.0000 S1000
G1 F1000 X138.7805 Y43.6905 Z-15.0000 S1000
G1 F1000 X138.8000 Y43.6874 Z-15.0000 S1000
G1 F1000 X138.8195 Y43.6905 Z-15.0000 S1000
; Starting inflateGrp: Closed?:true
G1 F300 Z-18.0000
G1 F1000 X138.8368 Y43.6993 Z-18.0000 S1000
G1 F1000 X138.8507 Y43.7132 Z-18.0000 S1000
G1 F1000 X138.8595 Y43.7305 Z-18.0000 S1000
G1 F1000 X138.8626 Y43.7500 Z-18.0000 S1000
G1 F1000 X138.8595 Y43.7695 Z-18.0000 S1000
G1 F1000 X138.8507 Y43.7868 Z-18.0000 S1000
G1 F1000 X138.8368 Y43.8007 Z-18.0000 S1000
G1 F1000 X138.8195 Y43.8095 Z-18.0000 S1000
G1 F1000 X138.8000 Y43.8126 Z-18.0000 S1000
G1 F1000 X138.7805 Y43.8095 Z-18.0000 S1000
G1 F1000 X138.7632 Y43.8007 Z-18.0000 S1000
G1 F1000 X138.7493 Y43.7868 Z-18.0000 S1000
G1 F1000 X138.7405 Y43.7695 Z-18.0000 S1000
G1 F1000 X138.7374 Y43.7500 Z-18.0000 S1000
G1 F1000 X138.7405 Y43.7305 Z-18.0000 S1000
G1 F1000 X138.7493 Y43.7132 Z-18.0000 S1000
G1 F1000 X138.7632 Y43.6993 Z-18.0000 S1000
G1 F1000 X138.7805 Y43.6905 Z-18.0000 S1000
G1 F1000 X138.8000 Y43.6874 Z-18.0000 S1000
G1 F1000 X138.8195 Y43.6905 Z-18.0000 S1000
; Starting inflateGrp: Closed?:true
G1 F300 Z-19.2000
G1 F1000 X138.8368 Y43.6993 Z-19.2000 S1000
G1 F1000 X138.8507 Y43.7132 Z-19.2000 S1000
G1 F1000 X138.8595 Y43.7305 Z-19.2000 S1000
G1 F1000 X138.8626 Y43.7500 Z-19.2000 S1000
G1 F1000 X138.8595 Y43.7695 Z-19.2000 S1000
G1 F1000 X138.8507 Y43.7868 Z-19.2000 S1000
G1 F1000 X138.8368 Y43.8007 Z-19.2000 S1000
G1 F1000 X138.8195 Y43.8095 Z-19.2000 S1000
G1 F1000 X138.8000 Y43.8126 Z-19.2000 S1000
G1 F1000 X138.7805 Y43.8095 Z-19.2000 S1000
G1 F1000 X138.7632 Y43.8007 Z-19.2000 S1000
G1 F1000 X138.7493 Y43.7868 Z-19.2000 S1000
G1 F1000 X138.7405 Y43.7695 Z-19.2000 S1000
G1 F1000 X138.7374 Y43.7500 Z-19.2000 S1000
G1 F1000 X138.7405 Y43.7305 Z-19.2000 S1000
G1 F1000 X138.7493 Y43.7132 Z-19.2000 S1000
G1 F1000 X138.7632 Y43.6993 Z-19.2000 S1000
G1 F1000 X138.7805 Y43.6905 Z-19.2000 S1000
G1 F1000 X138.8000 Y43.6874 Z-19.2000 S1000
G1 F1000 X138.8195 Y43.6905 Z-19.2000 S1000
; Starting inflateGrp: Closed?:true

G0 Z10
G0 X31.2193 Y21.1905

G0 Z0
G1 F300 Z-3.0000
G1 F1000 X31.2367 Y21.1993 Z-3.0000 S1000
G1 F1000 X31.2506 Y21.2133 Z-3.0000 S1000
G1 F1000 X31.2596 Y21.2308 Z-3.0000 S1000
G1 F1000 X31.2626 Y21.2500 Z-3.0000 S1000
G1 F1000 X31.2596 Y21.2692 Z-3.0000 S1000
G1 F1000 X31.2506 Y21.2867 Z-3.0000 S1000
G1 F1000 X31.2367 Y21.3007 Z-3.0000 S1000
G1 F1000 X31.2193 Y21.3095 Z-3.0000 S1000
G1 F1000 X31.1999 Y21.3126 Z-3.0000 S1000
G1 F1000 X31.1805 Y21.3095 Z-3.0000 S1000
G1 F1000 X31.1632 Y21.3007 Z-3.0000 S1000
G1 F1000 X31.1493 Y21.2868 Z-3.0000 S1000
G1 F1000 X31.1405 Y21.2695 Z-3.0000 S1000
G1 F1000 X31.1374 Y21.2500 Z-3.0000 S1000
G1 F1000 X31.1405 Y21.2305 Z-3.0000 S1000
G1 F1000 X31.1493 Y21.2132 Z-3.0000 S1000
G1 F1000 X31.1632 Y21.1993 Z-3.0000 S1000
G1 F1000 X31.1805 Y21.1905 Z-3.0000 S1000
G1 F1000 X31.1999 Y21.1874 Z-3.0000 S1000
G1 F1000 X31.2193 Y21.1905 Z-3.0000 S1000
; Starting inflateGrp: Closed?:true
G1 F300 Z-6.0000
G1 F1000 X31.2367 Y21.1993 Z-6.0000 S1000
G1 F1000 X31.2506 Y21.2133 Z-6.0000 S1000
G1 F1000 X31.2596 Y21.2308 Z-6.0000 S1000
G1 F1000 X31.2626 Y21.2500 Z-6.0000 S1000
G1 F1000 X31.2596 Y21.2692 Z-6.0000 S1000
G1 F1000 X31.2506 Y21.2867 Z-6.0000 S1000
G1 F1000 X31.2367 Y21.3007 Z-6.0000 S1000
G1 F1000 X31.2193 Y21.3095 Z-6.0000 S1000
G1 F1000 X31.1999 Y21.3126 Z-6.0000 S1000
G1 F1000 X31.1805 Y21.3095 Z-6.0000 S1000
G1 F1000 X31.1632 Y21.3007 Z-6.0000 S1000
G1 F1000 X31.1493 Y21.2868 Z-6.0000 S1000
G1 F1000 X31.1405 Y21.2695 Z-6.0000 S1000
G1 F1000 X31.1374 Y21.2500 Z-6.0000 S1000
G1 F1000 X31.1405 Y21.2305 Z-6.0000 S1000
G1 F1000 X31.1493 Y21.2132 Z-6.0000 S1000
G1 F1000 X31.1632 Y21.1993 Z-6.0000 S1000
G1 F1000 X31.1805 Y21.1905 Z-6.0000 S1000
G1 F1000 X31.1999 Y21.1874 Z-6.0000 S1000
G1 F1000 X31.2193 Y21.1905 Z-6.0000 S1000
; Starting inflateGrp: Closed?:true
G1 F300 Z-9.0000
G1 F1000 X31.2367 Y21.1993 Z-9.0000 S1000
G1 F1000 X31.2506 Y21.2133 Z-9.0000 S1000
G1 F1000 X31.2596 Y21.2308 Z-9.0000 S1000
G1 F1000 X31.2626 Y21.2500 Z-9.0000 S1000
G1 F1000 X31.2596 Y21.2692 Z-9.0000 S1000
G1 F1000 X31.2506 Y21.2867 Z-9.0000 S1000
G1 F1000 X31.2367 Y21.3007 Z-9.0000 S1000
G1 F1000 X31.2193 Y21.3095 Z-9.0000 S1000
G1 F1000 X31.1999 Y21.3126 Z-9.0000 S1000
G1 F1000 X31.1805 Y21.3095 Z-9.0000 S1000
G1 F1000 X31.1632 Y21.3007 Z-9.0000 S1000
G1 F1000 X31.1493 Y21.2868 Z-9.0000 S1000
G1 F1000 X31.1405 Y21.2695 Z-9.0000 S1000
G1 F1000 X31.1374 Y21.2500 Z-9.0000 S1000
G1 F1000 X31.1405 Y21.2305 Z-9.0000 S1000
G1 F1000 X31.1493 Y21.2132 Z-9.0000 S1000
G1 F1000 X31.1632 Y21.1993 Z-9.0000 S1000
G1 F1000 X31.1805 Y21.1905 Z-9.0000 S1000
G1 F1000 X31.1999 Y21.1874 Z-9.0000 S1000
G1 F1000 X31.2193 Y21.1905 Z-9.0000 S1000
; Starting inflateGrp: Closed?:true
G1 F300 Z-12.0000
G1 F1000 X31.2367 Y21.1993 Z-12.0000 S1000
G1 F1000 X31.2506 Y21.2133 Z-12.0000 S1000
G1 F1000 X31.2596 Y21.2308 Z-12.0000 S1000
G1 F1000 X31.2626 Y21.2500 Z-12.0000 S1000
G1 F1000 X31.2596 Y21.2692 Z-12.0000 S1000
G1 F1000 X31.2506 Y21.2867 Z-12.0000 S1000
G1 F1000 X31.2367 Y21.3007 Z-12.0000 S1000
G1 F1000 X31.2193 Y21.3095 Z-12.0000 S1000
G1 F1000 X31.1999 Y21.3126 Z-12.0000 S1000
G1 F1000 X31.1805 Y21.3095 Z-12.0000 S1000
G1 F1000 X31.1632 Y21.3007 Z-12.0000 S1000
G1 F1000 X31.1493 Y21.2868 Z-12.0000 S1000
G1 F1000 X31.1405 Y21.2695 Z-12.0000 S1000
G1 F1000 X31.1374 Y21.2500 Z-12.0000 S1000
G1 F1000 X31.1405 Y21.2305 Z-12.0000 S1000
G1 F1000 X31.1493 Y21.2132 Z-12.0000 S1000
G1 F1000 X31.1632 Y21.1993 Z-12.0000 S1000
G1 F1000 X31.1805 Y21.1905 Z-12.0000 S1000
G1 F1000 X31.1999 Y21.1874 Z-12.0000 S1000
G1 F1000 X31.2193 Y21.1905 Z-12.0000 S1000
; Starting inflateGrp: Closed?:true
G1 F300 Z-15.0000
G1 F1000 X31.2367 Y21.1993 Z-15.0000 S1000
G1 F1000 X31.2506 Y21.2133 Z-15.0000 S1000
G1 F1000 X31.2596 Y21.2308 Z-15.0000 S1000
G1 F1000 X31.2626 Y21.2500 Z-15.0000 S1000
G1 F1000 X31.2596 Y21.2692 Z-15.0000 S1000
G1 F1000 X31.2506 Y21.2867 Z-15.0000 S1000
G1 F1000 X31.2367 Y21.3007 Z-15.0000 S1000
G1 F1000 X31.2193 Y21.3095 Z-15.0000 S1000
G1 F1000 X31.1999 Y21.3126 Z-15.0000 S1000
G1 F1000 X31.1805 Y21.3095 Z-15.0000 S1000
G1 F1000 X31.1632 Y21.3007 Z-15.0000 S1000
G1 F1000 X31.1493 Y21.2868 Z-15.0000 S1000
G1 F1000 X31.1405 Y21.2695 Z-15.0000 S1000
G1 F1000 X31.1374 Y21.2500 Z-15.0000 S1000
G1 F1000 X31.1405 Y21.2305 Z-15.0000 S1000
G1 F1000 X31.1493 Y21.2132 Z-15.0000 S1000
G1 F1000 X31.1632 Y21.1993 Z-15.0000 S1000
G1 F1000 X31.1805 Y21.1905 Z-15.0000 S1000
G1 F1000 X31.1999 Y21.1874 Z-15.0000 S1000
G1 F1000 X31.2193 Y21.1905 Z-15.0000 S1000
; Starting inflateGrp: Closed?:true
G1 F300 Z-18.0000
G1 F1000 X31.2367 Y21.1993 Z-18.0000 S1000
G1 F1000 X31.2506 Y21.2133 Z-18.0000 S1000
G1 F1000 X31.2596 Y21.2308 Z-18.0000 S1000
G1 F1000 X31.2626 Y21.2500 Z-18.0000 S1000
G1 F1000 X31.2596 Y21.2692 Z-18.0000 S1000
G1 F1000 X31.2506 Y21.2867 Z-18.0000 S1000
G1 F1000 X31.2367 Y21.3007 Z-18.0000 S1000
G1 F1000 X31.2193 Y21.3095 Z-18.0000 S1000
G1 F1000 X31.1999 Y21.3126 Z-18.0000 S1000
G1 F1000 X31.1805 Y21.3095 Z-18.0000 S1000
G1 F1000 X31.1632 Y21.3007 Z-18.0000 S1000
G1 F1000 X31.1493 Y21.2868 Z-18.0000 S1000
G1 F1000 X31.1405 Y21.2695 Z-18.0000 S1000
G1 F1000 X31.1374 Y21.2500 Z-18.0000 S1000
G1 F1000 X31.1405 Y21.2305 Z-18.0000 S1000
G1 F1000 X31.1493 Y21.2132 Z-18.0000 S1000
G1 F1000 X31.1632 Y21.1993 Z-18.0000 S1000
G1 F1000 X31.1805 Y21.1905 Z-18.0000 S1000
G1 F1000 X31.1999 Y21.1874 Z-18.0000 S1000
G1 F1000 X31.2193 Y21.1905 Z-18.0000 S1000
; Starting inflateGrp: Closed?:true
G1 F300 Z-19.2000
G1 F1000 X31.2367 Y21.1993 Z-19.2000 S1000
G1 F1000 X31.2506 Y21.2133 Z-19.2000 S1000
G1 F1000 X31.2596 Y21.2308 Z-19.2000 S1000
G1 F1000 X31.2626 Y21.2500 Z-19.2000 S1000
G1 F1000 X31.2596 Y21.2692 Z-19.2000 S1000
G1 F1000 X31.2506 Y21.2867 Z-19.2000 S1000
G1 F1000 X31.2367 Y21.3007 Z-19.2000 S1000
G1 F1000 X31.2193 Y21.3095 Z-19.2000 S1000
G1 F1000 X31.1999 Y21.3126 Z-19.2000 S1000
G1 F1000 X31.1805 Y21.3095 Z-19.2000 S1000
G1 F1000 X31.1632 Y21.3007 Z-19.2000 S1000
G1 F1000 X31.1493 Y21.2868 Z-19.2000 S1000
G1 F1000 X31.1405 Y21.2695 Z-19.2000 S1000
G1 F1000 X31.1374 Y21.2500 Z-19.2000 S1000
G1 F1000 X31.1405 Y21.2305 Z-19.2000 S1000
G1 F1000 X31.1493 Y21.2132 Z-19.2000 S1000
G1 F1000 X31.1632 Y21.1993 Z-19.2000 S1000
G1 F1000 X31.1805 Y21.1905 Z-19.2000 S1000
G1 F1000 X31.1999 Y21.1874 Z-19.2000 S1000
G1 F1000 X31.2193 Y21.1905 Z-19.2000 S1000
; Starting inflateGrp: Closed?:true

G0 Z10
G0 X31.2193 Y43.6905

G0 Z0
G1 F300 Z-3.0000
G1 F1000 X31.2367 Y43.6993 Z-3.0000 S1000
G1 F1000 X31.2506 Y43.7133 Z-3.0000 S1000
G1 F1000 X31.2596 Y43.7308 Z-3.0000 S1000
G1 F1000 X31.2626 Y43.7500 Z-3.0000 S1000
G1 F1000 X31.2596 Y43.7692 Z-3.0000 S1000
G1 F1000 X31.2506 Y43.7867 Z-3.0000 S1000
G1 F1000 X31.2367 Y43.8007 Z-3.0000 S1000
G1 F1000 X31.2193 Y43.8095 Z-3.0000 S1000
G1 F1000 X31.1999 Y43.8126 Z-3.0000 S1000
G1 F1000 X31.1805 Y43.8095 Z-3.0000 S1000
G1 F1000 X31.1632 Y43.8007 Z-3.0000 S1000
G1 F1000 X31.1493 Y43.7868 Z-3.0000 S1000
G1 F1000 X31.1405 Y43.7695 Z-3.0000 S1000
G1 F1000 X31.1374 Y43.7500 Z-3.0000 S1000
G1 F1000 X31.1405 Y43.7305 Z-3.0000 S1000
G1 F1000 X31.1493 Y43.7132 Z-3.0000 S1000
G1 F1000 X31.1632 Y43.6993 Z-3.0000 S1000
G1 F1000 X31.1805 Y43.6905 Z-3.0000 S1000
G1 F1000 X31.1999 Y43.6874 Z-3.0000 S1000
G1 F1000 X31.2193 Y43.6905 Z-3.0000 S1000
; Starting inflateGrp: Closed?:true
G1 F300 Z-6.0000
G1 F1000 X31.2367 Y43.6993 Z-6.0000 S1000
G1 F1000 X31.2506 Y43.7133 Z-6.0000 S1000
G1 F1000 X31.2596 Y43.7308 Z-6.0000 S1000
G1 F1000 X31.2626 Y43.7500 Z-6.0000 S1000
G1 F1000 X31.2596 Y43.7692 Z-6.0000 S1000
G1 F1000 X31.2506 Y43.7867 Z-6.0000 S1000
G1 F1000 X31.2367 Y43.8007 Z-6.0000 S1000
G1 F1000 X31.2193 Y43.8095 Z-6.0000 S1000
G1 F1000 X31.1999 Y43.8126 Z-6.0000 S1000
G1 F1000 X31.1805 Y43.8095 Z-6.0000 S1000
G1 F1000 X31.1632 Y43.8007 Z-6.0000 S1000
G1 F1000 X31.1493 Y43.7868 Z-6.0000 S1000
G1 F1000 X31.1405 Y43.7695 Z-6.0000 S1000
G1 F1000 X31.1374 Y43.7500 Z-6.0000 S1000
G1 F1000 X31.1405 Y43.7305 Z-6.0000 S1000
G1 F1000 X31.1493 Y43.7132 Z-6.0000 S1000
G1 F1000 X31.1632 Y43.6993 Z-6.0000 S1000
G1 F1000 X31.1805 Y43.6905 Z-6.0000 S1000
G1 F1000 X31.1999 Y43.6874 Z-6.0000 S1000
G1 F1000 X31.2193 Y43.6905 Z-6.0000 S1000
; Starting inflateGrp: Closed?:true
G1 F300 Z-9.0000
G1 F1000 X31.2367 Y43.6993 Z-9.0000 S1000
G1 F1000 X31.2506 Y43.7133 Z-9.0000 S1000
G1 F1000 X31.2596 Y43.7308 Z-9.0000 S1000
G1 F1000 X31.2626 Y43.7500 Z-9.0000 S1000
G1 F1000 X31.2596 Y43.7692 Z-9.0000 S1000
G1 F1000 X31.2506 Y43.7867 Z-9.0000 S1000
G1 F1000 X31.2367 Y43.8007 Z-9.0000 S1000
G1 F1000 X31.2193 Y43.8095 Z-9.0000 S1000
G1 F1000 X31.1999 Y43.8126 Z-9.0000 S1000
G1 F1000 X31.1805 Y43.8095 Z-9.0000 S1000
G1 F1000 X31.1632 Y43.8007 Z-9.0000 S1000
G1 F1000 X31.1493 Y43.7868 Z-9.0000 S1000
G1 F1000 X31.1405 Y43.7695 Z-9.0000 S1000
G1 F1000 X31.1374 Y43.7500 Z-9.0000 S1000
G1 F1000 X31.1405 Y43.7305 Z-9.0000 S1000
G1 F1000 X31.1493 Y43.7132 Z-9.0000 S1000
G1 F1000 X31.1632 Y43.6993 Z-9.0000 S1000
G1 F1000 X31.1805 Y43.6905 Z-9.0000 S1000
G1 F1000 X31.1999 Y43.6874 Z-9.0000 S1000
G1 F1000 X31.2193 Y43.6905 Z-9.0000 S1000
; Starting inflateGrp: Closed?:true
G1 F300 Z-12.0000
G1 F1000 X31.2367 Y43.6993 Z-12.0000 S1000
G1 F1000 X31.2506 Y43.7133 Z-12.0000 S1000
G1 F1000 X31.2596 Y43.7308 Z-12.0000 S1000
G1 F1000 X31.2626 Y43.7500 Z-12.0000 S1000
G1 F1000 X31.2596 Y43.7692 Z-12.0000 S1000
G1 F1000 X31.2506 Y43.7867 Z-12.0000 S1000
G1 F1000 X31.2367 Y43.8007 Z-12.0000 S1000
G1 F1000 X31.2193 Y43.8095 Z-12.0000 S1000
G1 F1000 X31.1999 Y43.8126 Z-12.0000 S1000
G1 F1000 X31.1805 Y43.8095 Z-12.0000 S1000
G1 F1000 X31.1632 Y43.8007 Z-12.0000 S1000
G1 F1000 X31.1493 Y43.7868 Z-12.0000 S1000
G1 F1000 X31.1405 Y43.7695 Z-12.0000 S1000
G1 F1000 X31.1374 Y43.7500 Z-12.0000 S1000
G1 F1000 X31.1405 Y43.7305 Z-12.0000 S1000
G1 F1000 X31.1493 Y43.7132 Z-12.0000 S1000
G1 F1000 X31.1632 Y43.6993 Z-12.0000 S1000
G1 F1000 X31.1805 Y43.6905 Z-12.0000 S1000
G1 F1000 X31.1999 Y43.6874 Z-12.0000 S1000
G1 F1000 X31.2193 Y43.6905 Z-12.0000 S1000
; Starting inflateGrp: Closed?:true
G1 F300 Z-15.0000
G1 F1000 X31.2367 Y43.6993 Z-15.0000 S1000
G1 F1000 X31.2506 Y43.7133 Z-15.0000 S1000
G1 F1000 X31.2596 Y43.7308 Z-15.0000 S1000
G1 F1000 X31.2626 Y43.7500 Z-15.0000 S1000
G1 F1000 X31.2596 Y43.7692 Z-15.0000 S1000
G1 F1000 X31.2506 Y43.7867 Z-15.0000 S1000
G1 F1000 X31.2367 Y43.8007 Z-15.0000 S1000
G1 F1000 X31.2193 Y43.8095 Z-15.0000 S1000
G1 F1000 X31.1999 Y43.8126 Z-15.0000 S1000
G1 F1000 X31.1805 Y43.8095 Z-15.0000 S1000
G1 F1000 X31.1632 Y43.8007 Z-15.0000 S1000
G1 F1000 X31.1493 Y43.7868 Z-15.0000 S1000
G1 F1000 X31.1405 Y43.7695 Z-15.0000 S1000
G1 F1000 X31.1374 Y43.7500 Z-15.0000 S1000
G1 F1000 X31.1405 Y43.7305 Z-15.0000 S1000
G1 F1000 X31.1493 Y43.7132 Z-15.0000 S1000
G1 F1000 X31.1632 Y43.6993 Z-15.0000 S1000
G1 F1000 X31.1805 Y43.6905 Z-15.0000 S1000
G1 F1000 X31.1999 Y43.6874 Z-15.0000 S1000
G1 F1000 X31.2193 Y43.6905 Z-15.0000 S1000
; Starting inflateGrp: Closed?:true
G1 F300 Z-18.0000
G1 F1000 X31.2367 Y43.6993 Z-18.0000 S1000
G1 F1000 X31.2506 Y43.7133 Z-18.0000 S1000
G1 F1000 X31.2596 Y43.7308 Z-18.0000 S1000
G1 F1000 X31.2626 Y43.7500 Z-18.0000 S1000
G1 F1000 X31.2596 Y43.7692 Z-18.0000 S1000
G1 F1000 X31.2506 Y43.7867 Z-18.0000 S1000
G1 F1000 X31.2367 Y43.8007 Z-18.0000 S1000
G1 F1000 X31.2193 Y43.8095 Z-18.0000 S1000
G1 F1000 X31.1999 Y43.8126 Z-18.0000 S1000
G1 F1000 X31.1805 Y43.8095 Z-18.0000 S1000
G1 F1000 X31.1632 Y43.8007 Z-18.0000 S1000
G1 F1000 X31.1493 Y43.7868 Z-18.0000 S1000
G1 F1000 X31.1405 Y43.7695 Z-18.0000 S1000
G1 F1000 X31.1374 Y43.7500 Z-18.0000 S1000
G1 F1000 X31.1405 Y43.7305 Z-18.0000 S1000
G1 F1000 X31.1493 Y43.7132 Z-18.0000 S1000
G1 F1000 X31.1632 Y43.6993 Z-18.0000 S1000
G1 F1000 X31.1805 Y43.6905 Z-18.0000 S1000
G1 F1000 X31.1999 Y43.6874 Z-18.0000 S1000
G1 F1000 X31.2193 Y43.6905 Z-18.0000 S1000
; Starting inflateGrp: Closed?:true
G1 F300 Z-19.2000
G1 F1000 X31.2367 Y43.6993 Z-19.2000 S1000
G1 F1000 X31.2506 Y43.7133 Z-19.2000 S1000
G1 F1000 X31.2596 Y43.7308 Z-19.2000 S1000
G1 F1000 X31.2626 Y43.7500 Z-19.2000 S1000
G1 F1000 X31.2596 Y43.7692 Z-19.2000 S1000
G1 F1000 X31.2506 Y43.7867 Z-19.2000 S1000
G1 F1000 X31.2367 Y43.8007 Z-19.2000 S1000
G1 F1000 X31.2193 Y43.8095 Z-19.2000 S1000
G1 F1000 X31.1999 Y43.8126 Z-19.2000 S1000
G1 F1000 X31.1805 Y43.8095 Z-19.2000 S1000
G1 F1000 X31.1632 Y43.8007 Z-19.2000 S1000
G1 F1000 X31.1493 Y43.7868 Z-19.2000 S1000
G1 F1000 X31.1405 Y43.7695 Z-19.2000 S1000
G1 F1000 X31.1374 Y43.7500 Z-19.2000 S1000
G1 F1000 X31.1405 Y43.7305 Z-19.2000 S1000
G1 F1000 X31.1493 Y43.7132 Z-19.2000 S1000
G1 F1000 X31.1632 Y43.6993 Z-19.2000 S1000
G1 F1000 X31.1805 Y43.6905 Z-19.2000 S1000
G1 F1000 X31.1999 Y43.6874 Z-19.2000 S1000
G1 F1000 X31.2193 Y43.6905 Z-19.2000 S1000
; Starting inflateGrp: Closed?:true

G0 Z10
G0 X138.8195 Y21.1905

G0 Z0
G1 F300 Z-3.0000
G1 F1000 X138.8368 Y21.1993 Z-3.0000 S1000
G1 F1000 X138.8507 Y21.2132 Z-3.0000 S1000
G1 F1000 X138.8595 Y21.2305 Z-3.0000 S1000
G1 F1000 X138.8626 Y21.2500 Z-3.0000 S1000
G1 F1000 X138.8595 Y21.2695 Z-3.0000 S1000
G1 F1000 X138.8507 Y21.2868 Z-3.0000 S1000
G1 F1000 X138.8368 Y21.3007 Z-3.0000 S1000
G1 F1000 X138.8195 Y21.3095 Z-3.0000 S1000
G1 F1000 X138.8000 Y21.3126 Z-3.0000 S1000
G1 F1000 X138.7805 Y21.3095 Z-3.0000 S1000
G1 F1000 X138.7632 Y21.3007 Z-3.0000 S1000
G1 F1000 X138.7493 Y21.2868 Z-3.0000 S1000
G1 F1000 X138.7405 Y21.2695 Z-3.0000 S1000
G1 F1000 X138.7374 Y21.2500 Z-3.0000 S1000
G1 F1000 X138.7405 Y21.2305 Z-3.0000 S1000
G1 F1000 X138.7493 Y21.2132 Z-3.0000 S1000
G1 F1000 X138.7632 Y21.1993 Z-3.0000 S1000
G1 F1000 X138.7805 Y21.1905 Z-3.0000 S1000
G1 F1000 X138.8000 Y21.1874 Z-3.0000 S1000
G1 F1000 X138.8195 Y21.1905 Z-3.0000 S1000
; Starting inflateGrp: Closed?:true
G1 F300 Z-6.0000
G1 F1000 X138.8368 Y21.1993 Z-6.0000 S1000
G1 F1000 X138.8507 Y21.2132 Z-6.0000 S1000
G1 F1000 X138.8595 Y21.2305 Z-6.0000 S1000
G1 F1000 X138.8626 Y21.2500 Z-6.0000 S1000
G1 F1000 X138.8595 Y21.2695 Z-6.0000 S1000
G1 F1000 X138.8507 Y21.2868 Z-6.0000 S1000
G1 F1000 X138.8368 Y21.3007 Z-6.0000 S1000
G1 F1000 X138.8195 Y21.3095 Z-6.0000 S1000
G1 F1000 X138.8000 Y21.3126 Z-6.0000 S1000
G1 F1000 X138.7805 Y21.3095 Z-6.0000 S1000
G1 F1000 X138.7632 Y21.3007 Z-6.0000 S1000
G1 F1000 X138.7493 Y21.2868 Z-6.0000 S1000
G1 F1000 X138.7405 Y21.2695 Z-6.0000 S1000
G1 F1000 X138.7374 Y21.2500 Z-6.0000 S1000
G1 F1000 X138.7405 Y21.2305 Z-6.0000 S1000
G1 F1000 X138.7493 Y21.2132 Z-6.0000 S1000
G1 F1000 X138.7632 Y21.1993 Z-6.0000 S1000
G1 F1000 X138.7805 Y21.1905 Z-6.0000 S1000
G1 F1000 X138.8000 Y21.1874 Z-6.0000 S1000
G1 F1000 X138.8195 Y21.1905 Z-6.0000 S1000
; Starting inflateGrp: Closed?:true
G1 F300 Z-9.0000
G1 F1000 X138.8368 Y21.1993 Z-9.0000 S1000
G1 F1000 X138.8507 Y21.2132 Z-9.0000 S1000
G1 F1000 X138.8595 Y21.2305 Z-9.0000 S1000
G1 F1000 X138.8626 Y21.2500 Z-9.0000 S1000
G1 F1000 X138.8595 Y21.2695 Z-9.0000 S1000
G1 F1000 X138.8507 Y21.2868 Z-9.0000 S1000
G1 F1000 X138.8368 Y21.3007 Z-9.0000 S1000
G1 F1000 X138.8195 Y21.3095 Z-9.0000 S1000
G1 F1000 X138.8000 Y21.3126 Z-9.0000 S1000
G1 F1000 X138.7805 Y21.3095 Z-9.0000 S1000
G1 F1000 X138.7632 Y21.3007 Z-9.0000 S1000
G1 F1000 X138.7493 Y21.2868 Z-9.0000 S1000
G1 F1000 X138.7405 Y21.2695 Z-9.0000 S1000
G1 F1000 X138.7374 Y21.2500 Z-9.0000 S1000
G1 F1000 X138.7405 Y21.2305 Z-9.0000 S1000
G1 F1000 X138.7493 Y21.2132 Z-9.0000 S1000
G1 F1000 X138.7632 Y21.1993 Z-9.0000 S1000
G1 F1000 X138.7805 Y21.1905 Z-9.0000 S1000
G1 F1000 X138.8000 Y21.1874 Z-9.0000 S1000
G1 F1000 X138.8195 Y21.1905 Z-9.0000 S1000
; Starting inflateGrp: Closed?:true
G1 F300 Z-12.0000
G1 F1000 X138.8368 Y21.1993 Z-12.0000 S1000
G1 F1000 X138.8507 Y21.2132 Z-12.0000 S1000
G1 F1000 X138.8595 Y21.2305 Z-12.0000 S1000
G1 F1000 X138.8626 Y21.2500 Z-12.0000 S1000
G1 F1000 X138.8595 Y21.2695 Z-12.0000 S1000
G1 F1000 X138.8507 Y21.2868 Z-12.0000 S1000
G1 F1000 X138.8368 Y21.3007 Z-12.0000 S1000
G1 F1000 X138.8195 Y21.3095 Z-12.0000 S1000
G1 F1000 X138.8000 Y21.3126 Z-12.0000 S1000
G1 F1000 X138.7805 Y21.3095 Z-12.0000 S1000
G1 F1000 X138.7632 Y21.3007 Z-12.0000 S1000
G1 F1000 X138.7493 Y21.2868 Z-12.0000 S1000
G1 F1000 X138.7405 Y21.2695 Z-12.0000 S1000
G1 F1000 X138.7374 Y21.2500 Z-12.0000 S1000
G1 F1000 X138.7405 Y21.2305 Z-12.0000 S1000
G1 F1000 X138.7493 Y21.2132 Z-12.0000 S1000
G1 F1000 X138.7632 Y21.1993 Z-12.0000 S1000
G1 F1000 X138.7805 Y21.1905 Z-12.0000 S1000
G1 F1000 X138.8000 Y21.1874 Z-12.0000 S1000
G1 F1000 X138.8195 Y21.1905 Z-12.0000 S1000
; Starting inflateGrp: Closed?:true
G1 F300 Z-15.0000
G1 F1000 X138.8368 Y21.1993 Z-15.0000 S1000
G1 F1000 X138.8507 Y21.2132 Z-15.0000 S1000
G1 F1000 X138.8595 Y21.2305 Z-15.0000 S1000
G1 F1000 X138.8626 Y21.2500 Z-15.0000 S1000
G1 F1000 X138.8595 Y21.2695 Z-15.0000 S1000
G1 F1000 X138.8507 Y21.2868 Z-15.0000 S1000
G1 F1000 X138.8368 Y21.3007 Z-15.0000 S1000
G1 F1000 X138.8195 Y21.3095 Z-15.0000 S1000
G1 F1000 X138.8000 Y21.3126 Z-15.0000 S1000
G1 F1000 X138.7805 Y21.3095 Z-15.0000 S1000
G1 F1000 X138.7632 Y21.3007 Z-15.0000 S1000
G1 F1000 X138.7493 Y21.2868 Z-15.0000 S1000
G1 F1000 X138.7405 Y21.2695 Z-15.0000 S1000
G1 F1000 X138.7374 Y21.2500 Z-15.0000 S1000
G1 F1000 X138.7405 Y21.2305 Z-15.0000 S1000
G1 F1000 X138.7493 Y21.2132 Z-15.0000 S1000
G1 F1000 X138.7632 Y21.1993 Z-15.0000 S1000
G1 F1000 X138.7805 Y21.1905 Z-15.0000 S1000
G1 F1000 X138.8000 Y21.1874 Z-15.0000 S1000
G1 F1000 X138.8195 Y21.1905 Z-15.0000 S1000
; Starting inflateGrp: Closed?:true
G1 F300 Z-18.0000
G1 F1000 X138.8368 Y21.1993 Z-18.0000 S1000
G1 F1000 X138.8507 Y21.2132 Z-18.0000 S1000
G1 F1000 X138.8595 Y21.2305 Z-18.0000 S1000
G1 F1000 X138.8626 Y21.2500 Z-18.0000 S1000
G1 F1000 X138.8595 Y21.2695 Z-18.0000 S1000
G1 F1000 X138.8507 Y21.2868 Z-18.0000 S1000
G1 F1000 X138.8368 Y21.3007 Z-18.0000 S1000
G1 F1000 X138.8195 Y21.3095 Z-18.0000 S1000
G1 F1000 X138.8000 Y21.3126 Z-18.0000 S1000
G1 F1000 X138.7805 Y21.3095 Z-18.0000 S1000
G1 F1000 X138.7632 Y21.3007 Z-18.0000 S1000
G1 F1000 X138.7493 Y21.2868 Z-18.0000 S1000
G1 F1000 X138.7405 Y21.2695 Z-18.0000 S1000
G1 F1000 X138.7374 Y21.2500 Z-18.0000 S1000
G1 F1000 X138.7405 Y21.2305 Z-18.0000 S1000
G1 F1000 X138.7493 Y21.2132 Z-18.0000 S1000
G1 F1000 X138.7632 Y21.1993 Z-18.0000 S1000
G1 F1000 X138.7805 Y21.1905 Z-18.0000 S1000
G1 F1000 X138.8000 Y21.1874 Z-18.0000 S1000
G1 F1000 X138.8195 Y21.1905 Z-18.0000 S1000
; Starting inflateGrp: Closed?:true
G1 F300 Z-19.2000
G1 F1000 X138.8368 Y21.1993 Z-19.2000 S1000
G1 F1000 X138.8507 Y21.2132 Z-19.2000 S1000
G1 F1000 X138.8595 Y21.2305 Z-19.2000 S1000
G1 F1000 X138.8626 Y21.2500 Z-19.2000 S1000
G1 F1000 X138.8595 Y21.2695 Z-19.2000 S1000
G1 F1000 X138.8507 Y21.2868 Z-19.2000 S1000
G1 F1000 X138.8368 Y21.3007 Z-19.2000 S1000
G1 F1000 X138.8195 Y21.3095 Z-19.2000 S1000
G1 F1000 X138.8000 Y21.3126 Z-19.2000 S1000
G1 F1000 X138.7805 Y21.3095 Z-19.2000 S1000
G1 F1000 X138.7632 Y21.3007 Z-19.2000 S1000
G1 F1000 X138.7493 Y21.2868 Z-19.2000 S1000
G1 F1000 X138.7405 Y21.2695 Z-19.2000 S1000
G1 F1000 X138.7374 Y21.2500 Z-19.2000 S1000
G1 F1000 X138.7405 Y21.2305 Z-19.2000 S1000
G1 F1000 X138.7493 Y21.2132 Z-19.2000 S1000
G1 F1000 X138.7632 Y21.1993 Z-19.2000 S1000
G1 F1000 X138.7805 Y21.1905 Z-19.2000 S1000
G1 F1000 X138.8000 Y21.1874 Z-19.2000 S1000
G1 F1000 X138.8195 Y21.1905 Z-19.2000 S1000
; retracting back to z-safe
G0 Z10

M5 S0; Spindle Off
