; GCODE Generated by cam.openbuilds.com on 2020-09-02 
G21 ; mm-mode
G54; Work Coordinates
G21; mm-mode
G90; Absolute Positioning
M3 S1000; Spindle On

; Operation 0: CNC: Pocket
; Tool Diameter: 6
; Starting inflatedGroup: Closed?:true

G0 Z10
G0 F1000 X70.0274 Y69.4569

G0 Z0
G1 F300 Z-2.0000
G1 F1000 X70.0543 Y69.4589 Z-2.0000 S1000
G1 F1000 X70.0834 Y69.4626 Z-2.0000 S1000
G1 F1000 X70.1083 Y69.4671 Z-2.0000 S1000
G1 F1000 X70.1371 Y69.4738 Z-2.0000 S1000
G1 F1000 X70.1633 Y69.4813 Z-2.0000 S1000
G1 F1000 X70.1888 Y69.4900 Z-2.0000 S1000
G1 F1000 X70.2141 Y69.5001 Z-2.0000 S1000
G1 F1000 X70.2396 Y69.5118 Z-2.0000 S1000
G1 F1000 X70.2630 Y69.5240 Z-2.0000 S1000
G1 F1000 X70.2884 Y69.5390 Z-2.0000 S1000
G1 F1000 X70.3108 Y69.5538 Z-2.0000 S1000
G1 F1000 X70.3333 Y69.5703 Z-2.0000 S1000
G1 F1000 X70.3546 Y69.5877 Z-2.0000 S1000
G1 F1000 X70.3736 Y69.6048 Z-2.0000 S1000
G1 F1000 X70.3952 Y69.6264 Z-2.0000 S1000
G1 F1000 X70.4123 Y69.6454 Z-2.0000 S1000
G1 F1000 X70.4297 Y69.6667 Z-2.0000 S1000
G1 F1000 X70.4462 Y69.6892 Z-2.0000 S1000
G1 F1000 X70.4610 Y69.7116 Z-2.0000 S1000
G1 F1000 X70.4757 Y69.7365 Z-2.0000 S1000
G1 F1000 X70.4882 Y69.7604 Z-2.0000 S1000
G1 F1000 X70.4997 Y69.7854 Z-2.0000 S1000
G1 F1000 X70.5098 Y69.8107 Z-2.0000 S1000
G1 F1000 X70.5193 Y69.8384 Z-2.0000 S1000
G1 F1000 X70.5260 Y69.8617 Z-2.0000 S1000
G1 F1000 X70.5329 Y69.8917 Z-2.0000 S1000
G1 F1000 X70.5374 Y69.9166 Z-2.0000 S1000
G1 F1000 X70.5413 Y69.9478 Z-2.0000 S1000
G1 F1000 X70.5430 Y69.9694 Z-2.0000 S1000
G1 F1000 X70.5438 Y70.0000 Z-2.0000 S1000
G1 F1000 X70.5431 Y70.0295 Z-2.0000 S1000
G1 F1000 X70.5413 Y70.0522 Z-2.0000 S1000
G1 F1000 X70.5375 Y70.0826 Z-2.0000 S1000
G1 F1000 X70.5327 Y70.1094 Z-2.0000 S1000
G1 F1000 X70.5261 Y70.1379 Z-2.0000 S1000
G1 F1000 X70.5193 Y70.1616 Z-2.0000 S1000
G1 F1000 X70.5098 Y70.1893 Z-2.0000 S1000
G1 F1000 X70.4999 Y70.2141 Z-2.0000 S1000
G1 F1000 X70.4882 Y70.2396 Z-2.0000 S1000
G1 F1000 X70.4760 Y70.2630 Z-2.0000 S1000
G1 F1000 X70.4608 Y70.2888 Z-2.0000 S1000
G1 F1000 X70.4458 Y70.3115 Z-2.0000 S1000
G1 F1000 X70.4305 Y70.3324 Z-2.0000 S1000
G1 F1000 X70.4123 Y70.3546 Z-2.0000 S1000
G1 F1000 X70.3952 Y70.3736 Z-2.0000 S1000
G1 F1000 X70.3736 Y70.3952 Z-2.0000 S1000
G1 F1000 X70.3546 Y70.4123 Z-2.0000 S1000
G1 F1000 X70.3340 Y70.4292 Z-2.0000 S1000
G1 F1000 X70.3108 Y70.4462 Z-2.0000 S1000
G1 F1000 X70.2867 Y70.4622 Z-2.0000 S1000
G1 F1000 X70.2636 Y70.4757 Z-2.0000 S1000
G1 F1000 X70.2409 Y70.4876 Z-2.0000 S1000
G1 F1000 X70.2141 Y70.4999 Z-2.0000 S1000
G1 F1000 X70.1893 Y70.5098 Z-2.0000 S1000
G1 F1000 X70.1616 Y70.5193 Z-2.0000 S1000
G1 F1000 X70.1383 Y70.5260 Z-2.0000 S1000
G1 F1000 X70.1082 Y70.5329 Z-2.0000 S1000
G1 F1000 X70.0818 Y70.5377 Z-2.0000 S1000
G1 F1000 X70.0540 Y70.5412 Z-2.0000 S1000
G1 F1000 X70.0295 Y70.5431 Z-2.0000 S1000
G1 F1000 X70.0000 Y70.5438 Z-2.0000 S1000
G1 F1000 X69.9705 Y70.5431 Z-2.0000 S1000
G1 F1000 X69.9460 Y70.5412 Z-2.0000 S1000
G1 F1000 X69.9182 Y70.5377 Z-2.0000 S1000
G1 F1000 X69.8918 Y70.5329 Z-2.0000 S1000
G1 F1000 X69.8617 Y70.5260 Z-2.0000 S1000
G1 F1000 X69.8384 Y70.5193 Z-2.0000 S1000
G1 F1000 X69.8107 Y70.5098 Z-2.0000 S1000
G1 F1000 X69.7859 Y70.4999 Z-2.0000 S1000
G1 F1000 X69.7591 Y70.4876 Z-2.0000 S1000
G1 F1000 X69.7364 Y70.4757 Z-2.0000 S1000
G1 F1000 X69.7133 Y70.4622 Z-2.0000 S1000
G1 F1000 X69.6892 Y70.4462 Z-2.0000 S1000
G1 F1000 X69.6660 Y70.4292 Z-2.0000 S1000
G1 F1000 X69.6454 Y70.4123 Z-2.0000 S1000
G1 F1000 X69.6264 Y70.3952 Z-2.0000 S1000
G1 F1000 X69.6048 Y70.3736 Z-2.0000 S1000
G1 F1000 X69.5877 Y70.3546 Z-2.0000 S1000
G1 F1000 X69.5695 Y70.3324 Z-2.0000 S1000
G1 F1000 X69.5542 Y70.3115 Z-2.0000 S1000
G1 F1000 X69.5392 Y70.2888 Z-2.0000 S1000
G1 F1000 X69.5240 Y70.2630 Z-2.0000 S1000
G1 F1000 X69.5118 Y70.2396 Z-2.0000 S1000
G1 F1000 X69.5001 Y70.2141 Z-2.0000 S1000
G1 F1000 X69.4902 Y70.1893 Z-2.0000 S1000
G1 F1000 X69.4807 Y70.1616 Z-2.0000 S1000
G1 F1000 X69.4739 Y70.1379 Z-2.0000 S1000
G1 F1000 X69.4673 Y70.1094 Z-2.0000 S1000
G1 F1000 X69.4625 Y70.0826 Z-2.0000 S1000
G1 F1000 X69.4587 Y70.0522 Z-2.0000 S1000
G1 F1000 X69.4569 Y70.0295 Z-2.0000 S1000
G1 F1000 X69.4562 Y70.0000 Z-2.0000 S1000
G1 F1000 X69.4570 Y69.9694 Z-2.0000 S1000
G1 F1000 X69.4587 Y69.9478 Z-2.0000 S1000
G1 F1000 X69.4626 Y69.9166 Z-2.0000 S1000
G1 F1000 X69.4671 Y69.8917 Z-2.0000 S1000
G1 F1000 X69.4740 Y69.8617 Z-2.0000 S1000
G1 F1000 X69.4807 Y69.8384 Z-2.0000 S1000
G1 F1000 X69.4902 Y69.8107 Z-2.0000 S1000
G1 F1000 X69.5003 Y69.7854 Z-2.0000 S1000
G1 F1000 X69.5118 Y69.7604 Z-2.0000 S1000
G1 F1000 X69.5243 Y69.7365 Z-2.0000 S1000
G1 F1000 X69.5390 Y69.7116 Z-2.0000 S1000
G1 F1000 X69.5538 Y69.6892 Z-2.0000 S1000
G1 F1000 X69.5703 Y69.6667 Z-2.0000 S1000
G1 F1000 X69.5877 Y69.6454 Z-2.0000 S1000
G1 F1000 X69.6048 Y69.6264 Z-2.0000 S1000
G1 F1000 X69.6264 Y69.6048 Z-2.0000 S1000
G1 F1000 X69.6454 Y69.5877 Z-2.0000 S1000
G1 F1000 X69.6667 Y69.5703 Z-2.0000 S1000
G1 F1000 X69.6892 Y69.5538 Z-2.0000 S1000
G1 F1000 X69.7116 Y69.5390 Z-2.0000 S1000
G1 F1000 X69.7370 Y69.5240 Z-2.0000 S1000
G1 F1000 X69.7604 Y69.5118 Z-2.0000 S1000
G1 F1000 X69.7859 Y69.5001 Z-2.0000 S1000
G1 F1000 X69.8112 Y69.4900 Z-2.0000 S1000
G1 F1000 X69.8367 Y69.4813 Z-2.0000 S1000
G1 F1000 X69.8629 Y69.4738 Z-2.0000 S1000
G1 F1000 X69.8917 Y69.4671 Z-2.0000 S1000
G1 F1000 X69.9166 Y69.4626 Z-2.0000 S1000
G1 F1000 X69.9457 Y69.4589 Z-2.0000 S1000
G1 F1000 X69.9726 Y69.4569 Z-2.0000 S1000
G1 F1000 X70.0000 Y69.4562 Z-2.0000 S1000
G1 F1000 X70.0274 Y69.4569 Z-2.0000 S1000
; Starting inflatedGroup: Closed?:true

G0 Z10
G0 X70.1497 Y67.0592

G0 Z0
G1 F300 Z-2.0000
G1 F1000 X70.2980 Y67.0705 Z-2.0000 S1000
G1 F1000 X70.4445 Y67.0892 Z-2.0000 S1000
G1 F1000 X70.5933 Y67.1159 Z-2.0000 S1000
G1 F1000 X70.7389 Y67.1496 Z-2.0000 S1000
G1 F1000 X70.8807 Y67.1902 Z-2.0000 S1000
G1 F1000 X71.0231 Y67.2389 Z-2.0000 S1000
G1 F1000 X71.1608 Y67.2939 Z-2.0000 S1000
G1 F1000 X71.2972 Y67.3566 Z-2.0000 S1000
G1 F1000 X71.4289 Y67.4253 Z-2.0000 S1000
G1 F1000 X71.5587 Y67.5017 Z-2.0000 S1000
G1 F1000 X71.6818 Y67.5829 Z-2.0000 S1000
G1 F1000 X71.8014 Y67.6707 Z-2.0000 S1000
G1 F1000 X71.9199 Y67.7673 Z-2.0000 S1000
G1 F1000 X72.0280 Y67.8650 Z-2.0000 S1000
G1 F1000 X72.1350 Y67.9720 Z-2.0000 S1000
G1 F1000 X72.2327 Y68.0801 Z-2.0000 S1000
G1 F1000 X72.3293 Y68.1986 Z-2.0000 S1000
G1 F1000 X72.4171 Y68.3182 Z-2.0000 S1000
G1 F1000 X72.4983 Y68.4413 Z-2.0000 S1000
G1 F1000 X72.5747 Y68.5711 Z-2.0000 S1000
G1 F1000 X72.6434 Y68.7028 Z-2.0000 S1000
G1 F1000 X72.7061 Y68.8392 Z-2.0000 S1000
G1 F1000 X72.7613 Y68.9774 Z-2.0000 S1000
G1 F1000 X72.8096 Y69.1187 Z-2.0000 S1000
G1 F1000 X72.8504 Y69.2611 Z-2.0000 S1000
G1 F1000 X72.8841 Y69.4067 Z-2.0000 S1000
G1 F1000 X72.9108 Y69.5555 Z-2.0000 S1000
G1 F1000 X72.9295 Y69.7024 Z-2.0000 S1000
G1 F1000 X72.9409 Y69.8515 Z-2.0000 S1000
G1 F1000 X72.9447 Y70.0000 Z-2.0000 S1000
G1 F1000 X72.9409 Y70.1485 Z-2.0000 S1000
G1 F1000 X72.9295 Y70.2976 Z-2.0000 S1000
G1 F1000 X72.9107 Y70.4456 Z-2.0000 S1000
G1 F1000 X72.8844 Y70.5925 Z-2.0000 S1000
G1 F1000 X72.8505 Y70.7386 Z-2.0000 S1000
G1 F1000 X72.8096 Y70.8813 Z-2.0000 S1000
G1 F1000 X72.7613 Y71.0226 Z-2.0000 S1000
G1 F1000 X72.7061 Y71.1608 Z-2.0000 S1000
G1 F1000 X72.6434 Y71.2972 Z-2.0000 S1000
G1 F1000 X72.5747 Y71.4289 Z-2.0000 S1000
G1 F1000 X72.4983 Y71.5585 Z-2.0000 S1000
G1 F1000 X72.4175 Y71.6812 Z-2.0000 S1000
G1 F1000 X72.3287 Y71.8021 Z-2.0000 S1000
G1 F1000 X72.2327 Y71.9199 Z-2.0000 S1000
G1 F1000 X72.1350 Y72.0280 Z-2.0000 S1000
G1 F1000 X72.0280 Y72.1350 Z-2.0000 S1000
G1 F1000 X71.9199 Y72.2327 Z-2.0000 S1000
G1 F1000 X71.8014 Y72.3293 Z-2.0000 S1000
G1 F1000 X71.6818 Y72.4171 Z-2.0000 S1000
G1 F1000 X71.5581 Y72.4986 Z-2.0000 S1000
G1 F1000 X71.4291 Y72.5746 Z-2.0000 S1000
G1 F1000 X71.2975 Y72.6433 Z-2.0000 S1000
G1 F1000 X71.1608 Y72.7061 Z-2.0000 S1000
G1 F1000 X71.0226 Y72.7613 Z-2.0000 S1000
G1 F1000 X70.8813 Y72.8096 Z-2.0000 S1000
G1 F1000 X70.7389 Y72.8504 Z-2.0000 S1000
G1 F1000 X70.5923 Y72.8844 Z-2.0000 S1000
G1 F1000 X70.4444 Y72.9109 Z-2.0000 S1000
G1 F1000 X70.2988 Y72.9295 Z-2.0000 S1000
G1 F1000 X70.1485 Y72.9409 Z-2.0000 S1000
G1 F1000 X70.0000 Y72.9447 Z-2.0000 S1000
G1 F1000 X69.8515 Y72.9409 Z-2.0000 S1000
G1 F1000 X69.7012 Y72.9295 Z-2.0000 S1000
G1 F1000 X69.5556 Y72.9109 Z-2.0000 S1000
G1 F1000 X69.4077 Y72.8844 Z-2.0000 S1000
G1 F1000 X69.2611 Y72.8504 Z-2.0000 S1000
G1 F1000 X69.1187 Y72.8096 Z-2.0000 S1000
G1 F1000 X68.9774 Y72.7613 Z-2.0000 S1000
G1 F1000 X68.8392 Y72.7061 Z-2.0000 S1000
G1 F1000 X68.7025 Y72.6433 Z-2.0000 S1000
G1 F1000 X68.5709 Y72.5746 Z-2.0000 S1000
G1 F1000 X68.4419 Y72.4986 Z-2.0000 S1000
G1 F1000 X68.3182 Y72.4171 Z-2.0000 S1000
G1 F1000 X68.1986 Y72.3293 Z-2.0000 S1000
G1 F1000 X68.0801 Y72.2327 Z-2.0000 S1000
G1 F1000 X67.9720 Y72.1350 Z-2.0000 S1000
G1 F1000 X67.8650 Y72.0280 Z-2.0000 S1000
G1 F1000 X67.7673 Y71.9199 Z-2.0000 S1000
G1 F1000 X67.6713 Y71.8021 Z-2.0000 S1000
G1 F1000 X67.5825 Y71.6812 Z-2.0000 S1000
G1 F1000 X67.5017 Y71.5585 Z-2.0000 S1000
G1 F1000 X67.4253 Y71.4289 Z-2.0000 S1000
G1 F1000 X67.3566 Y71.2972 Z-2.0000 S1000
G1 F1000 X67.2939 Y71.1608 Z-2.0000 S1000
G1 F1000 X67.2387 Y71.0226 Z-2.0000 S1000
G1 F1000 X67.1904 Y70.8813 Z-2.0000 S1000
G1 F1000 X67.1495 Y70.7386 Z-2.0000 S1000
G1 F1000 X67.1156 Y70.5925 Z-2.0000 S1000
G1 F1000 X67.0893 Y70.4456 Z-2.0000 S1000
G1 F1000 X67.0705 Y70.2976 Z-2.0000 S1000
G1 F1000 X67.0591 Y70.1485 Z-2.0000 S1000
G1 F1000 X67.0553 Y70.0000 Z-2.0000 S1000
G1 F1000 X67.0591 Y69.8515 Z-2.0000 S1000
G1 F1000 X67.0705 Y69.7024 Z-2.0000 S1000
G1 F1000 X67.0892 Y69.5555 Z-2.0000 S1000
G1 F1000 X67.1159 Y69.4067 Z-2.0000 S1000
G1 F1000 X67.1496 Y69.2611 Z-2.0000 S1000
G1 F1000 X67.1904 Y69.1187 Z-2.0000 S1000
G1 F1000 X67.2387 Y68.9774 Z-2.0000 S1000
G1 F1000 X67.2939 Y68.8392 Z-2.0000 S1000
G1 F1000 X67.3566 Y68.7028 Z-2.0000 S1000
G1 F1000 X67.4253 Y68.5711 Z-2.0000 S1000
G1 F1000 X67.5017 Y68.4413 Z-2.0000 S1000
G1 F1000 X67.5829 Y68.3182 Z-2.0000 S1000
G1 F1000 X67.6707 Y68.1986 Z-2.0000 S1000
G1 F1000 X67.7673 Y68.0801 Z-2.0000 S1000
G1 F1000 X67.8650 Y67.9720 Z-2.0000 S1000
G1 F1000 X67.9720 Y67.8650 Z-2.0000 S1000
G1 F1000 X68.0801 Y67.7673 Z-2.0000 S1000
G1 F1000 X68.1986 Y67.6707 Z-2.0000 S1000
G1 F1000 X68.3182 Y67.5829 Z-2.0000 S1000
G1 F1000 X68.4413 Y67.5017 Z-2.0000 S1000
G1 F1000 X68.5711 Y67.4253 Z-2.0000 S1000
G1 F1000 X68.7028 Y67.3566 Z-2.0000 S1000
G1 F1000 X68.8392 Y67.2939 Z-2.0000 S1000
G1 F1000 X68.9769 Y67.2389 Z-2.0000 S1000
G1 F1000 X69.1193 Y67.1902 Z-2.0000 S1000
G1 F1000 X69.2611 Y67.1496 Z-2.0000 S1000
G1 F1000 X69.4067 Y67.1159 Z-2.0000 S1000
G1 F1000 X69.5555 Y67.0892 Z-2.0000 S1000
G1 F1000 X69.7020 Y67.0705 Z-2.0000 S1000
G1 F1000 X69.8503 Y67.0592 Z-2.0000 S1000
G1 F1000 X70.0000 Y67.0554 Z-2.0000 S1000
G1 F1000 X70.1497 Y67.0592 Z-2.0000 S1000
; Starting inflatedGroup: Closed?:true

G0 Z10
G0 X70.2721 Y64.6616

G0 Z0
G1 F300 Z-2.0000
G1 F1000 X70.5396 Y64.6819 Z-2.0000 S1000
G1 F1000 X70.8098 Y64.7164 Z-2.0000 S1000
G1 F1000 X71.0761 Y64.7641 Z-2.0000 S1000
G1 F1000 X71.3389 Y64.8251 Z-2.0000 S1000
G1 F1000 X71.6006 Y64.9000 Z-2.0000 S1000
G1 F1000 X71.8578 Y64.9879 Z-2.0000 S1000
G1 F1000 X72.1065 Y65.0872 Z-2.0000 S1000
G1 F1000 X72.3539 Y65.2009 Z-2.0000 S1000
G1 F1000 X72.5940 Y65.3263 Z-2.0000 S1000
G1 F1000 X72.8279 Y65.4640 Z-2.0000 S1000
G1 F1000 X73.0536 Y65.6127 Z-2.0000 S1000
G1 F1000 X73.2729 Y65.7738 Z-2.0000 S1000
G1 F1000 X73.4820 Y65.9442 Z-2.0000 S1000
G1 F1000 X73.6835 Y66.1263 Z-2.0000 S1000
G1 F1000 X73.8737 Y66.3165 Z-2.0000 S1000
G1 F1000 X74.0558 Y66.5180 Z-2.0000 S1000
G1 F1000 X74.2262 Y66.7271 Z-2.0000 S1000
G1 F1000 X74.3873 Y66.9464 Z-2.0000 S1000
G1 F1000 X74.5360 Y67.1721 Z-2.0000 S1000
G1 F1000 X74.6737 Y67.4060 Z-2.0000 S1000
G1 F1000 X74.7991 Y67.6461 Z-2.0000 S1000
G1 F1000 X74.9128 Y67.8935 Z-2.0000 S1000
G1 F1000 X75.0128 Y68.1438 Z-2.0000 S1000
G1 F1000 X75.1004 Y68.4002 Z-2.0000 S1000
G1 F1000 X75.1743 Y68.6586 Z-2.0000 S1000
G1 F1000 X75.2359 Y68.9239 Z-2.0000 S1000
G1 F1000 X75.2836 Y69.1902 Z-2.0000 S1000
G1 F1000 X75.3181 Y69.4609 Z-2.0000 S1000
G1 F1000 X75.3385 Y69.7287 Z-2.0000 S1000
G1 F1000 X75.3454 Y70.0000 Z-2.0000 S1000
G1 F1000 X75.3385 Y70.2713 Z-2.0000 S1000
G1 F1000 X75.3181 Y70.5391 Z-2.0000 S1000
G1 F1000 X75.2835 Y70.8106 Z-2.0000 S1000
G1 F1000 X75.2360 Y71.0761 Z-2.0000 S1000
G1 F1000 X75.1745 Y71.3407 Z-2.0000 S1000
G1 F1000 X75.1004 Y71.5998 Z-2.0000 S1000
G1 F1000 X75.0128 Y71.8562 Z-2.0000 S1000
G1 F1000 X74.9128 Y72.1065 Z-2.0000 S1000
G1 F1000 X74.7991 Y72.3539 Z-2.0000 S1000
G1 F1000 X74.6737 Y72.5940 Z-2.0000 S1000
G1 F1000 X74.5353 Y72.8292 Z-2.0000 S1000
G1 F1000 X74.3873 Y73.0537 Z-2.0000 S1000
G1 F1000 X74.2271 Y73.2719 Z-2.0000 S1000
G1 F1000 X74.0558 Y73.4820 Z-2.0000 S1000
G1 F1000 X73.8737 Y73.6835 Z-2.0000 S1000
G1 F1000 X73.6835 Y73.8737 Z-2.0000 S1000
G1 F1000 X73.4820 Y74.0558 Z-2.0000 S1000
G1 F1000 X73.2729 Y74.2262 Z-2.0000 S1000
G1 F1000 X73.0536 Y74.3873 Z-2.0000 S1000
G1 F1000 X72.8267 Y74.5368 Z-2.0000 S1000
G1 F1000 X72.5936 Y74.6740 Z-2.0000 S1000
G1 F1000 X72.3557 Y74.7983 Z-2.0000 S1000
G1 F1000 X72.1065 Y74.9128 Z-2.0000 S1000
G1 F1000 X71.8562 Y75.0128 Z-2.0000 S1000
G1 F1000 X71.5998 Y75.1004 Z-2.0000 S1000
G1 F1000 X71.3414 Y75.1743 Z-2.0000 S1000
G1 F1000 X71.0745 Y75.2363 Z-2.0000 S1000
G1 F1000 X70.8090 Y75.2839 Z-2.0000 S1000
G1 F1000 X70.5415 Y75.3179 Z-2.0000 S1000
G1 F1000 X70.2713 Y75.3385 Z-2.0000 S1000
G1 F1000 X70.0000 Y75.3454 Z-2.0000 S1000
G1 F1000 X69.7287 Y75.3385 Z-2.0000 S1000
G1 F1000 X69.4585 Y75.3179 Z-2.0000 S1000
G1 F1000 X69.1910 Y75.2839 Z-2.0000 S1000
G1 F1000 X68.9255 Y75.2363 Z-2.0000 S1000
G1 F1000 X68.6586 Y75.1743 Z-2.0000 S1000
G1 F1000 X68.4002 Y75.1004 Z-2.0000 S1000
G1 F1000 X68.1438 Y75.0128 Z-2.0000 S1000
G1 F1000 X67.8935 Y74.9128 Z-2.0000 S1000
G1 F1000 X67.6443 Y74.7983 Z-2.0000 S1000
G1 F1000 X67.4064 Y74.6740 Z-2.0000 S1000
G1 F1000 X67.1733 Y74.5368 Z-2.0000 S1000
G1 F1000 X66.9464 Y74.3873 Z-2.0000 S1000
G1 F1000 X66.7271 Y74.2262 Z-2.0000 S1000
G1 F1000 X66.5180 Y74.0558 Z-2.0000 S1000
G1 F1000 X66.3165 Y73.8737 Z-2.0000 S1000
G1 F1000 X66.1263 Y73.6835 Z-2.0000 S1000
G1 F1000 X65.9442 Y73.4820 Z-2.0000 S1000
G1 F1000 X65.7729 Y73.2719 Z-2.0000 S1000
G1 F1000 X65.6127 Y73.0537 Z-2.0000 S1000
G1 F1000 X65.4647 Y72.8292 Z-2.0000 S1000
G1 F1000 X65.3263 Y72.5940 Z-2.0000 S1000
G1 F1000 X65.2009 Y72.3539 Z-2.0000 S1000
G1 F1000 X65.0872 Y72.1065 Z-2.0000 S1000
G1 F1000 X64.9872 Y71.8562 Z-2.0000 S1000
G1 F1000 X64.8996 Y71.5998 Z-2.0000 S1000
G1 F1000 X64.8255 Y71.3407 Z-2.0000 S1000
G1 F1000 X64.7640 Y71.0761 Z-2.0000 S1000
G1 F1000 X64.7165 Y70.8106 Z-2.0000 S1000
G1 F1000 X64.6819 Y70.5391 Z-2.0000 S1000
G1 F1000 X64.6615 Y70.2713 Z-2.0000 S1000
G1 F1000 X64.6546 Y70.0000 Z-2.0000 S1000
G1 F1000 X64.6615 Y69.7287 Z-2.0000 S1000
G1 F1000 X64.6819 Y69.4609 Z-2.0000 S1000
G1 F1000 X64.7164 Y69.1902 Z-2.0000 S1000
G1 F1000 X64.7641 Y68.9239 Z-2.0000 S1000
G1 F1000 X64.8257 Y68.6586 Z-2.0000 S1000
G1 F1000 X64.8996 Y68.4002 Z-2.0000 S1000
G1 F1000 X64.9872 Y68.1438 Z-2.0000 S1000
G1 F1000 X65.0872 Y67.8935 Z-2.0000 S1000
G1 F1000 X65.2009 Y67.6461 Z-2.0000 S1000
G1 F1000 X65.3263 Y67.4060 Z-2.0000 S1000
G1 F1000 X65.4640 Y67.1721 Z-2.0000 S1000
G1 F1000 X65.6127 Y66.9464 Z-2.0000 S1000
G1 F1000 X65.7738 Y66.7271 Z-2.0000 S1000
G1 F1000 X65.9442 Y66.5180 Z-2.0000 S1000
G1 F1000 X66.1263 Y66.3165 Z-2.0000 S1000
G1 F1000 X66.3165 Y66.1263 Z-2.0000 S1000
G1 F1000 X66.5180 Y65.9442 Z-2.0000 S1000
G1 F1000 X66.7271 Y65.7738 Z-2.0000 S1000
G1 F1000 X66.9464 Y65.6127 Z-2.0000 S1000
G1 F1000 X67.1721 Y65.4640 Z-2.0000 S1000
G1 F1000 X67.4060 Y65.3263 Z-2.0000 S1000
G1 F1000 X67.6461 Y65.2009 Z-2.0000 S1000
G1 F1000 X67.8935 Y65.0872 Z-2.0000 S1000
G1 F1000 X68.1422 Y64.9879 Z-2.0000 S1000
G1 F1000 X68.3994 Y64.9000 Z-2.0000 S1000
G1 F1000 X68.6611 Y64.8251 Z-2.0000 S1000
G1 F1000 X68.9239 Y64.7641 Z-2.0000 S1000
G1 F1000 X69.1902 Y64.7164 Z-2.0000 S1000
G1 F1000 X69.4604 Y64.6819 Z-2.0000 S1000
G1 F1000 X69.7279 Y64.6616 Z-2.0000 S1000
G1 F1000 X70.0000 Y64.6547 Z-2.0000 S1000
G1 F1000 X70.2721 Y64.6616 Z-2.0000 S1000
; Starting inflatedGroup: Closed?:true

G0 Z10
G0 X70.3925 Y62.2638

G0 Z0
G1 F300 Z-2.0000
G1 F1000 X70.7836 Y62.2936 Z-2.0000 S1000
G1 F1000 X71.1726 Y62.3431 Z-2.0000 S1000
G1 F1000 X71.5592 Y62.4124 Z-2.0000 S1000
G1 F1000 X71.9407 Y62.5009 Z-2.0000 S1000
G1 F1000 X72.3198 Y62.6094 Z-2.0000 S1000
G1 F1000 X72.6904 Y62.7361 Z-2.0000 S1000
G1 F1000 X73.0539 Y62.8813 Z-2.0000 S1000
G1 F1000 X73.4115 Y63.0456 Z-2.0000 S1000
G1 F1000 X73.7591 Y63.2272 Z-2.0000 S1000
G1 F1000 X74.0972 Y63.4262 Z-2.0000 S1000
G1 F1000 X74.4264 Y63.6432 Z-2.0000 S1000
G1 F1000 X74.7413 Y63.8744 Z-2.0000 S1000
G1 F1000 X75.0451 Y64.1221 Z-2.0000 S1000
G1 F1000 X75.3368 Y64.3856 Z-2.0000 S1000
G1 F1000 X75.6144 Y64.6632 Z-2.0000 S1000
G1 F1000 X75.8779 Y64.9549 Z-2.0000 S1000
G1 F1000 X76.1256 Y65.2587 Z-2.0000 S1000
G1 F1000 X76.3568 Y65.5736 Z-2.0000 S1000
G1 F1000 X76.5738 Y65.9028 Z-2.0000 S1000
G1 F1000 X76.7728 Y66.2409 Z-2.0000 S1000
G1 F1000 X76.9544 Y66.5885 Z-2.0000 S1000
G1 F1000 X77.1187 Y66.9461 Z-2.0000 S1000
G1 F1000 X77.2643 Y67.3105 Z-2.0000 S1000
G1 F1000 X77.3906 Y67.6800 Z-2.0000 S1000
G1 F1000 X77.4989 Y68.0584 Z-2.0000 S1000
G1 F1000 X77.5876 Y68.4408 Z-2.0000 S1000
G1 F1000 X77.6569 Y68.8274 Z-2.0000 S1000
G1 F1000 X77.7065 Y69.2171 Z-2.0000 S1000
G1 F1000 X77.7362 Y69.6060 Z-2.0000 S1000
G1 F1000 X77.7461 Y70.0000 Z-2.0000 S1000
G1 F1000 X77.7362 Y70.3940 Z-2.0000 S1000
G1 F1000 X77.7065 Y70.7829 Z-2.0000 S1000
G1 F1000 X77.6570 Y71.1718 Z-2.0000 S1000
G1 F1000 X77.5876 Y71.5588 Z-2.0000 S1000
G1 F1000 X77.4985 Y71.9427 Z-2.0000 S1000
G1 F1000 X77.3906 Y72.3200 Z-2.0000 S1000
G1 F1000 X77.2643 Y72.6895 Z-2.0000 S1000
G1 F1000 X77.1187 Y73.0539 Z-2.0000 S1000
G1 F1000 X76.9544 Y73.4115 Z-2.0000 S1000
G1 F1000 X76.7728 Y73.7591 Z-2.0000 S1000
G1 F1000 X76.5728 Y74.0989 Z-2.0000 S1000
G1 F1000 X76.3581 Y74.4247 Z-2.0000 S1000
G1 F1000 X76.1254 Y74.7416 Z-2.0000 S1000
G1 F1000 X75.8779 Y75.0451 Z-2.0000 S1000
G1 F1000 X75.6144 Y75.3368 Z-2.0000 S1000
G1 F1000 X75.3368 Y75.6144 Z-2.0000 S1000
G1 F1000 X75.0451 Y75.8779 Z-2.0000 S1000
G1 F1000 X74.7413 Y76.1256 Z-2.0000 S1000
G1 F1000 X74.4264 Y76.3568 Z-2.0000 S1000
G1 F1000 X74.0972 Y76.5738 Z-2.0000 S1000
G1 F1000 X73.7583 Y76.7733 Z-2.0000 S1000
G1 F1000 X73.4124 Y76.9540 Z-2.0000 S1000
G1 F1000 X73.0539 Y77.1187 Z-2.0000 S1000
G1 F1000 X72.6895 Y77.2643 Z-2.0000 S1000
G1 F1000 X72.3200 Y77.3906 Z-2.0000 S1000
G1 F1000 X71.9416 Y77.4989 Z-2.0000 S1000
G1 F1000 X71.5586 Y77.5877 Z-2.0000 S1000
G1 F1000 X71.1738 Y77.6567 Z-2.0000 S1000
G1 F1000 X70.7823 Y77.7066 Z-2.0000 S1000
G1 F1000 X70.3940 Y77.7362 Z-2.0000 S1000
G1 F1000 X70.0000 Y77.7461 Z-2.0000 S1000
G1 F1000 X69.6060 Y77.7362 Z-2.0000 S1000
G1 F1000 X69.2177 Y77.7066 Z-2.0000 S1000
G1 F1000 X68.8262 Y77.6567 Z-2.0000 S1000
G1 F1000 X68.4414 Y77.5877 Z-2.0000 S1000
G1 F1000 X68.0584 Y77.4989 Z-2.0000 S1000
G1 F1000 X67.6800 Y77.3906 Z-2.0000 S1000
G1 F1000 X67.3105 Y77.2643 Z-2.0000 S1000
G1 F1000 X66.9461 Y77.1187 Z-2.0000 S1000
G1 F1000 X66.5876 Y76.9540 Z-2.0000 S1000
G1 F1000 X66.2417 Y76.7733 Z-2.0000 S1000
G1 F1000 X65.9028 Y76.5738 Z-2.0000 S1000
G1 F1000 X65.5736 Y76.3568 Z-2.0000 S1000
G1 F1000 X65.2587 Y76.1256 Z-2.0000 S1000
G1 F1000 X64.9549 Y75.8779 Z-2.0000 S1000
G1 F1000 X64.6632 Y75.6144 Z-2.0000 S1000
G1 F1000 X64.3856 Y75.3368 Z-2.0000 S1000
G1 F1000 X64.1221 Y75.0451 Z-2.0000 S1000
G1 F1000 X63.8746 Y74.7416 Z-2.0000 S1000
G1 F1000 X63.6419 Y74.4247 Z-2.0000 S1000
G1 F1000 X63.4272 Y74.0989 Z-2.0000 S1000
G1 F1000 X63.2272 Y73.7591 Z-2.0000 S1000
G1 F1000 X63.0456 Y73.4115 Z-2.0000 S1000
G1 F1000 X62.8813 Y73.0539 Z-2.0000 S1000
G1 F1000 X62.7357 Y72.6895 Z-2.0000 S1000
G1 F1000 X62.6094 Y72.3200 Z-2.0000 S1000
G1 F1000 X62.5015 Y71.9427 Z-2.0000 S1000
G1 F1000 X62.4124 Y71.5588 Z-2.0000 S1000
G1 F1000 X62.3430 Y71.1718 Z-2.0000 S1000
G1 F1000 X62.2935 Y70.7829 Z-2.0000 S1000
G1 F1000 X62.2638 Y70.3940 Z-2.0000 S1000
G1 F1000 X62.2539 Y70.0000 Z-2.0000 S1000
G1 F1000 X62.2638 Y69.6060 Z-2.0000 S1000
G1 F1000 X62.2935 Y69.2171 Z-2.0000 S1000
G1 F1000 X62.3431 Y68.8274 Z-2.0000 S1000
G1 F1000 X62.4124 Y68.4408 Z-2.0000 S1000
G1 F1000 X62.5011 Y68.0584 Z-2.0000 S1000
G1 F1000 X62.6094 Y67.6800 Z-2.0000 S1000
G1 F1000 X62.7357 Y67.3105 Z-2.0000 S1000
G1 F1000 X62.8813 Y66.9461 Z-2.0000 S1000
G1 F1000 X63.0456 Y66.5885 Z-2.0000 S1000
G1 F1000 X63.2272 Y66.2409 Z-2.0000 S1000
G1 F1000 X63.4262 Y65.9028 Z-2.0000 S1000
G1 F1000 X63.6432 Y65.5736 Z-2.0000 S1000
G1 F1000 X63.8744 Y65.2587 Z-2.0000 S1000
G1 F1000 X64.1221 Y64.9549 Z-2.0000 S1000
G1 F1000 X64.3856 Y64.6632 Z-2.0000 S1000
G1 F1000 X64.6632 Y64.3856 Z-2.0000 S1000
G1 F1000 X64.9549 Y64.1221 Z-2.0000 S1000
G1 F1000 X65.2587 Y63.8744 Z-2.0000 S1000
G1 F1000 X65.5736 Y63.6432 Z-2.0000 S1000
G1 F1000 X65.9028 Y63.4262 Z-2.0000 S1000
G1 F1000 X66.2409 Y63.2272 Z-2.0000 S1000
G1 F1000 X66.5885 Y63.0456 Z-2.0000 S1000
G1 F1000 X66.9461 Y62.8813 Z-2.0000 S1000
G1 F1000 X67.3096 Y62.7361 Z-2.0000 S1000
G1 F1000 X67.6802 Y62.6094 Z-2.0000 S1000
G1 F1000 X68.0593 Y62.5009 Z-2.0000 S1000
G1 F1000 X68.4408 Y62.4124 Z-2.0000 S1000
G1 F1000 X68.8274 Y62.3431 Z-2.0000 S1000
G1 F1000 X69.2164 Y62.2936 Z-2.0000 S1000
G1 F1000 X69.6075 Y62.2638 Z-2.0000 S1000
G1 F1000 X70.0000 Y62.2538 Z-2.0000 S1000
G1 F1000 X70.3925 Y62.2638 Z-2.0000 S1000
; Starting inflatedGroup: Closed?:true

G0 Z10
G0 X70.5149 Y59.8662

G0 Z0
G1 F300 Z-2.0000
G1 F1000 X71.0253 Y59.9050 Z-2.0000 S1000
G1 F1000 X71.5359 Y59.9701 Z-2.0000 S1000
G1 F1000 X72.0439 Y60.0611 Z-2.0000 S1000
G1 F1000 X72.5426 Y60.1768 Z-2.0000 S1000
G1 F1000 X73.0372 Y60.3184 Z-2.0000 S1000
G1 F1000 X73.5240 Y60.4847 Z-2.0000 S1000
G1 F1000 X74.0029 Y60.6761 Z-2.0000 S1000
G1 F1000 X74.4675 Y60.8895 Z-2.0000 S1000
G1 F1000 X74.9250 Y61.1285 Z-2.0000 S1000
G1 F1000 X75.3675 Y61.3890 Z-2.0000 S1000
G1 F1000 X75.7960 Y61.6714 Z-2.0000 S1000
G1 F1000 X76.2119 Y61.9767 Z-2.0000 S1000
G1 F1000 X76.6092 Y62.3007 Z-2.0000 S1000
G1 F1000 X76.9913 Y62.6459 Z-2.0000 S1000
G1 F1000 X77.3541 Y63.0087 Z-2.0000 S1000
G1 F1000 X77.6993 Y63.3908 Z-2.0000 S1000
G1 F1000 X78.0233 Y63.7881 Z-2.0000 S1000
G1 F1000 X78.3286 Y64.2040 Z-2.0000 S1000
G1 F1000 X78.6110 Y64.6325 Z-2.0000 S1000
G1 F1000 X78.8715 Y65.0750 Z-2.0000 S1000
G1 F1000 X79.1105 Y65.5325 Z-2.0000 S1000
G1 F1000 X79.3239 Y65.9971 Z-2.0000 S1000
G1 F1000 X79.5156 Y66.4769 Z-2.0000 S1000
G1 F1000 X79.6813 Y66.9615 Z-2.0000 S1000
G1 F1000 X79.8233 Y67.4578 Z-2.0000 S1000
G1 F1000 X79.9389 Y67.9561 Z-2.0000 S1000
G1 F1000 X80.0299 Y68.4641 Z-2.0000 S1000
G1 F1000 X80.0949 Y68.9737 Z-2.0000 S1000
G1 F1000 X80.1340 Y69.4871 Z-2.0000 S1000
G1 F1000 X80.1470 Y70.0000 Z-2.0000 S1000
G1 F1000 X80.1340 Y70.5129 Z-2.0000 S1000
G1 F1000 X80.0949 Y71.0263 Z-2.0000 S1000
G1 F1000 X80.0298 Y71.5367 Z-2.0000 S1000
G1 F1000 X79.9392 Y72.0424 Z-2.0000 S1000
G1 F1000 X79.8231 Y72.5430 Z-2.0000 S1000
G1 F1000 X79.6813 Y73.0385 Z-2.0000 S1000
G1 F1000 X79.5156 Y73.5231 Z-2.0000 S1000
G1 F1000 X79.3239 Y74.0029 Z-2.0000 S1000
G1 F1000 X79.1105 Y74.4675 Z-2.0000 S1000
G1 F1000 X78.8715 Y74.9250 Z-2.0000 S1000
G1 F1000 X78.6112 Y75.3672 Z-2.0000 S1000
G1 F1000 X78.3280 Y75.7970 Z-2.0000 S1000
G1 F1000 X78.0238 Y76.2113 Z-2.0000 S1000
G1 F1000 X77.6993 Y76.6092 Z-2.0000 S1000
G1 F1000 X77.3541 Y76.9913 Z-2.0000 S1000
G1 F1000 X76.9913 Y77.3541 Z-2.0000 S1000
G1 F1000 X76.6092 Y77.6993 Z-2.0000 S1000
G1 F1000 X76.2119 Y78.0233 Z-2.0000 S1000
G1 F1000 X75.7960 Y78.3286 Z-2.0000 S1000
G1 F1000 X75.3673 Y78.6112 Z-2.0000 S1000
G1 F1000 X74.9253 Y78.8714 Z-2.0000 S1000
G1 F1000 X74.4674 Y79.1106 Z-2.0000 S1000
G1 F1000 X74.0029 Y79.3239 Z-2.0000 S1000
G1 F1000 X73.5231 Y79.5156 Z-2.0000 S1000
G1 F1000 X73.0385 Y79.6813 Z-2.0000 S1000
G1 F1000 X72.5422 Y79.8233 Z-2.0000 S1000
G1 F1000 X72.0427 Y79.9392 Z-2.0000 S1000
G1 F1000 X71.5364 Y80.0300 Z-2.0000 S1000
G1 F1000 X71.0270 Y80.0948 Z-2.0000 S1000
G1 F1000 X70.5129 Y80.1340 Z-2.0000 S1000
G1 F1000 X70.0000 Y80.1470 Z-2.0000 S1000
G1 F1000 X69.4871 Y80.1340 Z-2.0000 S1000
G1 F1000 X68.9730 Y80.0948 Z-2.0000 S1000
G1 F1000 X68.4636 Y80.0300 Z-2.0000 S1000
G1 F1000 X67.9573 Y79.9392 Z-2.0000 S1000
G1 F1000 X67.4578 Y79.8233 Z-2.0000 S1000
G1 F1000 X66.9615 Y79.6813 Z-2.0000 S1000
G1 F1000 X66.4769 Y79.5156 Z-2.0000 S1000
G1 F1000 X65.9971 Y79.3239 Z-2.0000 S1000
G1 F1000 X65.5326 Y79.1106 Z-2.0000 S1000
G1 F1000 X65.0747 Y78.8714 Z-2.0000 S1000
G1 F1000 X64.6327 Y78.6112 Z-2.0000 S1000
G1 F1000 X64.2040 Y78.3286 Z-2.0000 S1000
G1 F1000 X63.7881 Y78.0233 Z-2.0000 S1000
G1 F1000 X63.3908 Y77.6993 Z-2.0000 S1000
G1 F1000 X63.0087 Y77.3541 Z-2.0000 S1000
G1 F1000 X62.6459 Y76.9913 Z-2.0000 S1000
G1 F1000 X62.3007 Y76.6092 Z-2.0000 S1000
G1 F1000 X61.9762 Y76.2113 Z-2.0000 S1000
G1 F1000 X61.6720 Y75.7970 Z-2.0000 S1000
G1 F1000 X61.3888 Y75.3672 Z-2.0000 S1000
G1 F1000 X61.1285 Y74.9250 Z-2.0000 S1000
G1 F1000 X60.8895 Y74.4675 Z-2.0000 S1000
G1 F1000 X60.6761 Y74.0029 Z-2.0000 S1000
G1 F1000 X60.4844 Y73.5231 Z-2.0000 S1000
G1 F1000 X60.3187 Y73.0385 Z-2.0000 S1000
G1 F1000 X60.1769 Y72.5430 Z-2.0000 S1000
G1 F1000 X60.0608 Y72.0424 Z-2.0000 S1000
G1 F1000 X59.9702 Y71.5367 Z-2.0000 S1000
G1 F1000 X59.9051 Y71.0263 Z-2.0000 S1000
G1 F1000 X59.8660 Y70.5129 Z-2.0000 S1000
G1 F1000 X59.8530 Y70.0000 Z-2.0000 S1000
G1 F1000 X59.8660 Y69.4871 Z-2.0000 S1000
G1 F1000 X59.9051 Y68.9737 Z-2.0000 S1000
G1 F1000 X59.9701 Y68.4641 Z-2.0000 S1000
G1 F1000 X60.0611 Y67.9561 Z-2.0000 S1000
G1 F1000 X60.1767 Y67.4578 Z-2.0000 S1000
G1 F1000 X60.3187 Y66.9615 Z-2.0000 S1000
G1 F1000 X60.4844 Y66.4769 Z-2.0000 S1000
G1 F1000 X60.6761 Y65.9971 Z-2.0000 S1000
G1 F1000 X60.8895 Y65.5325 Z-2.0000 S1000
G1 F1000 X61.1285 Y65.0750 Z-2.0000 S1000
G1 F1000 X61.3890 Y64.6325 Z-2.0000 S1000
G1 F1000 X61.6714 Y64.2040 Z-2.0000 S1000
G1 F1000 X61.9767 Y63.7881 Z-2.0000 S1000
G1 F1000 X62.3007 Y63.3908 Z-2.0000 S1000
G1 F1000 X62.6459 Y63.0087 Z-2.0000 S1000
G1 F1000 X63.0087 Y62.6459 Z-2.0000 S1000
G1 F1000 X63.3908 Y62.3007 Z-2.0000 S1000
G1 F1000 X63.7881 Y61.9767 Z-2.0000 S1000
G1 F1000 X64.2040 Y61.6714 Z-2.0000 S1000
G1 F1000 X64.6325 Y61.3890 Z-2.0000 S1000
G1 F1000 X65.0750 Y61.1285 Z-2.0000 S1000
G1 F1000 X65.5325 Y60.8895 Z-2.0000 S1000
G1 F1000 X65.9971 Y60.6761 Z-2.0000 S1000
G1 F1000 X66.4760 Y60.4847 Z-2.0000 S1000
G1 F1000 X66.9628 Y60.3184 Z-2.0000 S1000
G1 F1000 X67.4574 Y60.1768 Z-2.0000 S1000
G1 F1000 X67.9561 Y60.0611 Z-2.0000 S1000
G1 F1000 X68.4641 Y59.9701 Z-2.0000 S1000
G1 F1000 X68.9747 Y59.9050 Z-2.0000 S1000
G1 F1000 X69.4851 Y59.8662 Z-2.0000 S1000
G1 F1000 X70.0000 Y59.8531 Z-2.0000 S1000
G1 F1000 X70.5149 Y59.8662 Z-2.0000 S1000
; Starting inflatedGroup: Closed?:true

G0 Z10
G0 X70.6353 Y57.4685

G0 Z0
G1 F300 Z-2.0000
G1 F1000 X71.2709 Y57.5168 Z-2.0000 S1000
G1 F1000 X71.8990 Y57.5969 Z-2.0000 S1000
G1 F1000 X72.5270 Y57.7094 Z-2.0000 S1000
G1 F1000 X73.1449 Y57.8528 Z-2.0000 S1000
G1 F1000 X73.7559 Y58.0277 Z-2.0000 S1000
G1 F1000 X74.3583 Y58.2335 Z-2.0000 S1000
G1 F1000 X74.9480 Y58.4691 Z-2.0000 S1000
G1 F1000 X75.5259 Y58.7346 Z-2.0000 S1000
G1 F1000 X76.0886 Y59.0286 Z-2.0000 S1000
G1 F1000 X76.6382 Y59.3521 Z-2.0000 S1000
G1 F1000 X77.1679 Y59.7012 Z-2.0000 S1000
G1 F1000 X77.6812 Y60.0781 Z-2.0000 S1000
G1 F1000 X78.1722 Y60.4784 Z-2.0000 S1000
G1 F1000 X78.6447 Y60.9053 Z-2.0000 S1000
G1 F1000 X79.0947 Y61.3553 Z-2.0000 S1000
G1 F1000 X79.5216 Y61.8278 Z-2.0000 S1000
G1 F1000 X79.9219 Y62.3188 Z-2.0000 S1000
G1 F1000 X80.2988 Y62.8321 Z-2.0000 S1000
G1 F1000 X80.6479 Y63.3618 Z-2.0000 S1000
G1 F1000 X80.9714 Y63.9114 Z-2.0000 S1000
G1 F1000 X81.2654 Y64.4741 Z-2.0000 S1000
G1 F1000 X81.5309 Y65.0520 Z-2.0000 S1000
G1 F1000 X81.7666 Y65.6419 Z-2.0000 S1000
G1 F1000 X81.9723 Y66.2437 Z-2.0000 S1000
G1 F1000 X82.1472 Y66.8553 Z-2.0000 S1000
G1 F1000 X82.2906 Y67.4730 Z-2.0000 S1000
G1 F1000 X82.4031 Y68.1010 Z-2.0000 S1000
G1 F1000 X82.4833 Y68.7303 Z-2.0000 S1000
G1 F1000 X82.5316 Y69.3642 Z-2.0000 S1000
G1 F1000 X82.5477 Y70.0000 Z-2.0000 S1000
G1 F1000 X82.5316 Y70.6358 Z-2.0000 S1000
G1 F1000 X82.4833 Y71.2697 Z-2.0000 S1000
G1 F1000 X82.4030 Y71.8997 Z-2.0000 S1000
G1 F1000 X82.2909 Y72.5255 Z-2.0000 S1000
G1 F1000 X82.1470 Y73.1455 Z-2.0000 S1000
G1 F1000 X81.9723 Y73.7563 Z-2.0000 S1000
G1 F1000 X81.7666 Y74.3581 Z-2.0000 S1000
G1 F1000 X81.5309 Y74.9480 Z-2.0000 S1000
G1 F1000 X81.2654 Y75.5259 Z-2.0000 S1000
G1 F1000 X80.9714 Y76.0886 Z-2.0000 S1000
G1 F1000 X80.6478 Y76.6383 Z-2.0000 S1000
G1 F1000 X80.2988 Y77.1681 Z-2.0000 S1000
G1 F1000 X79.9221 Y77.6809 Z-2.0000 S1000
G1 F1000 X79.5216 Y78.1722 Z-2.0000 S1000
G1 F1000 X79.0947 Y78.6447 Z-2.0000 S1000
G1 F1000 X78.6447 Y79.0947 Z-2.0000 S1000
G1 F1000 X78.1722 Y79.5216 Z-2.0000 S1000
G1 F1000 X77.6812 Y79.9219 Z-2.0000 S1000
G1 F1000 X77.1679 Y80.2988 Z-2.0000 S1000
G1 F1000 X76.6378 Y80.6481 Z-2.0000 S1000
G1 F1000 X76.0885 Y80.9716 Z-2.0000 S1000
G1 F1000 X75.5264 Y81.2652 Z-2.0000 S1000
G1 F1000 X74.9480 Y81.5309 Z-2.0000 S1000
G1 F1000 X74.3581 Y81.7666 Z-2.0000 S1000
G1 F1000 X73.7563 Y81.9723 Z-2.0000 S1000
G1 F1000 X73.1447 Y82.1472 Z-2.0000 S1000
G1 F1000 X72.5268 Y82.2906 Z-2.0000 S1000
G1 F1000 X71.8990 Y82.4032 Z-2.0000 S1000
G1 F1000 X71.2698 Y82.4833 Z-2.0000 S1000
G1 F1000 X70.6358 Y82.5316 Z-2.0000 S1000
G1 F1000 X70.0000 Y82.5477 Z-2.0000 S1000
G1 F1000 X69.3642 Y82.5316 Z-2.0000 S1000
G1 F1000 X68.7302 Y82.4833 Z-2.0000 S1000
G1 F1000 X68.1010 Y82.4032 Z-2.0000 S1000
G1 F1000 X67.4732 Y82.2906 Z-2.0000 S1000
G1 F1000 X66.8553 Y82.1472 Z-2.0000 S1000
G1 F1000 X66.2437 Y81.9723 Z-2.0000 S1000
G1 F1000 X65.6419 Y81.7666 Z-2.0000 S1000
G1 F1000 X65.0520 Y81.5309 Z-2.0000 S1000
G1 F1000 X64.4736 Y81.2652 Z-2.0000 S1000
G1 F1000 X63.9115 Y80.9716 Z-2.0000 S1000
G1 F1000 X63.3622 Y80.6481 Z-2.0000 S1000
G1 F1000 X62.8321 Y80.2988 Z-2.0000 S1000
G1 F1000 X62.3188 Y79.9219 Z-2.0000 S1000
G1 F1000 X61.8278 Y79.5216 Z-2.0000 S1000
G1 F1000 X61.3553 Y79.0947 Z-2.0000 S1000
G1 F1000 X60.9053 Y78.6447 Z-2.0000 S1000
G1 F1000 X60.4784 Y78.1722 Z-2.0000 S1000
G1 F1000 X60.0779 Y77.6809 Z-2.0000 S1000
G1 F1000 X59.7012 Y77.1681 Z-2.0000 S1000
G1 F1000 X59.3522 Y76.6383 Z-2.0000 S1000
G1 F1000 X59.0286 Y76.0886 Z-2.0000 S1000
G1 F1000 X58.7346 Y75.5259 Z-2.0000 S1000
G1 F1000 X58.4691 Y74.9480 Z-2.0000 S1000
G1 F1000 X58.2334 Y74.3581 Z-2.0000 S1000
G1 F1000 X58.0277 Y73.7563 Z-2.0000 S1000
G1 F1000 X57.8530 Y73.1455 Z-2.0000 S1000
G1 F1000 X57.7091 Y72.5255 Z-2.0000 S1000
G1 F1000 X57.5970 Y71.8997 Z-2.0000 S1000
G1 F1000 X57.5167 Y71.2697 Z-2.0000 S1000
G1 F1000 X57.4684 Y70.6358 Z-2.0000 S1000
G1 F1000 X57.4523 Y70.0000 Z-2.0000 S1000
G1 F1000 X57.4684 Y69.3642 Z-2.0000 S1000
G1 F1000 X57.5167 Y68.7303 Z-2.0000 S1000
G1 F1000 X57.5969 Y68.1010 Z-2.0000 S1000
G1 F1000 X57.7094 Y67.4730 Z-2.0000 S1000
G1 F1000 X57.8528 Y66.8553 Z-2.0000 S1000
G1 F1000 X58.0277 Y66.2437 Z-2.0000 S1000
G1 F1000 X58.2334 Y65.6419 Z-2.0000 S1000
G1 F1000 X58.4691 Y65.0520 Z-2.0000 S1000
G1 F1000 X58.7346 Y64.4741 Z-2.0000 S1000
G1 F1000 X59.0286 Y63.9114 Z-2.0000 S1000
G1 F1000 X59.3521 Y63.3618 Z-2.0000 S1000
G1 F1000 X59.7012 Y62.8321 Z-2.0000 S1000
G1 F1000 X60.0781 Y62.3188 Z-2.0000 S1000
G1 F1000 X60.4784 Y61.8278 Z-2.0000 S1000
G1 F1000 X60.9053 Y61.3553 Z-2.0000 S1000
G1 F1000 X61.3553 Y60.9053 Z-2.0000 S1000
G1 F1000 X61.8278 Y60.4784 Z-2.0000 S1000
G1 F1000 X62.3188 Y60.0781 Z-2.0000 S1000
G1 F1000 X62.8321 Y59.7012 Z-2.0000 S1000
G1 F1000 X63.3618 Y59.3521 Z-2.0000 S1000
G1 F1000 X63.9114 Y59.0286 Z-2.0000 S1000
G1 F1000 X64.4741 Y58.7346 Z-2.0000 S1000
G1 F1000 X65.0520 Y58.4691 Z-2.0000 S1000
G1 F1000 X65.6417 Y58.2335 Z-2.0000 S1000
G1 F1000 X66.2441 Y58.0277 Z-2.0000 S1000
G1 F1000 X66.8551 Y57.8528 Z-2.0000 S1000
G1 F1000 X67.4730 Y57.7094 Z-2.0000 S1000
G1 F1000 X68.1010 Y57.5969 Z-2.0000 S1000
G1 F1000 X68.7291 Y57.5168 Z-2.0000 S1000
G1 F1000 X69.3647 Y57.4685 Z-2.0000 S1000
G1 F1000 X70.0000 Y57.4523 Z-2.0000 S1000
G1 F1000 X70.6353 Y57.4685 Z-2.0000 S1000
; Starting inflatedGroup: Closed?:true

G0 Z10
G0 X70.7575 Y55.0708

G0 Z0
G1 F300 Z-2.0000
G1 F1000 X71.5127 Y55.1283 Z-2.0000 S1000
G1 F1000 X72.2643 Y55.2241 Z-2.0000 S1000
G1 F1000 X73.0078 Y55.3573 Z-2.0000 S1000
G1 F1000 X73.7467 Y55.5288 Z-2.0000 S1000
G1 F1000 X74.4758 Y55.7374 Z-2.0000 S1000
G1 F1000 X75.1914 Y55.9819 Z-2.0000 S1000
G1 F1000 X75.8953 Y56.2632 Z-2.0000 S1000
G1 F1000 X76.5826 Y56.5790 Z-2.0000 S1000
G1 F1000 X77.2552 Y56.9303 Z-2.0000 S1000
G1 F1000 X77.9061 Y57.3134 Z-2.0000 S1000
G1 F1000 X78.5410 Y57.7319 Z-2.0000 S1000
G1 F1000 X79.1493 Y58.1785 Z-2.0000 S1000
G1 F1000 X79.7375 Y58.6581 Z-2.0000 S1000
G1 F1000 X80.2992 Y59.1656 Z-2.0000 S1000
G1 F1000 X80.8344 Y59.7008 Z-2.0000 S1000
G1 F1000 X81.3419 Y60.2625 Z-2.0000 S1000
G1 F1000 X81.8215 Y60.8507 Z-2.0000 S1000
G1 F1000 X82.2681 Y61.4590 Z-2.0000 S1000
G1 F1000 X82.6866 Y62.0939 Z-2.0000 S1000
G1 F1000 X83.0697 Y62.7448 Z-2.0000 S1000
G1 F1000 X83.4210 Y63.4174 Z-2.0000 S1000
G1 F1000 X83.7368 Y64.1047 Z-2.0000 S1000
G1 F1000 X84.0183 Y64.8093 Z-2.0000 S1000
G1 F1000 X84.2626 Y65.5240 Z-2.0000 S1000
G1 F1000 X84.4711 Y66.2528 Z-2.0000 S1000
G1 F1000 X84.6427 Y66.9922 Z-2.0000 S1000
G1 F1000 X84.7759 Y67.7357 Z-2.0000 S1000
G1 F1000 X84.8719 Y68.4889 Z-2.0000 S1000
G1 F1000 X84.9292 Y69.2413 Z-2.0000 S1000
G1 F1000 X84.9484 Y70.0000 Z-2.0000 S1000
G1 F1000 X84.9292 Y70.7587 Z-2.0000 S1000
G1 F1000 X84.8719 Y71.5111 Z-2.0000 S1000
G1 F1000 X84.7759 Y72.2647 Z-2.0000 S1000
G1 F1000 X84.6425 Y73.0090 Z-2.0000 S1000
G1 F1000 X84.4715 Y73.7458 Z-2.0000 S1000
G1 F1000 X84.2626 Y74.4760 Z-2.0000 S1000
G1 F1000 X84.0183 Y75.1907 Z-2.0000 S1000
G1 F1000 X83.7368 Y75.8953 Z-2.0000 S1000
G1 F1000 X83.4210 Y76.5826 Z-2.0000 S1000
G1 F1000 X83.0697 Y77.2552 Z-2.0000 S1000
G1 F1000 X82.6857 Y77.9076 Z-2.0000 S1000
G1 F1000 X82.2695 Y78.5392 Z-2.0000 S1000
G1 F1000 X81.8211 Y79.1497 Z-2.0000 S1000
G1 F1000 X81.3419 Y79.7375 Z-2.0000 S1000
G1 F1000 X80.8344 Y80.2992 Z-2.0000 S1000
G1 F1000 X80.2992 Y80.8344 Z-2.0000 S1000
G1 F1000 X79.7375 Y81.3419 Z-2.0000 S1000
G1 F1000 X79.1493 Y81.8215 Z-2.0000 S1000
G1 F1000 X78.5410 Y82.2681 Z-2.0000 S1000
G1 F1000 X77.9064 Y82.6863 Z-2.0000 S1000
G1 F1000 X77.2546 Y83.0701 Z-2.0000 S1000
G1 F1000 X76.5829 Y83.4209 Z-2.0000 S1000
G1 F1000 X75.8953 Y83.7368 Z-2.0000 S1000
G1 F1000 X75.1907 Y84.0183 Z-2.0000 S1000
G1 F1000 X74.4760 Y84.2626 Z-2.0000 S1000
G1 F1000 X73.7472 Y84.4711 Z-2.0000 S1000
G1 F1000 X73.0074 Y84.6428 Z-2.0000 S1000
G1 F1000 X72.2633 Y84.7762 Z-2.0000 S1000
G1 F1000 X71.5126 Y84.8718 Z-2.0000 S1000
G1 F1000 X70.7587 Y84.9292 Z-2.0000 S1000
G1 F1000 X70.0000 Y84.9484 Z-2.0000 S1000
G1 F1000 X69.2413 Y84.9292 Z-2.0000 S1000
G1 F1000 X68.4874 Y84.8718 Z-2.0000 S1000
G1 F1000 X67.7367 Y84.7762 Z-2.0000 S1000
G1 F1000 X66.9926 Y84.6428 Z-2.0000 S1000
G1 F1000 X66.2528 Y84.4711 Z-2.0000 S1000
G1 F1000 X65.5240 Y84.2626 Z-2.0000 S1000
G1 F1000 X64.8093 Y84.0183 Z-2.0000 S1000
G1 F1000 X64.1047 Y83.7368 Z-2.0000 S1000
G1 F1000 X63.4171 Y83.4209 Z-2.0000 S1000
G1 F1000 X62.7454 Y83.0701 Z-2.0000 S1000
G1 F1000 X62.0936 Y82.6863 Z-2.0000 S1000
G1 F1000 X61.4590 Y82.2681 Z-2.0000 S1000
G1 F1000 X60.8507 Y81.8215 Z-2.0000 S1000
G1 F1000 X60.2625 Y81.3419 Z-2.0000 S1000
G1 F1000 X59.7008 Y80.8344 Z-2.0000 S1000
G1 F1000 X59.1656 Y80.2992 Z-2.0000 S1000
G1 F1000 X58.6581 Y79.7375 Z-2.0000 S1000
G1 F1000 X58.1789 Y79.1497 Z-2.0000 S1000
G1 F1000 X57.7305 Y78.5392 Z-2.0000 S1000
G1 F1000 X57.3143 Y77.9076 Z-2.0000 S1000
G1 F1000 X56.9303 Y77.2552 Z-2.0000 S1000
G1 F1000 X56.5790 Y76.5826 Z-2.0000 S1000
G1 F1000 X56.2632 Y75.8953 Z-2.0000 S1000
G1 F1000 X55.9817 Y75.1907 Z-2.0000 S1000
G1 F1000 X55.7374 Y74.4760 Z-2.0000 S1000
G1 F1000 X55.5285 Y73.7458 Z-2.0000 S1000
G1 F1000 X55.3575 Y73.0090 Z-2.0000 S1000
G1 F1000 X55.2241 Y72.2647 Z-2.0000 S1000
G1 F1000 X55.1281 Y71.5111 Z-2.0000 S1000
G1 F1000 X55.0708 Y70.7587 Z-2.0000 S1000
G1 F1000 X55.0516 Y70.0000 Z-2.0000 S1000
G1 F1000 X55.0708 Y69.2413 Z-2.0000 S1000
G1 F1000 X55.1281 Y68.4889 Z-2.0000 S1000
G1 F1000 X55.2241 Y67.7357 Z-2.0000 S1000
G1 F1000 X55.3573 Y66.9922 Z-2.0000 S1000
G1 F1000 X55.5289 Y66.2528 Z-2.0000 S1000
G1 F1000 X55.7374 Y65.5240 Z-2.0000 S1000
G1 F1000 X55.9817 Y64.8093 Z-2.0000 S1000
G1 F1000 X56.2632 Y64.1047 Z-2.0000 S1000
G1 F1000 X56.5790 Y63.4174 Z-2.0000 S1000
G1 F1000 X56.9303 Y62.7448 Z-2.0000 S1000
G1 F1000 X57.3134 Y62.0939 Z-2.0000 S1000
G1 F1000 X57.7319 Y61.4590 Z-2.0000 S1000
G1 F1000 X58.1785 Y60.8507 Z-2.0000 S1000
G1 F1000 X58.6581 Y60.2625 Z-2.0000 S1000
G1 F1000 X59.1656 Y59.7008 Z-2.0000 S1000
G1 F1000 X59.7008 Y59.1656 Z-2.0000 S1000
G1 F1000 X60.2625 Y58.6581 Z-2.0000 S1000
G1 F1000 X60.8507 Y58.1785 Z-2.0000 S1000
G1 F1000 X61.4590 Y57.7319 Z-2.0000 S1000
G1 F1000 X62.0939 Y57.3134 Z-2.0000 S1000
G1 F1000 X62.7448 Y56.9303 Z-2.0000 S1000
G1 F1000 X63.4174 Y56.5790 Z-2.0000 S1000
G1 F1000 X64.1047 Y56.2632 Z-2.0000 S1000
G1 F1000 X64.8086 Y55.9819 Z-2.0000 S1000
G1 F1000 X65.5242 Y55.7374 Z-2.0000 S1000
G1 F1000 X66.2533 Y55.5288 Z-2.0000 S1000
G1 F1000 X66.9922 Y55.3573 Z-2.0000 S1000
G1 F1000 X67.7357 Y55.2241 Z-2.0000 S1000
G1 F1000 X68.4873 Y55.1283 Z-2.0000 S1000
G1 F1000 X69.2425 Y55.0708 Z-2.0000 S1000
G1 F1000 X70.0000 Y55.0516 Z-2.0000 S1000
G1 F1000 X70.7575 Y55.0708 Z-2.0000 S1000
; Starting inflatedGroup: Closed?:true

G0 Z10
G0 X70.8470 Y53.2724

G0 Z0
G1 F300 Z-2.0000
G1 F1000 X71.6957 Y53.3370 Z-2.0000 S1000
G1 F1000 X72.5348 Y53.4439 Z-2.0000 S1000
G1 F1000 X73.3716 Y53.5939 Z-2.0000 S1000
G1 F1000 X74.1993 Y53.7860 Z-2.0000 S1000
G1 F1000 X75.0135 Y54.0190 Z-2.0000 S1000
G1 F1000 X75.8180 Y54.2939 Z-2.0000 S1000
G1 F1000 X76.6049 Y54.6082 Z-2.0000 S1000
G1 F1000 X77.3753 Y54.9622 Z-2.0000 S1000
G1 F1000 X78.1288 Y55.3559 Z-2.0000 S1000
G1 F1000 X78.8591 Y55.7857 Z-2.0000 S1000
G1 F1000 X79.5687 Y56.2534 Z-2.0000 S1000
G1 F1000 X80.2517 Y56.7549 Z-2.0000 S1000
G1 F1000 X80.9102 Y57.2918 Z-2.0000 S1000
G1 F1000 X81.5401 Y57.8609 Z-2.0000 S1000
G1 F1000 X82.1391 Y58.4599 Z-2.0000 S1000
G1 F1000 X82.7082 Y59.0898 Z-2.0000 S1000
G1 F1000 X83.2451 Y59.7483 Z-2.0000 S1000
G1 F1000 X83.7466 Y60.4313 Z-2.0000 S1000
G1 F1000 X84.2143 Y61.1409 Z-2.0000 S1000
G1 F1000 X84.6441 Y61.8712 Z-2.0000 S1000
G1 F1000 X85.0378 Y62.6247 Z-2.0000 S1000
G1 F1000 X85.3918 Y63.3951 Z-2.0000 S1000
G1 F1000 X85.7064 Y64.1827 Z-2.0000 S1000
G1 F1000 X85.9809 Y64.9857 Z-2.0000 S1000
G1 F1000 X86.2141 Y65.8009 Z-2.0000 S1000
G1 F1000 X86.4061 Y66.6284 Z-2.0000 S1000
G1 F1000 X86.5561 Y67.4652 Z-2.0000 S1000
G1 F1000 X86.6632 Y68.3059 Z-2.0000 S1000
G1 F1000 X86.7276 Y69.1517 Z-2.0000 S1000
G1 F1000 X86.7491 Y70.0000 Z-2.0000 S1000
G1 F1000 X86.7276 Y70.8483 Z-2.0000 S1000
G1 F1000 X86.6632 Y71.6941 Z-2.0000 S1000
G1 F1000 X86.5560 Y72.5352 Z-2.0000 S1000
G1 F1000 X86.4059 Y73.3728 Z-2.0000 S1000
G1 F1000 X86.2145 Y74.1977 Z-2.0000 S1000
G1 F1000 X85.9809 Y75.0143 Z-2.0000 S1000
G1 F1000 X85.7064 Y75.8173 Z-2.0000 S1000
G1 F1000 X85.3918 Y76.6049 Z-2.0000 S1000
G1 F1000 X85.0378 Y77.3753 Z-2.0000 S1000
G1 F1000 X84.6441 Y78.1288 Z-2.0000 S1000
G1 F1000 X84.2145 Y78.8586 Z-2.0000 S1000
G1 F1000 X83.7467 Y79.5686 Z-2.0000 S1000
G1 F1000 X83.2446 Y80.2522 Z-2.0000 S1000
G1 F1000 X82.7082 Y80.9102 Z-2.0000 S1000
G1 F1000 X82.1391 Y81.5401 Z-2.0000 S1000
G1 F1000 X81.5401 Y82.1391 Z-2.0000 S1000
G1 F1000 X80.9102 Y82.7082 Z-2.0000 S1000
G1 F1000 X80.2517 Y83.2451 Z-2.0000 S1000
G1 F1000 X79.5687 Y83.7466 Z-2.0000 S1000
G1 F1000 X78.8592 Y84.2142 Z-2.0000 S1000
G1 F1000 X78.1285 Y84.6444 Z-2.0000 S1000
G1 F1000 X77.3755 Y85.0377 Z-2.0000 S1000
G1 F1000 X76.6049 Y85.3918 Z-2.0000 S1000
G1 F1000 X75.8173 Y85.7064 Z-2.0000 S1000
G1 F1000 X75.0143 Y85.9809 Z-2.0000 S1000
G1 F1000 X74.1991 Y86.2141 Z-2.0000 S1000
G1 F1000 X73.3706 Y86.4063 Z-2.0000 S1000
G1 F1000 X72.5369 Y86.5558 Z-2.0000 S1000
G1 F1000 X71.6930 Y86.6633 Z-2.0000 S1000
G1 F1000 X70.8483 Y86.7276 Z-2.0000 S1000
G1 F1000 X70.0000 Y86.7491 Z-2.0000 S1000
G1 F1000 X69.1517 Y86.7276 Z-2.0000 S1000
G1 F1000 X68.3070 Y86.6633 Z-2.0000 S1000
G1 F1000 X67.4631 Y86.5558 Z-2.0000 S1000
G1 F1000 X66.6294 Y86.4063 Z-2.0000 S1000
G1 F1000 X65.8009 Y86.2141 Z-2.0000 S1000
G1 F1000 X64.9857 Y85.9809 Z-2.0000 S1000
G1 F1000 X64.1827 Y85.7064 Z-2.0000 S1000
G1 F1000 X63.3951 Y85.3918 Z-2.0000 S1000
G1 F1000 X62.6245 Y85.0377 Z-2.0000 S1000
G1 F1000 X61.8715 Y84.6444 Z-2.0000 S1000
G1 F1000 X61.1408 Y84.2142 Z-2.0000 S1000
G1 F1000 X60.4313 Y83.7466 Z-2.0000 S1000
G1 F1000 X59.7483 Y83.2451 Z-2.0000 S1000
G1 F1000 X59.0898 Y82.7082 Z-2.0000 S1000
G1 F1000 X58.4599 Y82.1391 Z-2.0000 S1000
G1 F1000 X57.8609 Y81.5401 Z-2.0000 S1000
G1 F1000 X57.2918 Y80.9102 Z-2.0000 S1000
G1 F1000 X56.7554 Y80.2522 Z-2.0000 S1000
G1 F1000 X56.2533 Y79.5686 Z-2.0000 S1000
G1 F1000 X55.7855 Y78.8586 Z-2.0000 S1000
G1 F1000 X55.3559 Y78.1288 Z-2.0000 S1000
G1 F1000 X54.9622 Y77.3753 Z-2.0000 S1000
G1 F1000 X54.6082 Y76.6049 Z-2.0000 S1000
G1 F1000 X54.2936 Y75.8173 Z-2.0000 S1000
G1 F1000 X54.0191 Y75.0143 Z-2.0000 S1000
G1 F1000 X53.7855 Y74.1977 Z-2.0000 S1000
G1 F1000 X53.5941 Y73.3728 Z-2.0000 S1000
G1 F1000 X53.4440 Y72.5352 Z-2.0000 S1000
G1 F1000 X53.3368 Y71.6941 Z-2.0000 S1000
G1 F1000 X53.2724 Y70.8483 Z-2.0000 S1000
G1 F1000 X53.2509 Y70.0000 Z-2.0000 S1000
G1 F1000 X53.2724 Y69.1517 Z-2.0000 S1000
G1 F1000 X53.3368 Y68.3059 Z-2.0000 S1000
G1 F1000 X53.4439 Y67.4652 Z-2.0000 S1000
G1 F1000 X53.5939 Y66.6284 Z-2.0000 S1000
G1 F1000 X53.7859 Y65.8009 Z-2.0000 S1000
G1 F1000 X54.0191 Y64.9857 Z-2.0000 S1000
G1 F1000 X54.2936 Y64.1827 Z-2.0000 S1000
G1 F1000 X54.6082 Y63.3951 Z-2.0000 S1000
G1 F1000 X54.9622 Y62.6247 Z-2.0000 S1000
G1 F1000 X55.3559 Y61.8712 Z-2.0000 S1000
G1 F1000 X55.7857 Y61.1409 Z-2.0000 S1000
G1 F1000 X56.2534 Y60.4313 Z-2.0000 S1000
G1 F1000 X56.7549 Y59.7483 Z-2.0000 S1000
G1 F1000 X57.2918 Y59.0898 Z-2.0000 S1000
G1 F1000 X57.8609 Y58.4599 Z-2.0000 S1000
G1 F1000 X58.4599 Y57.8609 Z-2.0000 S1000
G1 F1000 X59.0898 Y57.2918 Z-2.0000 S1000
G1 F1000 X59.7483 Y56.7549 Z-2.0000 S1000
G1 F1000 X60.4313 Y56.2534 Z-2.0000 S1000
G1 F1000 X61.1409 Y55.7857 Z-2.0000 S1000
G1 F1000 X61.8712 Y55.3559 Z-2.0000 S1000
G1 F1000 X62.6247 Y54.9622 Z-2.0000 S1000
G1 F1000 X63.3951 Y54.6082 Z-2.0000 S1000
G1 F1000 X64.1820 Y54.2939 Z-2.0000 S1000
G1 F1000 X64.9865 Y54.0190 Z-2.0000 S1000
G1 F1000 X65.8007 Y53.7860 Z-2.0000 S1000
G1 F1000 X66.6284 Y53.5939 Z-2.0000 S1000
G1 F1000 X67.4652 Y53.4439 Z-2.0000 S1000
G1 F1000 X68.3043 Y53.3370 Z-2.0000 S1000
G1 F1000 X69.1530 Y53.2724 Z-2.0000 S1000
G1 F1000 X70.0000 Y53.2509 Z-2.0000 S1000
G1 F1000 X70.8470 Y53.2724 Z-2.0000 S1000
; retracting back to z-safe
G0 Z10
; Operation 1: CNC: Vector (path inside)
; Tool Diameter: 6
; Starting inflateGrp: Closed?:true

G0 Z10
G0 F1000 X70.7107 Y62.7886

G0 Z0
G1 F300 Z-3.0000
G1 F1000 X71.4135 Y62.8928 Z-3.0000 S1000
G1 F1000 X72.1035 Y63.0657 Z-3.0000 S1000
G1 F1000 X72.7736 Y63.3054 Z-3.0000 S1000
G1 F1000 X73.4159 Y63.6092 Z-3.0000 S1000
G1 F1000 X74.0257 Y63.9747 Z-3.0000 S1000
G1 F1000 X74.5970 Y64.3984 Z-3.0000 S1000
G1 F1000 X75.1240 Y64.8760 Z-3.0000 S1000
G1 F1000 X75.6016 Y65.4030 Z-3.0000 S1000
G1 F1000 X76.0253 Y65.9743 Z-3.0000 S1000
G1 F1000 X76.3908 Y66.5841 Z-3.0000 S1000
G1 F1000 X76.6946 Y67.2264 Z-3.0000 S1000
G1 F1000 X76.9343 Y67.8965 Z-3.0000 S1000
G1 F1000 X77.1072 Y68.5865 Z-3.0000 S1000
G1 F1000 X77.2114 Y69.2893 Z-3.0000 S1000
G1 F1000 X77.2464 Y70.0000 Z-3.0000 S1000
G1 F1000 X77.2114 Y70.7107 Z-3.0000 S1000
G1 F1000 X77.1072 Y71.4135 Z-3.0000 S1000
G1 F1000 X76.9343 Y72.1035 Z-3.0000 S1000
G1 F1000 X76.6946 Y72.7736 Z-3.0000 S1000
G1 F1000 X76.3908 Y73.4159 Z-3.0000 S1000
G1 F1000 X76.0253 Y74.0257 Z-3.0000 S1000
G1 F1000 X75.6016 Y74.5970 Z-3.0000 S1000
G1 F1000 X75.1240 Y75.1240 Z-3.0000 S1000
G1 F1000 X74.5970 Y75.6016 Z-3.0000 S1000
G1 F1000 X74.0257 Y76.0253 Z-3.0000 S1000
G1 F1000 X73.4159 Y76.3908 Z-3.0000 S1000
G1 F1000 X72.7736 Y76.6946 Z-3.0000 S1000
G1 F1000 X72.1031 Y76.9345 Z-3.0000 S1000
G1 F1000 X71.4143 Y77.1071 Z-3.0000 S1000
G1 F1000 X70.7103 Y77.2114 Z-3.0000 S1000
G1 F1000 X70.0000 Y77.2464 Z-3.0000 S1000
G1 F1000 X69.2897 Y77.2114 Z-3.0000 S1000
G1 F1000 X68.5857 Y77.1071 Z-3.0000 S1000
G1 F1000 X67.8969 Y76.9345 Z-3.0000 S1000
G1 F1000 X67.2264 Y76.6946 Z-3.0000 S1000
G1 F1000 X66.5841 Y76.3908 Z-3.0000 S1000
G1 F1000 X65.9743 Y76.0253 Z-3.0000 S1000
G1 F1000 X65.4030 Y75.6016 Z-3.0000 S1000
G1 F1000 X64.8760 Y75.1240 Z-3.0000 S1000
G1 F1000 X64.3984 Y74.5970 Z-3.0000 S1000
G1 F1000 X63.9747 Y74.0257 Z-3.0000 S1000
G1 F1000 X63.6092 Y73.4159 Z-3.0000 S1000
G1 F1000 X63.3054 Y72.7736 Z-3.0000 S1000
G1 F1000 X63.0657 Y72.1035 Z-3.0000 S1000
G1 F1000 X62.8928 Y71.4135 Z-3.0000 S1000
G1 F1000 X62.7886 Y70.7107 Z-3.0000 S1000
G1 F1000 X62.7536 Y70.0000 Z-3.0000 S1000
G1 F1000 X62.7886 Y69.2893 Z-3.0000 S1000
G1 F1000 X62.8928 Y68.5865 Z-3.0000 S1000
G1 F1000 X63.0657 Y67.8965 Z-3.0000 S1000
G1 F1000 X63.3054 Y67.2264 Z-3.0000 S1000
G1 F1000 X63.6092 Y66.5841 Z-3.0000 S1000
G1 F1000 X63.9747 Y65.9743 Z-3.0000 S1000
G1 F1000 X64.3984 Y65.4030 Z-3.0000 S1000
G1 F1000 X64.8760 Y64.8760 Z-3.0000 S1000
G1 F1000 X65.4030 Y64.3984 Z-3.0000 S1000
G1 F1000 X65.9743 Y63.9747 Z-3.0000 S1000
G1 F1000 X66.5841 Y63.6092 Z-3.0000 S1000
G1 F1000 X67.2264 Y63.3054 Z-3.0000 S1000
G1 F1000 X67.8965 Y63.0657 Z-3.0000 S1000
G1 F1000 X68.5865 Y62.8928 Z-3.0000 S1000
G1 F1000 X69.2893 Y62.7886 Z-3.0000 S1000
G1 F1000 X70.0000 Y62.7536 Z-3.0000 S1000
G1 F1000 X70.7107 Y62.7886 Z-3.0000 S1000
; Starting inflateGrp: Closed?:true
G1 F300 Z-6.0000
G1 F1000 X71.4135 Y62.8928 Z-6.0000 S1000
G1 F1000 X72.1035 Y63.0657 Z-6.0000 S1000
G1 F1000 X72.7736 Y63.3054 Z-6.0000 S1000
G1 F1000 X73.4159 Y63.6092 Z-6.0000 S1000
G1 F1000 X74.0257 Y63.9747 Z-6.0000 S1000
G1 F1000 X74.5970 Y64.3984 Z-6.0000 S1000
G1 F1000 X75.1240 Y64.8760 Z-6.0000 S1000
G1 F1000 X75.6016 Y65.4030 Z-6.0000 S1000
G1 F1000 X76.0253 Y65.9743 Z-6.0000 S1000
G1 F1000 X76.3908 Y66.5841 Z-6.0000 S1000
G1 F1000 X76.6946 Y67.2264 Z-6.0000 S1000
G1 F1000 X76.9343 Y67.8965 Z-6.0000 S1000
G1 F1000 X77.1072 Y68.5865 Z-6.0000 S1000
G1 F1000 X77.2114 Y69.2893 Z-6.0000 S1000
G1 F1000 X77.2464 Y70.0000 Z-6.0000 S1000
G1 F1000 X77.2114 Y70.7107 Z-6.0000 S1000
G1 F1000 X77.1072 Y71.4135 Z-6.0000 S1000
G1 F1000 X76.9343 Y72.1035 Z-6.0000 S1000
G1 F1000 X76.6946 Y72.7736 Z-6.0000 S1000
G1 F1000 X76.3908 Y73.4159 Z-6.0000 S1000
G1 F1000 X76.0253 Y74.0257 Z-6.0000 S1000
G1 F1000 X75.6016 Y74.5970 Z-6.0000 S1000
G1 F1000 X75.1240 Y75.1240 Z-6.0000 S1000
G1 F1000 X74.5970 Y75.6016 Z-6.0000 S1000
G1 F1000 X74.0257 Y76.0253 Z-6.0000 S1000
G1 F1000 X73.4159 Y76.3908 Z-6.0000 S1000
G1 F1000 X72.7736 Y76.6946 Z-6.0000 S1000
G1 F1000 X72.1031 Y76.9345 Z-6.0000 S1000
G1 F1000 X71.4143 Y77.1071 Z-6.0000 S1000
G1 F1000 X70.7103 Y77.2114 Z-6.0000 S1000
G1 F1000 X70.0000 Y77.2464 Z-6.0000 S1000
G1 F1000 X69.2897 Y77.2114 Z-6.0000 S1000
G1 F1000 X68.5857 Y77.1071 Z-6.0000 S1000
G1 F1000 X67.8969 Y76.9345 Z-6.0000 S1000
G1 F1000 X67.2264 Y76.6946 Z-6.0000 S1000
G1 F1000 X66.5841 Y76.3908 Z-6.0000 S1000
G1 F1000 X65.9743 Y76.0253 Z-6.0000 S1000
G1 F1000 X65.4030 Y75.6016 Z-6.0000 S1000
G1 F1000 X64.8760 Y75.1240 Z-6.0000 S1000
G1 F1000 X64.3984 Y74.5970 Z-6.0000 S1000
G1 F1000 X63.9747 Y74.0257 Z-6.0000 S1000
G1 F1000 X63.6092 Y73.4159 Z-6.0000 S1000
G1 F1000 X63.3054 Y72.7736 Z-6.0000 S1000
G1 F1000 X63.0657 Y72.1035 Z-6.0000 S1000
G1 F1000 X62.8928 Y71.4135 Z-6.0000 S1000
G1 F1000 X62.7886 Y70.7107 Z-6.0000 S1000
G1 F1000 X62.7536 Y70.0000 Z-6.0000 S1000
G1 F1000 X62.7886 Y69.2893 Z-6.0000 S1000
G1 F1000 X62.8928 Y68.5865 Z-6.0000 S1000
G1 F1000 X63.0657 Y67.8965 Z-6.0000 S1000
G1 F1000 X63.3054 Y67.2264 Z-6.0000 S1000
G1 F1000 X63.6092 Y66.5841 Z-6.0000 S1000
G1 F1000 X63.9747 Y65.9743 Z-6.0000 S1000
G1 F1000 X64.3984 Y65.4030 Z-6.0000 S1000
G1 F1000 X64.8760 Y64.8760 Z-6.0000 S1000
G1 F1000 X65.4030 Y64.3984 Z-6.0000 S1000
G1 F1000 X65.9743 Y63.9747 Z-6.0000 S1000
G1 F1000 X66.5841 Y63.6092 Z-6.0000 S1000
G1 F1000 X67.2264 Y63.3054 Z-6.0000 S1000
G1 F1000 X67.8965 Y63.0657 Z-6.0000 S1000
G1 F1000 X68.5865 Y62.8928 Z-6.0000 S1000
G1 F1000 X69.2893 Y62.7886 Z-6.0000 S1000
G1 F1000 X70.0000 Y62.7536 Z-6.0000 S1000
G1 F1000 X70.7107 Y62.7886 Z-6.0000 S1000
; Starting inflateGrp: Closed?:true
G1 F300 Z-9.0000
G1 F1000 X71.4135 Y62.8928 Z-9.0000 S1000
G1 F1000 X72.1035 Y63.0657 Z-9.0000 S1000
G1 F1000 X72.7736 Y63.3054 Z-9.0000 S1000
G1 F1000 X73.4159 Y63.6092 Z-9.0000 S1000
G1 F1000 X74.0257 Y63.9747 Z-9.0000 S1000
G1 F1000 X74.5970 Y64.3984 Z-9.0000 S1000
G1 F1000 X75.1240 Y64.8760 Z-9.0000 S1000
G1 F1000 X75.6016 Y65.4030 Z-9.0000 S1000
G1 F1000 X76.0253 Y65.9743 Z-9.0000 S1000
G1 F1000 X76.3908 Y66.5841 Z-9.0000 S1000
G1 F1000 X76.6946 Y67.2264 Z-9.0000 S1000
G1 F1000 X76.9343 Y67.8965 Z-9.0000 S1000
G1 F1000 X77.1072 Y68.5865 Z-9.0000 S1000
G1 F1000 X77.2114 Y69.2893 Z-9.0000 S1000
G1 F1000 X77.2464 Y70.0000 Z-9.0000 S1000
G1 F1000 X77.2114 Y70.7107 Z-9.0000 S1000
G1 F1000 X77.1072 Y71.4135 Z-9.0000 S1000
G1 F1000 X76.9343 Y72.1035 Z-9.0000 S1000
G1 F1000 X76.6946 Y72.7736 Z-9.0000 S1000
G1 F1000 X76.3908 Y73.4159 Z-9.0000 S1000
G1 F1000 X76.0253 Y74.0257 Z-9.0000 S1000
G1 F1000 X75.6016 Y74.5970 Z-9.0000 S1000
G1 F1000 X75.1240 Y75.1240 Z-9.0000 S1000
G1 F1000 X74.5970 Y75.6016 Z-9.0000 S1000
G1 F1000 X74.0257 Y76.0253 Z-9.0000 S1000
G1 F1000 X73.4159 Y76.3908 Z-9.0000 S1000
G1 F1000 X72.7736 Y76.6946 Z-9.0000 S1000
G1 F1000 X72.1031 Y76.9345 Z-9.0000 S1000
G1 F1000 X71.4143 Y77.1071 Z-9.0000 S1000
G1 F1000 X70.7103 Y77.2114 Z-9.0000 S1000
G1 F1000 X70.0000 Y77.2464 Z-9.0000 S1000
G1 F1000 X69.2897 Y77.2114 Z-9.0000 S1000
G1 F1000 X68.5857 Y77.1071 Z-9.0000 S1000
G1 F1000 X67.8969 Y76.9345 Z-9.0000 S1000
G1 F1000 X67.2264 Y76.6946 Z-9.0000 S1000
G1 F1000 X66.5841 Y76.3908 Z-9.0000 S1000
G1 F1000 X65.9743 Y76.0253 Z-9.0000 S1000
G1 F1000 X65.4030 Y75.6016 Z-9.0000 S1000
G1 F1000 X64.8760 Y75.1240 Z-9.0000 S1000
G1 F1000 X64.3984 Y74.5970 Z-9.0000 S1000
G1 F1000 X63.9747 Y74.0257 Z-9.0000 S1000
G1 F1000 X63.6092 Y73.4159 Z-9.0000 S1000
G1 F1000 X63.3054 Y72.7736 Z-9.0000 S1000
G1 F1000 X63.0657 Y72.1035 Z-9.0000 S1000
G1 F1000 X62.8928 Y71.4135 Z-9.0000 S1000
G1 F1000 X62.7886 Y70.7107 Z-9.0000 S1000
G1 F1000 X62.7536 Y70.0000 Z-9.0000 S1000
G1 F1000 X62.7886 Y69.2893 Z-9.0000 S1000
G1 F1000 X62.8928 Y68.5865 Z-9.0000 S1000
G1 F1000 X63.0657 Y67.8965 Z-9.0000 S1000
G1 F1000 X63.3054 Y67.2264 Z-9.0000 S1000
G1 F1000 X63.6092 Y66.5841 Z-9.0000 S1000
G1 F1000 X63.9747 Y65.9743 Z-9.0000 S1000
G1 F1000 X64.3984 Y65.4030 Z-9.0000 S1000
G1 F1000 X64.8760 Y64.8760 Z-9.0000 S1000
G1 F1000 X65.4030 Y64.3984 Z-9.0000 S1000
G1 F1000 X65.9743 Y63.9747 Z-9.0000 S1000
G1 F1000 X66.5841 Y63.6092 Z-9.0000 S1000
G1 F1000 X67.2264 Y63.3054 Z-9.0000 S1000
G1 F1000 X67.8965 Y63.0657 Z-9.0000 S1000
G1 F1000 X68.5865 Y62.8928 Z-9.0000 S1000
G1 F1000 X69.2893 Y62.7886 Z-9.0000 S1000
G1 F1000 X70.0000 Y62.7536 Z-9.0000 S1000
G1 F1000 X70.7107 Y62.7886 Z-9.0000 S1000
; Starting inflateGrp: Closed?:true
G1 F300 Z-12.0000
G1 F1000 X71.4135 Y62.8928 Z-12.0000 S1000
G1 F1000 X72.1035 Y63.0657 Z-12.0000 S1000
G1 F1000 X72.7736 Y63.3054 Z-12.0000 S1000
G1 F1000 X73.4159 Y63.6092 Z-12.0000 S1000
G1 F1000 X74.0257 Y63.9747 Z-12.0000 S1000
G1 F1000 X74.5970 Y64.3984 Z-12.0000 S1000
G1 F1000 X75.1240 Y64.8760 Z-12.0000 S1000
G1 F1000 X75.6016 Y65.4030 Z-12.0000 S1000
G1 F1000 X76.0253 Y65.9743 Z-12.0000 S1000
G1 F1000 X76.3908 Y66.5841 Z-12.0000 S1000
G1 F1000 X76.6946 Y67.2264 Z-12.0000 S1000
G1 F1000 X76.9343 Y67.8965 Z-12.0000 S1000
G1 F1000 X77.1072 Y68.5865 Z-12.0000 S1000
G1 F1000 X77.2114 Y69.2893 Z-12.0000 S1000
G1 F1000 X77.2464 Y70.0000 Z-12.0000 S1000
G1 F1000 X77.2114 Y70.7107 Z-12.0000 S1000
G1 F1000 X77.1072 Y71.4135 Z-12.0000 S1000
G1 F1000 X76.9343 Y72.1035 Z-12.0000 S1000
G1 F1000 X76.6946 Y72.7736 Z-12.0000 S1000
G1 F1000 X76.3908 Y73.4159 Z-12.0000 S1000
G1 F1000 X76.0253 Y74.0257 Z-12.0000 S1000
G1 F1000 X75.6016 Y74.5970 Z-12.0000 S1000
G1 F1000 X75.1240 Y75.1240 Z-12.0000 S1000
G1 F1000 X74.5970 Y75.6016 Z-12.0000 S1000
G1 F1000 X74.0257 Y76.0253 Z-12.0000 S1000
G1 F1000 X73.4159 Y76.3908 Z-12.0000 S1000
G1 F1000 X72.7736 Y76.6946 Z-12.0000 S1000
G1 F1000 X72.1031 Y76.9345 Z-12.0000 S1000
G1 F1000 X71.4143 Y77.1071 Z-12.0000 S1000
G1 F1000 X70.7103 Y77.2114 Z-12.0000 S1000
G1 F1000 X70.0000 Y77.2464 Z-12.0000 S1000
G1 F1000 X69.2897 Y77.2114 Z-12.0000 S1000
G1 F1000 X68.5857 Y77.1071 Z-12.0000 S1000
G1 F1000 X67.8969 Y76.9345 Z-12.0000 S1000
G1 F1000 X67.2264 Y76.6946 Z-12.0000 S1000
G1 F1000 X66.5841 Y76.3908 Z-12.0000 S1000
G1 F1000 X65.9743 Y76.0253 Z-12.0000 S1000
G1 F1000 X65.4030 Y75.6016 Z-12.0000 S1000
G1 F1000 X64.8760 Y75.1240 Z-12.0000 S1000
G1 F1000 X64.3984 Y74.5970 Z-12.0000 S1000
G1 F1000 X63.9747 Y74.0257 Z-12.0000 S1000
G1 F1000 X63.6092 Y73.4159 Z-12.0000 S1000
G1 F1000 X63.3054 Y72.7736 Z-12.0000 S1000
G1 F1000 X63.0657 Y72.1035 Z-12.0000 S1000
G1 F1000 X62.8928 Y71.4135 Z-12.0000 S1000
G1 F1000 X62.7886 Y70.7107 Z-12.0000 S1000
G1 F1000 X62.7536 Y70.0000 Z-12.0000 S1000
G1 F1000 X62.7886 Y69.2893 Z-12.0000 S1000
G1 F1000 X62.8928 Y68.5865 Z-12.0000 S1000
G1 F1000 X63.0657 Y67.8965 Z-12.0000 S1000
G1 F1000 X63.3054 Y67.2264 Z-12.0000 S1000
G1 F1000 X63.6092 Y66.5841 Z-12.0000 S1000
G1 F1000 X63.9747 Y65.9743 Z-12.0000 S1000
G1 F1000 X64.3984 Y65.4030 Z-12.0000 S1000
G1 F1000 X64.8760 Y64.8760 Z-12.0000 S1000
G1 F1000 X65.4030 Y64.3984 Z-12.0000 S1000
G1 F1000 X65.9743 Y63.9747 Z-12.0000 S1000
G1 F1000 X66.5841 Y63.6092 Z-12.0000 S1000
G1 F1000 X67.2264 Y63.3054 Z-12.0000 S1000
G1 F1000 X67.8965 Y63.0657 Z-12.0000 S1000
G1 F1000 X68.5865 Y62.8928 Z-12.0000 S1000
G1 F1000 X69.2893 Y62.7886 Z-12.0000 S1000
G1 F1000 X70.0000 Y62.7536 Z-12.0000 S1000
G1 F1000 X70.7107 Y62.7886 Z-12.0000 S1000
; Starting inflateGrp: Closed?:true
G1 F300 Z-15.0000
G1 F1000 X71.4135 Y62.8928 Z-15.0000 S1000
G1 F1000 X72.1035 Y63.0657 Z-15.0000 S1000
G1 F1000 X72.7736 Y63.3054 Z-15.0000 S1000
G1 F1000 X73.4159 Y63.6092 Z-15.0000 S1000
G1 F1000 X74.0257 Y63.9747 Z-15.0000 S1000
G1 F1000 X74.5970 Y64.3984 Z-15.0000 S1000
G1 F1000 X75.1240 Y64.8760 Z-15.0000 S1000
G1 F1000 X75.6016 Y65.4030 Z-15.0000 S1000
G1 F1000 X76.0253 Y65.9743 Z-15.0000 S1000
G1 F1000 X76.3908 Y66.5841 Z-15.0000 S1000
G1 F1000 X76.6946 Y67.2264 Z-15.0000 S1000
G1 F1000 X76.9343 Y67.8965 Z-15.0000 S1000
G1 F1000 X77.1072 Y68.5865 Z-15.0000 S1000
G1 F1000 X77.2114 Y69.2893 Z-15.0000 S1000
G1 F1000 X77.2464 Y70.0000 Z-15.0000 S1000
G1 F1000 X77.2114 Y70.7107 Z-15.0000 S1000
G1 F1000 X77.1072 Y71.4135 Z-15.0000 S1000
G1 F1000 X76.9343 Y72.1035 Z-15.0000 S1000
G1 F1000 X76.6946 Y72.7736 Z-15.0000 S1000
G1 F1000 X76.3908 Y73.4159 Z-15.0000 S1000
G1 F1000 X76.0253 Y74.0257 Z-15.0000 S1000
G1 F1000 X75.6016 Y74.5970 Z-15.0000 S1000
G1 F1000 X75.1240 Y75.1240 Z-15.0000 S1000
G1 F1000 X74.5970 Y75.6016 Z-15.0000 S1000
G1 F1000 X74.0257 Y76.0253 Z-15.0000 S1000
G1 F1000 X73.4159 Y76.3908 Z-15.0000 S1000
G1 F1000 X72.7736 Y76.6946 Z-15.0000 S1000
G1 F1000 X72.1031 Y76.9345 Z-15.0000 S1000
G1 F1000 X71.4143 Y77.1071 Z-15.0000 S1000
G1 F1000 X70.7103 Y77.2114 Z-15.0000 S1000
G1 F1000 X70.0000 Y77.2464 Z-15.0000 S1000
G1 F1000 X69.2897 Y77.2114 Z-15.0000 S1000
G1 F1000 X68.5857 Y77.1071 Z-15.0000 S1000
G1 F1000 X67.8969 Y76.9345 Z-15.0000 S1000
G1 F1000 X67.2264 Y76.6946 Z-15.0000 S1000
G1 F1000 X66.5841 Y76.3908 Z-15.0000 S1000
G1 F1000 X65.9743 Y76.0253 Z-15.0000 S1000
G1 F1000 X65.4030 Y75.6016 Z-15.0000 S1000
G1 F1000 X64.8760 Y75.1240 Z-15.0000 S1000
G1 F1000 X64.3984 Y74.5970 Z-15.0000 S1000
G1 F1000 X63.9747 Y74.0257 Z-15.0000 S1000
G1 F1000 X63.6092 Y73.4159 Z-15.0000 S1000
G1 F1000 X63.3054 Y72.7736 Z-15.0000 S1000
G1 F1000 X63.0657 Y72.1035 Z-15.0000 S1000
G1 F1000 X62.8928 Y71.4135 Z-15.0000 S1000
G1 F1000 X62.7886 Y70.7107 Z-15.0000 S1000
G1 F1000 X62.7536 Y70.0000 Z-15.0000 S1000
G1 F1000 X62.7886 Y69.2893 Z-15.0000 S1000
G1 F1000 X62.8928 Y68.5865 Z-15.0000 S1000
G1 F1000 X63.0657 Y67.8965 Z-15.0000 S1000
G1 F1000 X63.3054 Y67.2264 Z-15.0000 S1000
G1 F1000 X63.6092 Y66.5841 Z-15.0000 S1000
G1 F1000 X63.9747 Y65.9743 Z-15.0000 S1000
G1 F1000 X64.3984 Y65.4030 Z-15.0000 S1000
G1 F1000 X64.8760 Y64.8760 Z-15.0000 S1000
G1 F1000 X65.4030 Y64.3984 Z-15.0000 S1000
G1 F1000 X65.9743 Y63.9747 Z-15.0000 S1000
G1 F1000 X66.5841 Y63.6092 Z-15.0000 S1000
G1 F1000 X67.2264 Y63.3054 Z-15.0000 S1000
G1 F1000 X67.8965 Y63.0657 Z-15.0000 S1000
G1 F1000 X68.5865 Y62.8928 Z-15.0000 S1000
G1 F1000 X69.2893 Y62.7886 Z-15.0000 S1000
G1 F1000 X70.0000 Y62.7536 Z-15.0000 S1000
G1 F1000 X70.7107 Y62.7886 Z-15.0000 S1000
; Starting inflateGrp: Closed?:true
G1 F300 Z-18.0000
G1 F1000 X71.4135 Y62.8928 Z-18.0000 S1000
G1 F1000 X72.1035 Y63.0657 Z-18.0000 S1000
G1 F1000 X72.7736 Y63.3054 Z-18.0000 S1000
G1 F1000 X73.4159 Y63.6092 Z-18.0000 S1000
G1 F1000 X74.0257 Y63.9747 Z-18.0000 S1000
G1 F1000 X74.5970 Y64.3984 Z-18.0000 S1000
G1 F1000 X75.1240 Y64.8760 Z-18.0000 S1000
G1 F1000 X75.6016 Y65.4030 Z-18.0000 S1000
G1 F1000 X76.0253 Y65.9743 Z-18.0000 S1000
G1 F1000 X76.3908 Y66.5841 Z-18.0000 S1000
G1 F1000 X76.6946 Y67.2264 Z-18.0000 S1000
G1 F1000 X76.9343 Y67.8965 Z-18.0000 S1000
G1 F1000 X77.1072 Y68.5865 Z-18.0000 S1000
G1 F1000 X77.2114 Y69.2893 Z-18.0000 S1000
G1 F1000 X77.2464 Y70.0000 Z-18.0000 S1000
G1 F1000 X77.2114 Y70.7107 Z-18.0000 S1000
G1 F1000 X77.1072 Y71.4135 Z-18.0000 S1000
G1 F1000 X76.9343 Y72.1035 Z-18.0000 S1000
G1 F1000 X76.6946 Y72.7736 Z-18.0000 S1000
G1 F1000 X76.3908 Y73.4159 Z-18.0000 S1000
G1 F1000 X76.0253 Y74.0257 Z-18.0000 S1000
G1 F1000 X75.6016 Y74.5970 Z-18.0000 S1000
G1 F1000 X75.1240 Y75.1240 Z-18.0000 S1000
G1 F1000 X74.5970 Y75.6016 Z-18.0000 S1000
G1 F1000 X74.0257 Y76.0253 Z-18.0000 S1000
G1 F1000 X73.4159 Y76.3908 Z-18.0000 S1000
G1 F1000 X72.7736 Y76.6946 Z-18.0000 S1000
G1 F1000 X72.1031 Y76.9345 Z-18.0000 S1000
G1 F1000 X71.4143 Y77.1071 Z-18.0000 S1000
G1 F1000 X70.7103 Y77.2114 Z-18.0000 S1000
G1 F1000 X70.0000 Y77.2464 Z-18.0000 S1000
G1 F1000 X69.2897 Y77.2114 Z-18.0000 S1000
G1 F1000 X68.5857 Y77.1071 Z-18.0000 S1000
G1 F1000 X67.8969 Y76.9345 Z-18.0000 S1000
G1 F1000 X67.2264 Y76.6946 Z-18.0000 S1000
G1 F1000 X66.5841 Y76.3908 Z-18.0000 S1000
G1 F1000 X65.9743 Y76.0253 Z-18.0000 S1000
G1 F1000 X65.4030 Y75.6016 Z-18.0000 S1000
G1 F1000 X64.8760 Y75.1240 Z-18.0000 S1000
G1 F1000 X64.3984 Y74.5970 Z-18.0000 S1000
G1 F1000 X63.9747 Y74.0257 Z-18.0000 S1000
G1 F1000 X63.6092 Y73.4159 Z-18.0000 S1000
G1 F1000 X63.3054 Y72.7736 Z-18.0000 S1000
G1 F1000 X63.0657 Y72.1035 Z-18.0000 S1000
G1 F1000 X62.8928 Y71.4135 Z-18.0000 S1000
G1 F1000 X62.7886 Y70.7107 Z-18.0000 S1000
G1 F1000 X62.7536 Y70.0000 Z-18.0000 S1000
G1 F1000 X62.7886 Y69.2893 Z-18.0000 S1000
G1 F1000 X62.8928 Y68.5865 Z-18.0000 S1000
G1 F1000 X63.0657 Y67.8965 Z-18.0000 S1000
G1 F1000 X63.3054 Y67.2264 Z-18.0000 S1000
G1 F1000 X63.6092 Y66.5841 Z-18.0000 S1000
G1 F1000 X63.9747 Y65.9743 Z-18.0000 S1000
G1 F1000 X64.3984 Y65.4030 Z-18.0000 S1000
G1 F1000 X64.8760 Y64.8760 Z-18.0000 S1000
G1 F1000 X65.4030 Y64.3984 Z-18.0000 S1000
G1 F1000 X65.9743 Y63.9747 Z-18.0000 S1000
G1 F1000 X66.5841 Y63.6092 Z-18.0000 S1000
G1 F1000 X67.2264 Y63.3054 Z-18.0000 S1000
G1 F1000 X67.8965 Y63.0657 Z-18.0000 S1000
G1 F1000 X68.5865 Y62.8928 Z-18.0000 S1000
G1 F1000 X69.2893 Y62.7886 Z-18.0000 S1000
G1 F1000 X70.0000 Y62.7536 Z-18.0000 S1000
G1 F1000 X70.7107 Y62.7886 Z-18.0000 S1000
; Starting inflateGrp: Closed?:true
G1 F300 Z-19.2000
G1 F1000 X71.4135 Y62.8928 Z-19.2000 S1000
G1 F1000 X72.1035 Y63.0657 Z-19.2000 S1000
G1 F1000 X72.7736 Y63.3054 Z-19.2000 S1000
G1 F1000 X73.4159 Y63.6092 Z-19.2000 S1000
G1 F1000 X74.0257 Y63.9747 Z-19.2000 S1000
G1 F1000 X74.5970 Y64.3984 Z-19.2000 S1000
G1 F1000 X75.1240 Y64.8760 Z-19.2000 S1000
G1 F1000 X75.6016 Y65.4030 Z-19.2000 S1000
G1 F1000 X76.0253 Y65.9743 Z-19.2000 S1000
G1 F1000 X76.3908 Y66.5841 Z-19.2000 S1000
G1 F1000 X76.6946 Y67.2264 Z-19.2000 S1000
G1 F1000 X76.9343 Y67.8965 Z-19.2000 S1000
G1 F1000 X77.1072 Y68.5865 Z-19.2000 S1000
G1 F1000 X77.2114 Y69.2893 Z-19.2000 S1000
G1 F1000 X77.2464 Y70.0000 Z-19.2000 S1000
G1 F1000 X77.2114 Y70.7107 Z-19.2000 S1000
G1 F1000 X77.1072 Y71.4135 Z-19.2000 S1000
G1 F1000 X76.9343 Y72.1035 Z-19.2000 S1000
G1 F1000 X76.6946 Y72.7736 Z-19.2000 S1000
G1 F1000 X76.3908 Y73.4159 Z-19.2000 S1000
G1 F1000 X76.0253 Y74.0257 Z-19.2000 S1000
G1 F1000 X75.6016 Y74.5970 Z-19.2000 S1000
G1 F1000 X75.1240 Y75.1240 Z-19.2000 S1000
G1 F1000 X74.5970 Y75.6016 Z-19.2000 S1000
G1 F1000 X74.0257 Y76.0253 Z-19.2000 S1000
G1 F1000 X73.4159 Y76.3908 Z-19.2000 S1000
G1 F1000 X72.7736 Y76.6946 Z-19.2000 S1000
G1 F1000 X72.1031 Y76.9345 Z-19.2000 S1000
G1 F1000 X71.4143 Y77.1071 Z-19.2000 S1000
G1 F1000 X70.7103 Y77.2114 Z-19.2000 S1000
G1 F1000 X70.0000 Y77.2464 Z-19.2000 S1000
G1 F1000 X69.2897 Y77.2114 Z-19.2000 S1000
G1 F1000 X68.5857 Y77.1071 Z-19.2000 S1000
G1 F1000 X67.8969 Y76.9345 Z-19.2000 S1000
G1 F1000 X67.2264 Y76.6946 Z-19.2000 S1000
G1 F1000 X66.5841 Y76.3908 Z-19.2000 S1000
G1 F1000 X65.9743 Y76.0253 Z-19.2000 S1000
G1 F1000 X65.4030 Y75.6016 Z-19.2000 S1000
G1 F1000 X64.8760 Y75.1240 Z-19.2000 S1000
G1 F1000 X64.3984 Y74.5970 Z-19.2000 S1000
G1 F1000 X63.9747 Y74.0257 Z-19.2000 S1000
G1 F1000 X63.6092 Y73.4159 Z-19.2000 S1000
G1 F1000 X63.3054 Y72.7736 Z-19.2000 S1000
G1 F1000 X63.0657 Y72.1035 Z-19.2000 S1000
G1 F1000 X62.8928 Y71.4135 Z-19.2000 S1000
G1 F1000 X62.7886 Y70.7107 Z-19.2000 S1000
G1 F1000 X62.7536 Y70.0000 Z-19.2000 S1000
G1 F1000 X62.7886 Y69.2893 Z-19.2000 S1000
G1 F1000 X62.8928 Y68.5865 Z-19.2000 S1000
G1 F1000 X63.0657 Y67.8965 Z-19.2000 S1000
G1 F1000 X63.3054 Y67.2264 Z-19.2000 S1000
G1 F1000 X63.6092 Y66.5841 Z-19.2000 S1000
G1 F1000 X63.9747 Y65.9743 Z-19.2000 S1000
G1 F1000 X64.3984 Y65.4030 Z-19.2000 S1000
G1 F1000 X64.8760 Y64.8760 Z-19.2000 S1000
G1 F1000 X65.4030 Y64.3984 Z-19.2000 S1000
G1 F1000 X65.9743 Y63.9747 Z-19.2000 S1000
G1 F1000 X66.5841 Y63.6092 Z-19.2000 S1000
G1 F1000 X67.2264 Y63.3054 Z-19.2000 S1000
G1 F1000 X67.8965 Y63.0657 Z-19.2000 S1000
G1 F1000 X68.5865 Y62.8928 Z-19.2000 S1000
G1 F1000 X69.2893 Y62.7886 Z-19.2000 S1000
G1 F1000 X70.0000 Y62.7536 Z-19.2000 S1000
G1 F1000 X70.7107 Y62.7886 Z-19.2000 S1000
; retracting back to z-safe
G0 Z10
; Operation 2: CNC: Vector (path outside)
; Tool Diameter: 6
; Starting inflateGrp: Closed?:true

G0 Z10
G0 F1000 X140.0000 Y-3.0000

G0 Z0
G1 F300 Z-3.0000
G1 F1000 X0.0000 Y-3.0000 Z-3.0000 S1000
G1 F1000 X-0.5500 Y-2.9491 Z-3.0000 S1000
G1 F1000 X-1.2108 Y-2.7448 Z-3.0000 S1000
G1 F1000 X-1.8072 Y-2.3946 Z-3.0000 S1000
G1 F1000 X-2.3076 Y-1.9170 Z-3.0000 S1000
G1 F1000 X-2.6853 Y-1.3376 Z-3.0000 S1000
G1 F1000 X-2.9203 Y-0.6871 Z-3.0000 S1000
G1 F1000 X-3.0000 Y0.0000 Z-3.0000 S1000
G1 F1000 X-3.0000 Y140.0000 Z-3.0000 S1000
G1 F1000 X-2.9491 Y140.5500 Z-3.0000 S1000
G1 F1000 X-2.7448 Y141.2108 Z-3.0000 S1000
G1 F1000 X-2.3946 Y141.8072 Z-3.0000 S1000
G1 F1000 X-1.9170 Y142.3076 Z-3.0000 S1000
G1 F1000 X-1.3376 Y142.6853 Z-3.0000 S1000
G1 F1000 X-0.6871 Y142.9203 Z-3.0000 S1000
G1 F1000 X0.0000 Y143.0000 Z-3.0000 S1000
G1 F1000 X140.0000 Y143.0000 Z-3.0000 S1000
G1 F1000 X140.5500 Y142.9491 Z-3.0000 S1000
G1 F1000 X141.2108 Y142.7448 Z-3.0000 S1000
G1 F1000 X141.8072 Y142.3946 Z-3.0000 S1000
G1 F1000 X142.3076 Y141.9170 Z-3.0000 S1000
G1 F1000 X142.6853 Y141.3376 Z-3.0000 S1000
G1 F1000 X142.9203 Y140.6871 Z-3.0000 S1000
G1 F1000 X143.0000 Y140.0000 Z-3.0000 S1000
G1 F1000 X143.0000 Y0.0000 Z-3.0000 S1000
G1 F1000 X142.9491 Y-0.5500 Z-3.0000 S1000
G1 F1000 X142.7448 Y-1.2108 Z-3.0000 S1000
G1 F1000 X142.3946 Y-1.8072 Z-3.0000 S1000
G1 F1000 X141.9170 Y-2.3076 Z-3.0000 S1000
G1 F1000 X141.3376 Y-2.6853 Z-3.0000 S1000
G1 F1000 X140.6871 Y-2.9203 Z-3.0000 S1000
G1 F1000 X140.0000 Y-3.0000 Z-3.0000 S1000
; Starting inflateGrp: Closed?:true
G1 F300 Z-6.0000
G1 F1000 X0.0000 Y-3.0000 Z-6.0000 S1000
G1 F1000 X-0.5500 Y-2.9491 Z-6.0000 S1000
G1 F1000 X-1.2108 Y-2.7448 Z-6.0000 S1000
G1 F1000 X-1.8072 Y-2.3946 Z-6.0000 S1000
G1 F1000 X-2.3076 Y-1.9170 Z-6.0000 S1000
G1 F1000 X-2.6853 Y-1.3376 Z-6.0000 S1000
G1 F1000 X-2.9203 Y-0.6871 Z-6.0000 S1000
G1 F1000 X-3.0000 Y0.0000 Z-6.0000 S1000
G1 F1000 X-3.0000 Y140.0000 Z-6.0000 S1000
G1 F1000 X-2.9491 Y140.5500 Z-6.0000 S1000
G1 F1000 X-2.7448 Y141.2108 Z-6.0000 S1000
G1 F1000 X-2.3946 Y141.8072 Z-6.0000 S1000
G1 F1000 X-1.9170 Y142.3076 Z-6.0000 S1000
G1 F1000 X-1.3376 Y142.6853 Z-6.0000 S1000
G1 F1000 X-0.6871 Y142.9203 Z-6.0000 S1000
G1 F1000 X0.0000 Y143.0000 Z-6.0000 S1000
G1 F1000 X140.0000 Y143.0000 Z-6.0000 S1000
G1 F1000 X140.5500 Y142.9491 Z-6.0000 S1000
G1 F1000 X141.2108 Y142.7448 Z-6.0000 S1000
G1 F1000 X141.8072 Y142.3946 Z-6.0000 S1000
G1 F1000 X142.3076 Y141.9170 Z-6.0000 S1000
G1 F1000 X142.6853 Y141.3376 Z-6.0000 S1000
G1 F1000 X142.9203 Y140.6871 Z-6.0000 S1000
G1 F1000 X143.0000 Y140.0000 Z-6.0000 S1000
G1 F1000 X143.0000 Y0.0000 Z-6.0000 S1000
G1 F1000 X142.9491 Y-0.5500 Z-6.0000 S1000
G1 F1000 X142.7448 Y-1.2108 Z-6.0000 S1000
G1 F1000 X142.3946 Y-1.8072 Z-6.0000 S1000
G1 F1000 X141.9170 Y-2.3076 Z-6.0000 S1000
G1 F1000 X141.3376 Y-2.6853 Z-6.0000 S1000
G1 F1000 X140.6871 Y-2.9203 Z-6.0000 S1000
G1 F1000 X140.0000 Y-3.0000 Z-6.0000 S1000
; Starting inflateGrp: Closed?:true
G1 F300 Z-9.0000
G1 F1000 X0.0000 Y-3.0000 Z-9.0000 S1000
G1 F1000 X-0.5500 Y-2.9491 Z-9.0000 S1000
G1 F1000 X-1.2108 Y-2.7448 Z-9.0000 S1000
G1 F1000 X-1.8072 Y-2.3946 Z-9.0000 S1000
G1 F1000 X-2.3076 Y-1.9170 Z-9.0000 S1000
G1 F1000 X-2.6853 Y-1.3376 Z-9.0000 S1000
G1 F1000 X-2.9203 Y-0.6871 Z-9.0000 S1000
G1 F1000 X-3.0000 Y0.0000 Z-9.0000 S1000
G1 F1000 X-3.0000 Y140.0000 Z-9.0000 S1000
G1 F1000 X-2.9491 Y140.5500 Z-9.0000 S1000
G1 F1000 X-2.7448 Y141.2108 Z-9.0000 S1000
G1 F1000 X-2.3946 Y141.8072 Z-9.0000 S1000
G1 F1000 X-1.9170 Y142.3076 Z-9.0000 S1000
G1 F1000 X-1.3376 Y142.6853 Z-9.0000 S1000
G1 F1000 X-0.6871 Y142.9203 Z-9.0000 S1000
G1 F1000 X0.0000 Y143.0000 Z-9.0000 S1000
G1 F1000 X140.0000 Y143.0000 Z-9.0000 S1000
G1 F1000 X140.5500 Y142.9491 Z-9.0000 S1000
G1 F1000 X141.2108 Y142.7448 Z-9.0000 S1000
G1 F1000 X141.8072 Y142.3946 Z-9.0000 S1000
G1 F1000 X142.3076 Y141.9170 Z-9.0000 S1000
G1 F1000 X142.6853 Y141.3376 Z-9.0000 S1000
G1 F1000 X142.9203 Y140.6871 Z-9.0000 S1000
G1 F1000 X143.0000 Y140.0000 Z-9.0000 S1000
G1 F1000 X143.0000 Y0.0000 Z-9.0000 S1000
G1 F1000 X142.9491 Y-0.5500 Z-9.0000 S1000
G1 F1000 X142.7448 Y-1.2108 Z-9.0000 S1000
G1 F1000 X142.3946 Y-1.8072 Z-9.0000 S1000
G1 F1000 X141.9170 Y-2.3076 Z-9.0000 S1000
G1 F1000 X141.3376 Y-2.6853 Z-9.0000 S1000
G1 F1000 X140.6871 Y-2.9203 Z-9.0000 S1000
G1 F1000 X140.0000 Y-3.0000 Z-9.0000 S1000
; Starting inflateGrp: Closed?:true
G1 F300 Z-12.0000
G1 F1000 X0.0000 Y-3.0000 Z-12.0000 S1000
G1 F1000 X-0.5500 Y-2.9491 Z-12.0000 S1000
G1 F1000 X-1.2108 Y-2.7448 Z-12.0000 S1000
G1 F1000 X-1.8072 Y-2.3946 Z-12.0000 S1000
G1 F1000 X-2.3076 Y-1.9170 Z-12.0000 S1000
G1 F1000 X-2.6853 Y-1.3376 Z-12.0000 S1000
G1 F1000 X-2.9203 Y-0.6871 Z-12.0000 S1000
G1 F1000 X-3.0000 Y0.0000 Z-12.0000 S1000
G1 F1000 X-3.0000 Y140.0000 Z-12.0000 S1000
G1 F1000 X-2.9491 Y140.5500 Z-12.0000 S1000
G1 F1000 X-2.7448 Y141.2108 Z-12.0000 S1000
G1 F1000 X-2.3946 Y141.8072 Z-12.0000 S1000
G1 F1000 X-1.9170 Y142.3076 Z-12.0000 S1000
G1 F1000 X-1.3376 Y142.6853 Z-12.0000 S1000
G1 F1000 X-0.6871 Y142.9203 Z-12.0000 S1000
G1 F1000 X0.0000 Y143.0000 Z-12.0000 S1000
G1 F1000 X140.0000 Y143.0000 Z-12.0000 S1000
G1 F1000 X140.5500 Y142.9491 Z-12.0000 S1000
G1 F1000 X141.2108 Y142.7448 Z-12.0000 S1000
G1 F1000 X141.8072 Y142.3946 Z-12.0000 S1000
G1 F1000 X142.3076 Y141.9170 Z-12.0000 S1000
G1 F1000 X142.6853 Y141.3376 Z-12.0000 S1000
G1 F1000 X142.9203 Y140.6871 Z-12.0000 S1000
G1 F1000 X143.0000 Y140.0000 Z-12.0000 S1000
G1 F1000 X143.0000 Y0.0000 Z-12.0000 S1000
G1 F1000 X142.9491 Y-0.5500 Z-12.0000 S1000
G1 F1000 X142.7448 Y-1.2108 Z-12.0000 S1000
G1 F1000 X142.3946 Y-1.8072 Z-12.0000 S1000
G1 F1000 X141.9170 Y-2.3076 Z-12.0000 S1000
G1 F1000 X141.3376 Y-2.6853 Z-12.0000 S1000
G1 F1000 X140.6871 Y-2.9203 Z-12.0000 S1000
G1 F1000 X140.0000 Y-3.0000 Z-12.0000 S1000
; Starting inflateGrp: Closed?:true
G1 F300 Z-15.0000
G1 F1000 X0.0000 Y-3.0000 Z-15.0000 S1000
G1 F1000 X-0.5500 Y-2.9491 Z-15.0000 S1000
G1 F1000 X-1.2108 Y-2.7448 Z-15.0000 S1000
G1 F1000 X-1.8072 Y-2.3946 Z-15.0000 S1000
G1 F1000 X-2.3076 Y-1.9170 Z-15.0000 S1000
G1 F1000 X-2.6853 Y-1.3376 Z-15.0000 S1000
G1 F1000 X-2.9203 Y-0.6871 Z-15.0000 S1000
G1 F1000 X-3.0000 Y0.0000 Z-15.0000 S1000
G1 F1000 X-3.0000 Y140.0000 Z-15.0000 S1000
G1 F1000 X-2.9491 Y140.5500 Z-15.0000 S1000
G1 F1000 X-2.7448 Y141.2108 Z-15.0000 S1000
G1 F1000 X-2.3946 Y141.8072 Z-15.0000 S1000
G1 F1000 X-1.9170 Y142.3076 Z-15.0000 S1000
G1 F1000 X-1.3376 Y142.6853 Z-15.0000 S1000
G1 F1000 X-0.6871 Y142.9203 Z-15.0000 S1000
G1 F1000 X0.0000 Y143.0000 Z-15.0000 S1000
G1 F1000 X140.0000 Y143.0000 Z-15.0000 S1000
G1 F1000 X140.5500 Y142.9491 Z-15.0000 S1000
G1 F1000 X141.2108 Y142.7448 Z-15.0000 S1000
G1 F1000 X141.8072 Y142.3946 Z-15.0000 S1000
G1 F1000 X142.3076 Y141.9170 Z-15.0000 S1000
G1 F1000 X142.6853 Y141.3376 Z-15.0000 S1000
G1 F1000 X142.9203 Y140.6871 Z-15.0000 S1000
G1 F1000 X143.0000 Y140.0000 Z-15.0000 S1000
G1 F1000 X143.0000 Y0.0000 Z-15.0000 S1000
G1 F1000 X142.9491 Y-0.5500 Z-15.0000 S1000
G1 F1000 X142.7448 Y-1.2108 Z-15.0000 S1000
G1 F1000 X142.3946 Y-1.8072 Z-15.0000 S1000
G1 F1000 X141.9170 Y-2.3076 Z-15.0000 S1000
G1 F1000 X141.3376 Y-2.6853 Z-15.0000 S1000
G1 F1000 X140.6871 Y-2.9203 Z-15.0000 S1000
G1 F1000 X140.0000 Y-3.0000 Z-15.0000 S1000
; Starting inflateGrp: Closed?:true
G1 F300 Z-18.0000
G1 F1000 X76.0000 Y-3.0000 Z-18.0000 S1000
G1 F1000 X76.0000 Y-3.0000 Z-16.2000 S1000
G1 F1000 X64.0000 Y-3.0000 Z-16.2000 S1000
G1 F1000 X64.0000 Y-3.0000 Z-18.0000 S1000
G1 F1000 X0.0000 Y-3.0000 Z-18.0000 S1000
G1 F1000 X0.0000 Y-3.0000 Z-18.0000 S1000
G1 F1000 X-0.5500 Y-2.9491 Z-18.0000 S1000
G1 F1000 X-1.2108 Y-2.7448 Z-18.0000 S1000
G1 F1000 X-1.8072 Y-2.3946 Z-18.0000 S1000
G1 F1000 X-2.3076 Y-1.9170 Z-18.0000 S1000
G1 F1000 X-2.6853 Y-1.3376 Z-18.0000 S1000
G1 F1000 X-2.9203 Y-0.6871 Z-18.0000 S1000
G1 F1000 X-3.0000 Y0.0000 Z-18.0000 S1000
G1 F1000 X-3.0000 Y140.0000 Z-18.0000 S1000
G1 F1000 X-2.9491 Y140.5500 Z-18.0000 S1000
G1 F1000 X-2.7448 Y141.2108 Z-18.0000 S1000
G1 F1000 X-2.3946 Y141.8072 Z-18.0000 S1000
G1 F1000 X-1.9170 Y142.3076 Z-18.0000 S1000
G1 F1000 X-1.3376 Y142.6853 Z-18.0000 S1000
G1 F1000 X-0.6871 Y142.9203 Z-18.0000 S1000
G1 F1000 X0.0000 Y143.0000 Z-18.0000 S1000
G1 F1000 X64.0000 Y143.0000 Z-18.0000 S1000
G1 F1000 X64.0000 Y143.0000 Z-16.2000 S1000
G1 F1000 X76.0000 Y143.0000 Z-16.2000 S1000
G1 F1000 X76.0000 Y143.0000 Z-18.0000 S1000
G1 F1000 X140.0000 Y143.0000 Z-18.0000 S1000
G1 F1000 X140.0000 Y143.0000 Z-18.0000 S1000
G1 F1000 X140.5500 Y142.9491 Z-18.0000 S1000
G1 F1000 X141.2108 Y142.7448 Z-18.0000 S1000
G1 F1000 X141.8072 Y142.3946 Z-18.0000 S1000
G1 F1000 X142.3076 Y141.9170 Z-18.0000 S1000
G1 F1000 X142.6853 Y141.3376 Z-18.0000 S1000
G1 F1000 X142.9203 Y140.6871 Z-18.0000 S1000
G1 F1000 X143.0000 Y140.0000 Z-18.0000 S1000
G1 F1000 X143.0000 Y0.0000 Z-18.0000 S1000
G1 F1000 X142.9491 Y-0.5500 Z-18.0000 S1000
G1 F1000 X142.7448 Y-1.2108 Z-18.0000 S1000
G1 F1000 X142.3946 Y-1.8072 Z-18.0000 S1000
G1 F1000 X141.9170 Y-2.3076 Z-18.0000 S1000
G1 F1000 X141.3376 Y-2.6853 Z-18.0000 S1000
G1 F1000 X140.6871 Y-2.9203 Z-18.0000 S1000
G1 F1000 X140.0000 Y-3.0000 Z-18.0000 S1000
; Starting inflateGrp: Closed?:true
G1 F300 Z-19.2000
G1 F1000 X76.0000 Y-3.0000 Z-19.2000 S1000
G1 F1000 X76.0000 Y-3.0000 Z-16.2000 S1000
G1 F1000 X64.0000 Y-3.0000 Z-16.2000 S1000
G1 F1000 X64.0000 Y-3.0000 Z-19.2000 S1000
G1 F1000 X0.0000 Y-3.0000 Z-19.2000 S1000
G1 F1000 X0.0000 Y-3.0000 Z-19.2000 S1000
G1 F1000 X-0.5500 Y-2.9491 Z-19.2000 S1000
G1 F1000 X-1.2108 Y-2.7448 Z-19.2000 S1000
G1 F1000 X-1.8072 Y-2.3946 Z-19.2000 S1000
G1 F1000 X-2.3076 Y-1.9170 Z-19.2000 S1000
G1 F1000 X-2.6853 Y-1.3376 Z-19.2000 S1000
G1 F1000 X-2.9203 Y-0.6871 Z-19.2000 S1000
G1 F1000 X-3.0000 Y0.0000 Z-19.2000 S1000
G1 F1000 X-3.0000 Y140.0000 Z-19.2000 S1000
G1 F1000 X-2.9491 Y140.5500 Z-19.2000 S1000
G1 F1000 X-2.7448 Y141.2108 Z-19.2000 S1000
G1 F1000 X-2.3946 Y141.8072 Z-19.2000 S1000
G1 F1000 X-1.9170 Y142.3076 Z-19.2000 S1000
G1 F1000 X-1.3376 Y142.6853 Z-19.2000 S1000
G1 F1000 X-0.6871 Y142.9203 Z-19.2000 S1000
G1 F1000 X0.0000 Y143.0000 Z-19.2000 S1000
G1 F1000 X64.0000 Y143.0000 Z-19.2000 S1000
G1 F1000 X64.0000 Y143.0000 Z-16.2000 S1000
G1 F1000 X76.0000 Y143.0000 Z-16.2000 S1000
G1 F1000 X76.0000 Y143.0000 Z-19.2000 S1000
G1 F1000 X140.0000 Y143.0000 Z-19.2000 S1000
G1 F1000 X140.0000 Y143.0000 Z-19.2000 S1000
G1 F1000 X140.5500 Y142.9491 Z-19.2000 S1000
G1 F1000 X141.2108 Y142.7448 Z-19.2000 S1000
G1 F1000 X141.8072 Y142.3946 Z-19.2000 S1000
G1 F1000 X142.3076 Y141.9170 Z-19.2000 S1000
G1 F1000 X142.6853 Y141.3376 Z-19.2000 S1000
G1 F1000 X142.9203 Y140.6871 Z-19.2000 S1000
G1 F1000 X143.0000 Y140.0000 Z-19.2000 S1000
G1 F1000 X143.0000 Y0.0000 Z-19.2000 S1000
G1 F1000 X142.9491 Y-0.5500 Z-19.2000 S1000
G1 F1000 X142.7448 Y-1.2108 Z-19.2000 S1000
G1 F1000 X142.3946 Y-1.8072 Z-19.2000 S1000
G1 F1000 X141.9170 Y-2.3076 Z-19.2000 S1000
G1 F1000 X141.3376 Y-2.6853 Z-19.2000 S1000
G1 F1000 X140.6871 Y-2.9203 Z-19.2000 S1000
G1 F1000 X140.0000 Y-3.0000 Z-19.2000 S1000
; retracting back to z-safe
G0 Z10

M5 S0; Spindle Off
