; GCODE Generated by cam.openbuilds.com on 2020-09-02 
G21 ; mm-mode
G54; Work Coordinates
G21; mm-mode
G90; Absolute Positioning
M3 S1000; Spindle On

; Operation 0: CNC: Vector (path inside)
; Tool Diameter: 3
; Starting inflateGrp: Closed?:true

G0 Z10
G0 F1000 X501.4099 Y460.0109

G0 Z0
G1 F300 Z-1.5000
G1 F1000 X501.7571 Y460.2429 Z-1.5000 S1000
G1 F1000 X501.9891 Y460.5901 Z-1.5000 S1000
G1 F1000 X502.0706 Y461.0000 Z-1.5000 S1000
G1 F1000 X501.9891 Y461.4099 Z-1.5000 S1000
G1 F1000 X501.7571 Y461.7571 Z-1.5000 S1000
G1 F1000 X501.4099 Y461.9891 Z-1.5000 S1000
G1 F1000 X501.0000 Y462.0706 Z-1.5000 S1000
G1 F1000 X500.5902 Y461.9891 Z-1.5000 S1000
G1 F1000 X500.2429 Y461.7570 Z-1.5000 S1000
G1 F1000 X500.0109 Y461.4099 Z-1.5000 S1000
G1 F1000 X499.9294 Y461.0000 Z-1.5000 S1000
G1 F1000 X500.0109 Y460.5901 Z-1.5000 S1000
G1 F1000 X500.2429 Y460.2430 Z-1.5000 S1000
G1 F1000 X500.5902 Y460.0109 Z-1.5000 S1000
G1 F1000 X501.0000 Y459.9294 Z-1.5000 S1000
G1 F1000 X501.4099 Y460.0109 Z-1.5000 S1000
; Starting inflateGrp: Closed?:true
G1 F300 Z-3.0000
G1 F1000 X501.7571 Y460.2429 Z-3.0000 S1000
G1 F1000 X501.9891 Y460.5901 Z-3.0000 S1000
G1 F1000 X502.0706 Y461.0000 Z-3.0000 S1000
G1 F1000 X501.9891 Y461.4099 Z-3.0000 S1000
G1 F1000 X501.7571 Y461.7571 Z-3.0000 S1000
G1 F1000 X501.4099 Y461.9891 Z-3.0000 S1000
G1 F1000 X501.0000 Y462.0706 Z-3.0000 S1000
G1 F1000 X500.5902 Y461.9891 Z-3.0000 S1000
G1 F1000 X500.2429 Y461.7570 Z-3.0000 S1000
G1 F1000 X500.0109 Y461.4099 Z-3.0000 S1000
G1 F1000 X499.9294 Y461.0000 Z-3.0000 S1000
G1 F1000 X500.0109 Y460.5901 Z-3.0000 S1000
G1 F1000 X500.2429 Y460.2430 Z-3.0000 S1000
G1 F1000 X500.5902 Y460.0109 Z-3.0000 S1000
G1 F1000 X501.0000 Y459.9294 Z-3.0000 S1000
G1 F1000 X501.4099 Y460.0109 Z-3.0000 S1000
; Starting inflateGrp: Closed?:true
G1 F300 Z-4.5000
G1 F1000 X501.7571 Y460.2429 Z-4.5000 S1000
G1 F1000 X501.9891 Y460.5901 Z-4.5000 S1000
G1 F1000 X502.0706 Y461.0000 Z-4.5000 S1000
G1 F1000 X501.9891 Y461.4099 Z-4.5000 S1000
G1 F1000 X501.7571 Y461.7571 Z-4.5000 S1000
G1 F1000 X501.4099 Y461.9891 Z-4.5000 S1000
G1 F1000 X501.0000 Y462.0706 Z-4.5000 S1000
G1 F1000 X500.5902 Y461.9891 Z-4.5000 S1000
G1 F1000 X500.2429 Y461.7570 Z-4.5000 S1000
G1 F1000 X500.0109 Y461.4099 Z-4.5000 S1000
G1 F1000 X499.9294 Y461.0000 Z-4.5000 S1000
G1 F1000 X500.0109 Y460.5901 Z-4.5000 S1000
G1 F1000 X500.2429 Y460.2430 Z-4.5000 S1000
G1 F1000 X500.5902 Y460.0109 Z-4.5000 S1000
G1 F1000 X501.0000 Y459.9294 Z-4.5000 S1000
G1 F1000 X501.4099 Y460.0109 Z-4.5000 S1000
; Starting inflateGrp: Closed?:true
G1 F300 Z-6.0000
G1 F1000 X501.7571 Y460.2429 Z-6.0000 S1000
G1 F1000 X501.9891 Y460.5901 Z-6.0000 S1000
G1 F1000 X502.0706 Y461.0000 Z-6.0000 S1000
G1 F1000 X501.9891 Y461.4099 Z-6.0000 S1000
G1 F1000 X501.7571 Y461.7571 Z-6.0000 S1000
G1 F1000 X501.4099 Y461.9891 Z-6.0000 S1000
G1 F1000 X501.0000 Y462.0706 Z-6.0000 S1000
G1 F1000 X500.5902 Y461.9891 Z-6.0000 S1000
G1 F1000 X500.2429 Y461.7570 Z-6.0000 S1000
G1 F1000 X500.0109 Y461.4099 Z-6.0000 S1000
G1 F1000 X499.9294 Y461.0000 Z-6.0000 S1000
G1 F1000 X500.0109 Y460.5901 Z-6.0000 S1000
G1 F1000 X500.2429 Y460.2430 Z-6.0000 S1000
G1 F1000 X500.5902 Y460.0109 Z-6.0000 S1000
G1 F1000 X501.0000 Y459.9294 Z-6.0000 S1000
G1 F1000 X501.4099 Y460.0109 Z-6.0000 S1000
; Starting inflateGrp: Closed?:true
G1 F300 Z-7.5000
G1 F1000 X501.7571 Y460.2429 Z-7.5000 S1000
G1 F1000 X501.9891 Y460.5901 Z-7.5000 S1000
G1 F1000 X502.0706 Y461.0000 Z-7.5000 S1000
G1 F1000 X501.9891 Y461.4099 Z-7.5000 S1000
G1 F1000 X501.7571 Y461.7571 Z-7.5000 S1000
G1 F1000 X501.4099 Y461.9891 Z-7.5000 S1000
G1 F1000 X501.0000 Y462.0706 Z-7.5000 S1000
G1 F1000 X500.5902 Y461.9891 Z-7.5000 S1000
G1 F1000 X500.2429 Y461.7570 Z-7.5000 S1000
G1 F1000 X500.0109 Y461.4099 Z-7.5000 S1000
G1 F1000 X499.9294 Y461.0000 Z-7.5000 S1000
G1 F1000 X500.0109 Y460.5901 Z-7.5000 S1000
G1 F1000 X500.2429 Y460.2430 Z-7.5000 S1000
G1 F1000 X500.5902 Y460.0109 Z-7.5000 S1000
G1 F1000 X501.0000 Y459.9294 Z-7.5000 S1000
G1 F1000 X501.4099 Y460.0109 Z-7.5000 S1000
; Starting inflateGrp: Closed?:true
G1 F300 Z-8.2000
G1 F1000 X501.7571 Y460.2429 Z-8.2000 S1000
G1 F1000 X501.9891 Y460.5901 Z-8.2000 S1000
G1 F1000 X502.0706 Y461.0000 Z-8.2000 S1000
G1 F1000 X501.9891 Y461.4099 Z-8.2000 S1000
G1 F1000 X501.7571 Y461.7571 Z-8.2000 S1000
G1 F1000 X501.4099 Y461.9891 Z-8.2000 S1000
G1 F1000 X501.0000 Y462.0706 Z-8.2000 S1000
G1 F1000 X500.5902 Y461.9891 Z-8.2000 S1000
G1 F1000 X500.2429 Y461.7570 Z-8.2000 S1000
G1 F1000 X500.0109 Y461.4099 Z-8.2000 S1000
G1 F1000 X499.9294 Y461.0000 Z-8.2000 S1000
G1 F1000 X500.0109 Y460.5901 Z-8.2000 S1000
G1 F1000 X500.2429 Y460.2430 Z-8.2000 S1000
G1 F1000 X500.5902 Y460.0109 Z-8.2000 S1000
G1 F1000 X501.0000 Y459.9294 Z-8.2000 S1000
G1 F1000 X501.4099 Y460.0109 Z-8.2000 S1000
; Starting inflateGrp: Closed?:true

G0 Z10
G0 X461.4099 Y500.0109

G0 Z0
G1 F300 Z-1.5000
G1 F1000 X461.7571 Y500.2429 Z-1.5000 S1000
G1 F1000 X461.9891 Y500.5901 Z-1.5000 S1000
G1 F1000 X462.0706 Y501.0000 Z-1.5000 S1000
G1 F1000 X461.9891 Y501.4099 Z-1.5000 S1000
G1 F1000 X461.7571 Y501.7571 Z-1.5000 S1000
G1 F1000 X461.4099 Y501.9891 Z-1.5000 S1000
G1 F1000 X461.0000 Y502.0706 Z-1.5000 S1000
G1 F1000 X460.5902 Y501.9891 Z-1.5000 S1000
G1 F1000 X460.2429 Y501.7570 Z-1.5000 S1000
G1 F1000 X460.0109 Y501.4099 Z-1.5000 S1000
G1 F1000 X459.9294 Y501.0000 Z-1.5000 S1000
G1 F1000 X460.0109 Y500.5901 Z-1.5000 S1000
G1 F1000 X460.2429 Y500.2430 Z-1.5000 S1000
G1 F1000 X460.5902 Y500.0109 Z-1.5000 S1000
G1 F1000 X461.0000 Y499.9294 Z-1.5000 S1000
G1 F1000 X461.4099 Y500.0109 Z-1.5000 S1000
; Starting inflateGrp: Closed?:true
G1 F300 Z-3.0000
G1 F1000 X461.7571 Y500.2429 Z-3.0000 S1000
G1 F1000 X461.9891 Y500.5901 Z-3.0000 S1000
G1 F1000 X462.0706 Y501.0000 Z-3.0000 S1000
G1 F1000 X461.9891 Y501.4099 Z-3.0000 S1000
G1 F1000 X461.7571 Y501.7571 Z-3.0000 S1000
G1 F1000 X461.4099 Y501.9891 Z-3.0000 S1000
G1 F1000 X461.0000 Y502.0706 Z-3.0000 S1000
G1 F1000 X460.5902 Y501.9891 Z-3.0000 S1000
G1 F1000 X460.2429 Y501.7570 Z-3.0000 S1000
G1 F1000 X460.0109 Y501.4099 Z-3.0000 S1000
G1 F1000 X459.9294 Y501.0000 Z-3.0000 S1000
G1 F1000 X460.0109 Y500.5901 Z-3.0000 S1000
G1 F1000 X460.2429 Y500.2430 Z-3.0000 S1000
G1 F1000 X460.5902 Y500.0109 Z-3.0000 S1000
G1 F1000 X461.0000 Y499.9294 Z-3.0000 S1000
G1 F1000 X461.4099 Y500.0109 Z-3.0000 S1000
; Starting inflateGrp: Closed?:true
G1 F300 Z-4.5000
G1 F1000 X461.7571 Y500.2429 Z-4.5000 S1000
G1 F1000 X461.9891 Y500.5901 Z-4.5000 S1000
G1 F1000 X462.0706 Y501.0000 Z-4.5000 S1000
G1 F1000 X461.9891 Y501.4099 Z-4.5000 S1000
G1 F1000 X461.7571 Y501.7571 Z-4.5000 S1000
G1 F1000 X461.4099 Y501.9891 Z-4.5000 S1000
G1 F1000 X461.0000 Y502.0706 Z-4.5000 S1000
G1 F1000 X460.5902 Y501.9891 Z-4.5000 S1000
G1 F1000 X460.2429 Y501.7570 Z-4.5000 S1000
G1 F1000 X460.0109 Y501.4099 Z-4.5000 S1000
G1 F1000 X459.9294 Y501.0000 Z-4.5000 S1000
G1 F1000 X460.0109 Y500.5901 Z-4.5000 S1000
G1 F1000 X460.2429 Y500.2430 Z-4.5000 S1000
G1 F1000 X460.5902 Y500.0109 Z-4.5000 S1000
G1 F1000 X461.0000 Y499.9294 Z-4.5000 S1000
G1 F1000 X461.4099 Y500.0109 Z-4.5000 S1000
; Starting inflateGrp: Closed?:true
G1 F300 Z-6.0000
G1 F1000 X461.7571 Y500.2429 Z-6.0000 S1000
G1 F1000 X461.9891 Y500.5901 Z-6.0000 S1000
G1 F1000 X462.0706 Y501.0000 Z-6.0000 S1000
G1 F1000 X461.9891 Y501.4099 Z-6.0000 S1000
G1 F1000 X461.7571 Y501.7571 Z-6.0000 S1000
G1 F1000 X461.4099 Y501.9891 Z-6.0000 S1000
G1 F1000 X461.0000 Y502.0706 Z-6.0000 S1000
G1 F1000 X460.5902 Y501.9891 Z-6.0000 S1000
G1 F1000 X460.2429 Y501.7570 Z-6.0000 S1000
G1 F1000 X460.0109 Y501.4099 Z-6.0000 S1000
G1 F1000 X459.9294 Y501.0000 Z-6.0000 S1000
G1 F1000 X460.0109 Y500.5901 Z-6.0000 S1000
G1 F1000 X460.2429 Y500.2430 Z-6.0000 S1000
G1 F1000 X460.5902 Y500.0109 Z-6.0000 S1000
G1 F1000 X461.0000 Y499.9294 Z-6.0000 S1000
G1 F1000 X461.4099 Y500.0109 Z-6.0000 S1000
; Starting inflateGrp: Closed?:true
G1 F300 Z-7.5000
G1 F1000 X461.7571 Y500.2429 Z-7.5000 S1000
G1 F1000 X461.9891 Y500.5901 Z-7.5000 S1000
G1 F1000 X462.0706 Y501.0000 Z-7.5000 S1000
G1 F1000 X461.9891 Y501.4099 Z-7.5000 S1000
G1 F1000 X461.7571 Y501.7571 Z-7.5000 S1000
G1 F1000 X461.4099 Y501.9891 Z-7.5000 S1000
G1 F1000 X461.0000 Y502.0706 Z-7.5000 S1000
G1 F1000 X460.5902 Y501.9891 Z-7.5000 S1000
G1 F1000 X460.2429 Y501.7570 Z-7.5000 S1000
G1 F1000 X460.0109 Y501.4099 Z-7.5000 S1000
G1 F1000 X459.9294 Y501.0000 Z-7.5000 S1000
G1 F1000 X460.0109 Y500.5901 Z-7.5000 S1000
G1 F1000 X460.2429 Y500.2430 Z-7.5000 S1000
G1 F1000 X460.5902 Y500.0109 Z-7.5000 S1000
G1 F1000 X461.0000 Y499.9294 Z-7.5000 S1000
G1 F1000 X461.4099 Y500.0109 Z-7.5000 S1000
; Starting inflateGrp: Closed?:true
G1 F300 Z-8.2000
G1 F1000 X461.7571 Y500.2429 Z-8.2000 S1000
G1 F1000 X461.9891 Y500.5901 Z-8.2000 S1000
G1 F1000 X462.0706 Y501.0000 Z-8.2000 S1000
G1 F1000 X461.9891 Y501.4099 Z-8.2000 S1000
G1 F1000 X461.7571 Y501.7571 Z-8.2000 S1000
G1 F1000 X461.4099 Y501.9891 Z-8.2000 S1000
G1 F1000 X461.0000 Y502.0706 Z-8.2000 S1000
G1 F1000 X460.5902 Y501.9891 Z-8.2000 S1000
G1 F1000 X460.2429 Y501.7570 Z-8.2000 S1000
G1 F1000 X460.0109 Y501.4099 Z-8.2000 S1000
G1 F1000 X459.9294 Y501.0000 Z-8.2000 S1000
G1 F1000 X460.0109 Y500.5901 Z-8.2000 S1000
G1 F1000 X460.2429 Y500.2430 Z-8.2000 S1000
G1 F1000 X460.5902 Y500.0109 Z-8.2000 S1000
G1 F1000 X461.0000 Y499.9294 Z-8.2000 S1000
G1 F1000 X461.4099 Y500.0109 Z-8.2000 S1000
; Starting inflateGrp: Closed?:true

G0 Z10
G0 X50.4099 Y9.0109

G0 Z0
G1 F300 Z-1.5000
G1 F1000 X50.7571 Y9.2429 Z-1.5000 S1000
G1 F1000 X50.9891 Y9.5901 Z-1.5000 S1000
G1 F1000 X51.0706 Y10.0000 Z-1.5000 S1000
G1 F1000 X50.9891 Y10.4099 Z-1.5000 S1000
G1 F1000 X50.7571 Y10.7571 Z-1.5000 S1000
G1 F1000 X50.4099 Y10.9891 Z-1.5000 S1000
G1 F1000 X50.0000 Y11.0706 Z-1.5000 S1000
G1 F1000 X49.5901 Y10.9891 Z-1.5000 S1000
G1 F1000 X49.2429 Y10.7571 Z-1.5000 S1000
G1 F1000 X49.0109 Y10.4099 Z-1.5000 S1000
G1 F1000 X48.9294 Y10.0000 Z-1.5000 S1000
G1 F1000 X49.0109 Y9.5901 Z-1.5000 S1000
G1 F1000 X49.2429 Y9.2429 Z-1.5000 S1000
G1 F1000 X49.5901 Y9.0109 Z-1.5000 S1000
G1 F1000 X50.0000 Y8.9294 Z-1.5000 S1000
G1 F1000 X50.4099 Y9.0109 Z-1.5000 S1000
; Starting inflateGrp: Closed?:true
G1 F300 Z-3.0000
G1 F1000 X50.7571 Y9.2429 Z-3.0000 S1000
G1 F1000 X50.9891 Y9.5901 Z-3.0000 S1000
G1 F1000 X51.0706 Y10.0000 Z-3.0000 S1000
G1 F1000 X50.9891 Y10.4099 Z-3.0000 S1000
G1 F1000 X50.7571 Y10.7571 Z-3.0000 S1000
G1 F1000 X50.4099 Y10.9891 Z-3.0000 S1000
G1 F1000 X50.0000 Y11.0706 Z-3.0000 S1000
G1 F1000 X49.5901 Y10.9891 Z-3.0000 S1000
G1 F1000 X49.2429 Y10.7571 Z-3.0000 S1000
G1 F1000 X49.0109 Y10.4099 Z-3.0000 S1000
G1 F1000 X48.9294 Y10.0000 Z-3.0000 S1000
G1 F1000 X49.0109 Y9.5901 Z-3.0000 S1000
G1 F1000 X49.2429 Y9.2429 Z-3.0000 S1000
G1 F1000 X49.5901 Y9.0109 Z-3.0000 S1000
G1 F1000 X50.0000 Y8.9294 Z-3.0000 S1000
G1 F1000 X50.4099 Y9.0109 Z-3.0000 S1000
; Starting inflateGrp: Closed?:true
G1 F300 Z-4.5000
G1 F1000 X50.7571 Y9.2429 Z-4.5000 S1000
G1 F1000 X50.9891 Y9.5901 Z-4.5000 S1000
G1 F1000 X51.0706 Y10.0000 Z-4.5000 S1000
G1 F1000 X50.9891 Y10.4099 Z-4.5000 S1000
G1 F1000 X50.7571 Y10.7571 Z-4.5000 S1000
G1 F1000 X50.4099 Y10.9891 Z-4.5000 S1000
G1 F1000 X50.0000 Y11.0706 Z-4.5000 S1000
G1 F1000 X49.5901 Y10.9891 Z-4.5000 S1000
G1 F1000 X49.2429 Y10.7571 Z-4.5000 S1000
G1 F1000 X49.0109 Y10.4099 Z-4.5000 S1000
G1 F1000 X48.9294 Y10.0000 Z-4.5000 S1000
G1 F1000 X49.0109 Y9.5901 Z-4.5000 S1000
G1 F1000 X49.2429 Y9.2429 Z-4.5000 S1000
G1 F1000 X49.5901 Y9.0109 Z-4.5000 S1000
G1 F1000 X50.0000 Y8.9294 Z-4.5000 S1000
G1 F1000 X50.4099 Y9.0109 Z-4.5000 S1000
; Starting inflateGrp: Closed?:true
G1 F300 Z-6.0000
G1 F1000 X50.7571 Y9.2429 Z-6.0000 S1000
G1 F1000 X50.9891 Y9.5901 Z-6.0000 S1000
G1 F1000 X51.0706 Y10.0000 Z-6.0000 S1000
G1 F1000 X50.9891 Y10.4099 Z-6.0000 S1000
G1 F1000 X50.7571 Y10.7571 Z-6.0000 S1000
G1 F1000 X50.4099 Y10.9891 Z-6.0000 S1000
G1 F1000 X50.0000 Y11.0706 Z-6.0000 S1000
G1 F1000 X49.5901 Y10.9891 Z-6.0000 S1000
G1 F1000 X49.2429 Y10.7571 Z-6.0000 S1000
G1 F1000 X49.0109 Y10.4099 Z-6.0000 S1000
G1 F1000 X48.9294 Y10.0000 Z-6.0000 S1000
G1 F1000 X49.0109 Y9.5901 Z-6.0000 S1000
G1 F1000 X49.2429 Y9.2429 Z-6.0000 S1000
G1 F1000 X49.5901 Y9.0109 Z-6.0000 S1000
G1 F1000 X50.0000 Y8.9294 Z-6.0000 S1000
G1 F1000 X50.4099 Y9.0109 Z-6.0000 S1000
; Starting inflateGrp: Closed?:true
G1 F300 Z-7.5000
G1 F1000 X50.7571 Y9.2429 Z-7.5000 S1000
G1 F1000 X50.9891 Y9.5901 Z-7.5000 S1000
G1 F1000 X51.0706 Y10.0000 Z-7.5000 S1000
G1 F1000 X50.9891 Y10.4099 Z-7.5000 S1000
G1 F1000 X50.7571 Y10.7571 Z-7.5000 S1000
G1 F1000 X50.4099 Y10.9891 Z-7.5000 S1000
G1 F1000 X50.0000 Y11.0706 Z-7.5000 S1000
G1 F1000 X49.5901 Y10.9891 Z-7.5000 S1000
G1 F1000 X49.2429 Y10.7571 Z-7.5000 S1000
G1 F1000 X49.0109 Y10.4099 Z-7.5000 S1000
G1 F1000 X48.9294 Y10.0000 Z-7.5000 S1000
G1 F1000 X49.0109 Y9.5901 Z-7.5000 S1000
G1 F1000 X49.2429 Y9.2429 Z-7.5000 S1000
G1 F1000 X49.5901 Y9.0109 Z-7.5000 S1000
G1 F1000 X50.0000 Y8.9294 Z-7.5000 S1000
G1 F1000 X50.4099 Y9.0109 Z-7.5000 S1000
; Starting inflateGrp: Closed?:true
G1 F300 Z-8.2000
G1 F1000 X50.7571 Y9.2429 Z-8.2000 S1000
G1 F1000 X50.9891 Y9.5901 Z-8.2000 S1000
G1 F1000 X51.0706 Y10.0000 Z-8.2000 S1000
G1 F1000 X50.9891 Y10.4099 Z-8.2000 S1000
G1 F1000 X50.7571 Y10.7571 Z-8.2000 S1000
G1 F1000 X50.4099 Y10.9891 Z-8.2000 S1000
G1 F1000 X50.0000 Y11.0706 Z-8.2000 S1000
G1 F1000 X49.5901 Y10.9891 Z-8.2000 S1000
G1 F1000 X49.2429 Y10.7571 Z-8.2000 S1000
G1 F1000 X49.0109 Y10.4099 Z-8.2000 S1000
G1 F1000 X48.9294 Y10.0000 Z-8.2000 S1000
G1 F1000 X49.0109 Y9.5901 Z-8.2000 S1000
G1 F1000 X49.2429 Y9.2429 Z-8.2000 S1000
G1 F1000 X49.5901 Y9.0109 Z-8.2000 S1000
G1 F1000 X50.0000 Y8.9294 Z-8.2000 S1000
G1 F1000 X50.4099 Y9.0109 Z-8.2000 S1000
; Starting inflateGrp: Closed?:true

G0 Z10
G0 X501.4100 Y49.0109

G0 Z0
G1 F300 Z-1.5000
G1 F1000 X501.7572 Y49.2429 Z-1.5000 S1000
G1 F1000 X501.9892 Y49.5901 Z-1.5000 S1000
G1 F1000 X502.0707 Y50.0000 Z-1.5000 S1000
G1 F1000 X501.9892 Y50.4099 Z-1.5000 S1000
G1 F1000 X501.7572 Y50.7571 Z-1.5000 S1000
G1 F1000 X501.4100 Y50.9891 Z-1.5000 S1000
G1 F1000 X501.0001 Y51.0706 Z-1.5000 S1000
G1 F1000 X500.5902 Y50.9891 Z-1.5000 S1000
G1 F1000 X500.2430 Y50.7571 Z-1.5000 S1000
G1 F1000 X500.0110 Y50.4099 Z-1.5000 S1000
G1 F1000 X499.9295 Y50.0000 Z-1.5000 S1000
G1 F1000 X500.0110 Y49.5901 Z-1.5000 S1000
G1 F1000 X500.2430 Y49.2429 Z-1.5000 S1000
G1 F1000 X500.5902 Y49.0109 Z-1.5000 S1000
G1 F1000 X501.0001 Y48.9294 Z-1.5000 S1000
G1 F1000 X501.4100 Y49.0109 Z-1.5000 S1000
; Starting inflateGrp: Closed?:true
G1 F300 Z-3.0000
G1 F1000 X501.7572 Y49.2429 Z-3.0000 S1000
G1 F1000 X501.9892 Y49.5901 Z-3.0000 S1000
G1 F1000 X502.0707 Y50.0000 Z-3.0000 S1000
G1 F1000 X501.9892 Y50.4099 Z-3.0000 S1000
G1 F1000 X501.7572 Y50.7571 Z-3.0000 S1000
G1 F1000 X501.4100 Y50.9891 Z-3.0000 S1000
G1 F1000 X501.0001 Y51.0706 Z-3.0000 S1000
G1 F1000 X500.5902 Y50.9891 Z-3.0000 S1000
G1 F1000 X500.2430 Y50.7571 Z-3.0000 S1000
G1 F1000 X500.0110 Y50.4099 Z-3.0000 S1000
G1 F1000 X499.9295 Y50.0000 Z-3.0000 S1000
G1 F1000 X500.0110 Y49.5901 Z-3.0000 S1000
G1 F1000 X500.2430 Y49.2429 Z-3.0000 S1000
G1 F1000 X500.5902 Y49.0109 Z-3.0000 S1000
G1 F1000 X501.0001 Y48.9294 Z-3.0000 S1000
G1 F1000 X501.4100 Y49.0109 Z-3.0000 S1000
; Starting inflateGrp: Closed?:true
G1 F300 Z-4.5000
G1 F1000 X501.7572 Y49.2429 Z-4.5000 S1000
G1 F1000 X501.9892 Y49.5901 Z-4.5000 S1000
G1 F1000 X502.0707 Y50.0000 Z-4.5000 S1000
G1 F1000 X501.9892 Y50.4099 Z-4.5000 S1000
G1 F1000 X501.7572 Y50.7571 Z-4.5000 S1000
G1 F1000 X501.4100 Y50.9891 Z-4.5000 S1000
G1 F1000 X501.0001 Y51.0706 Z-4.5000 S1000
G1 F1000 X500.5902 Y50.9891 Z-4.5000 S1000
G1 F1000 X500.2430 Y50.7571 Z-4.5000 S1000
G1 F1000 X500.0110 Y50.4099 Z-4.5000 S1000
G1 F1000 X499.9295 Y50.0000 Z-4.5000 S1000
G1 F1000 X500.0110 Y49.5901 Z-4.5000 S1000
G1 F1000 X500.2430 Y49.2429 Z-4.5000 S1000
G1 F1000 X500.5902 Y49.0109 Z-4.5000 S1000
G1 F1000 X501.0001 Y48.9294 Z-4.5000 S1000
G1 F1000 X501.4100 Y49.0109 Z-4.5000 S1000
; Starting inflateGrp: Closed?:true
G1 F300 Z-6.0000
G1 F1000 X501.7572 Y49.2429 Z-6.0000 S1000
G1 F1000 X501.9892 Y49.5901 Z-6.0000 S1000
G1 F1000 X502.0707 Y50.0000 Z-6.0000 S1000
G1 F1000 X501.9892 Y50.4099 Z-6.0000 S1000
G1 F1000 X501.7572 Y50.7571 Z-6.0000 S1000
G1 F1000 X501.4100 Y50.9891 Z-6.0000 S1000
G1 F1000 X501.0001 Y51.0706 Z-6.0000 S1000
G1 F1000 X500.5902 Y50.9891 Z-6.0000 S1000
G1 F1000 X500.2430 Y50.7571 Z-6.0000 S1000
G1 F1000 X500.0110 Y50.4099 Z-6.0000 S1000
G1 F1000 X499.9295 Y50.0000 Z-6.0000 S1000
G1 F1000 X500.0110 Y49.5901 Z-6.0000 S1000
G1 F1000 X500.2430 Y49.2429 Z-6.0000 S1000
G1 F1000 X500.5902 Y49.0109 Z-6.0000 S1000
G1 F1000 X501.0001 Y48.9294 Z-6.0000 S1000
G1 F1000 X501.4100 Y49.0109 Z-6.0000 S1000
; Starting inflateGrp: Closed?:true
G1 F300 Z-7.5000
G1 F1000 X501.7572 Y49.2429 Z-7.5000 S1000
G1 F1000 X501.9892 Y49.5901 Z-7.5000 S1000
G1 F1000 X502.0707 Y50.0000 Z-7.5000 S1000
G1 F1000 X501.9892 Y50.4099 Z-7.5000 S1000
G1 F1000 X501.7572 Y50.7571 Z-7.5000 S1000
G1 F1000 X501.4100 Y50.9891 Z-7.5000 S1000
G1 F1000 X501.0001 Y51.0706 Z-7.5000 S1000
G1 F1000 X500.5902 Y50.9891 Z-7.5000 S1000
G1 F1000 X500.2430 Y50.7571 Z-7.5000 S1000
G1 F1000 X500.0110 Y50.4099 Z-7.5000 S1000
G1 F1000 X499.9295 Y50.0000 Z-7.5000 S1000
G1 F1000 X500.0110 Y49.5901 Z-7.5000 S1000
G1 F1000 X500.2430 Y49.2429 Z-7.5000 S1000
G1 F1000 X500.5902 Y49.0109 Z-7.5000 S1000
G1 F1000 X501.0001 Y48.9294 Z-7.5000 S1000
G1 F1000 X501.4100 Y49.0109 Z-7.5000 S1000
; Starting inflateGrp: Closed?:true
G1 F300 Z-8.2000
G1 F1000 X501.7572 Y49.2429 Z-8.2000 S1000
G1 F1000 X501.9892 Y49.5901 Z-8.2000 S1000
G1 F1000 X502.0707 Y50.0000 Z-8.2000 S1000
G1 F1000 X501.9892 Y50.4099 Z-8.2000 S1000
G1 F1000 X501.7572 Y50.7571 Z-8.2000 S1000
G1 F1000 X501.4100 Y50.9891 Z-8.2000 S1000
G1 F1000 X501.0001 Y51.0706 Z-8.2000 S1000
G1 F1000 X500.5902 Y50.9891 Z-8.2000 S1000
G1 F1000 X500.2430 Y50.7571 Z-8.2000 S1000
G1 F1000 X500.0110 Y50.4099 Z-8.2000 S1000
G1 F1000 X499.9295 Y50.0000 Z-8.2000 S1000
G1 F1000 X500.0110 Y49.5901 Z-8.2000 S1000
G1 F1000 X500.2430 Y49.2429 Z-8.2000 S1000
G1 F1000 X500.5902 Y49.0109 Z-8.2000 S1000
G1 F1000 X501.0001 Y48.9294 Z-8.2000 S1000
G1 F1000 X501.4100 Y49.0109 Z-8.2000 S1000
; Starting inflateGrp: Closed?:true

G0 Z10
G0 X10.4099 Y49.0109

G0 Z0
G1 F300 Z-1.5000
G1 F1000 X10.7571 Y49.2429 Z-1.5000 S1000
G1 F1000 X10.9891 Y49.5901 Z-1.5000 S1000
G1 F1000 X11.0706 Y50.0000 Z-1.5000 S1000
G1 F1000 X10.9891 Y50.4099 Z-1.5000 S1000
G1 F1000 X10.7571 Y50.7571 Z-1.5000 S1000
G1 F1000 X10.4099 Y50.9891 Z-1.5000 S1000
G1 F1000 X10.0000 Y51.0706 Z-1.5000 S1000
G1 F1000 X9.5901 Y50.9891 Z-1.5000 S1000
G1 F1000 X9.2429 Y50.7571 Z-1.5000 S1000
G1 F1000 X9.0109 Y50.4099 Z-1.5000 S1000
G1 F1000 X8.9294 Y50.0000 Z-1.5000 S1000
G1 F1000 X9.0109 Y49.5901 Z-1.5000 S1000
G1 F1000 X9.2429 Y49.2429 Z-1.5000 S1000
G1 F1000 X9.5901 Y49.0109 Z-1.5000 S1000
G1 F1000 X10.0000 Y48.9294 Z-1.5000 S1000
G1 F1000 X10.4099 Y49.0109 Z-1.5000 S1000
; Starting inflateGrp: Closed?:true
G1 F300 Z-3.0000
G1 F1000 X10.7571 Y49.2429 Z-3.0000 S1000
G1 F1000 X10.9891 Y49.5901 Z-3.0000 S1000
G1 F1000 X11.0706 Y50.0000 Z-3.0000 S1000
G1 F1000 X10.9891 Y50.4099 Z-3.0000 S1000
G1 F1000 X10.7571 Y50.7571 Z-3.0000 S1000
G1 F1000 X10.4099 Y50.9891 Z-3.0000 S1000
G1 F1000 X10.0000 Y51.0706 Z-3.0000 S1000
G1 F1000 X9.5901 Y50.9891 Z-3.0000 S1000
G1 F1000 X9.2429 Y50.7571 Z-3.0000 S1000
G1 F1000 X9.0109 Y50.4099 Z-3.0000 S1000
G1 F1000 X8.9294 Y50.0000 Z-3.0000 S1000
G1 F1000 X9.0109 Y49.5901 Z-3.0000 S1000
G1 F1000 X9.2429 Y49.2429 Z-3.0000 S1000
G1 F1000 X9.5901 Y49.0109 Z-3.0000 S1000
G1 F1000 X10.0000 Y48.9294 Z-3.0000 S1000
G1 F1000 X10.4099 Y49.0109 Z-3.0000 S1000
; Starting inflateGrp: Closed?:true
G1 F300 Z-4.5000
G1 F1000 X10.7571 Y49.2429 Z-4.5000 S1000
G1 F1000 X10.9891 Y49.5901 Z-4.5000 S1000
G1 F1000 X11.0706 Y50.0000 Z-4.5000 S1000
G1 F1000 X10.9891 Y50.4099 Z-4.5000 S1000
G1 F1000 X10.7571 Y50.7571 Z-4.5000 S1000
G1 F1000 X10.4099 Y50.9891 Z-4.5000 S1000
G1 F1000 X10.0000 Y51.0706 Z-4.5000 S1000
G1 F1000 X9.5901 Y50.9891 Z-4.5000 S1000
G1 F1000 X9.2429 Y50.7571 Z-4.5000 S1000
G1 F1000 X9.0109 Y50.4099 Z-4.5000 S1000
G1 F1000 X8.9294 Y50.0000 Z-4.5000 S1000
G1 F1000 X9.0109 Y49.5901 Z-4.5000 S1000
G1 F1000 X9.2429 Y49.2429 Z-4.5000 S1000
G1 F1000 X9.5901 Y49.0109 Z-4.5000 S1000
G1 F1000 X10.0000 Y48.9294 Z-4.5000 S1000
G1 F1000 X10.4099 Y49.0109 Z-4.5000 S1000
; Starting inflateGrp: Closed?:true
G1 F300 Z-6.0000
G1 F1000 X10.7571 Y49.2429 Z-6.0000 S1000
G1 F1000 X10.9891 Y49.5901 Z-6.0000 S1000
G1 F1000 X11.0706 Y50.0000 Z-6.0000 S1000
G1 F1000 X10.9891 Y50.4099 Z-6.0000 S1000
G1 F1000 X10.7571 Y50.7571 Z-6.0000 S1000
G1 F1000 X10.4099 Y50.9891 Z-6.0000 S1000
G1 F1000 X10.0000 Y51.0706 Z-6.0000 S1000
G1 F1000 X9.5901 Y50.9891 Z-6.0000 S1000
G1 F1000 X9.2429 Y50.7571 Z-6.0000 S1000
G1 F1000 X9.0109 Y50.4099 Z-6.0000 S1000
G1 F1000 X8.9294 Y50.0000 Z-6.0000 S1000
G1 F1000 X9.0109 Y49.5901 Z-6.0000 S1000
G1 F1000 X9.2429 Y49.2429 Z-6.0000 S1000
G1 F1000 X9.5901 Y49.0109 Z-6.0000 S1000
G1 F1000 X10.0000 Y48.9294 Z-6.0000 S1000
G1 F1000 X10.4099 Y49.0109 Z-6.0000 S1000
; Starting inflateGrp: Closed?:true
G1 F300 Z-7.5000
G1 F1000 X10.7571 Y49.2429 Z-7.5000 S1000
G1 F1000 X10.9891 Y49.5901 Z-7.5000 S1000
G1 F1000 X11.0706 Y50.0000 Z-7.5000 S1000
G1 F1000 X10.9891 Y50.4099 Z-7.5000 S1000
G1 F1000 X10.7571 Y50.7571 Z-7.5000 S1000
G1 F1000 X10.4099 Y50.9891 Z-7.5000 S1000
G1 F1000 X10.0000 Y51.0706 Z-7.5000 S1000
G1 F1000 X9.5901 Y50.9891 Z-7.5000 S1000
G1 F1000 X9.2429 Y50.7571 Z-7.5000 S1000
G1 F1000 X9.0109 Y50.4099 Z-7.5000 S1000
G1 F1000 X8.9294 Y50.0000 Z-7.5000 S1000
G1 F1000 X9.0109 Y49.5901 Z-7.5000 S1000
G1 F1000 X9.2429 Y49.2429 Z-7.5000 S1000
G1 F1000 X9.5901 Y49.0109 Z-7.5000 S1000
G1 F1000 X10.0000 Y48.9294 Z-7.5000 S1000
G1 F1000 X10.4099 Y49.0109 Z-7.5000 S1000
; Starting inflateGrp: Closed?:true
G1 F300 Z-8.2000
G1 F1000 X10.7571 Y49.2429 Z-8.2000 S1000
G1 F1000 X10.9891 Y49.5901 Z-8.2000 S1000
G1 F1000 X11.0706 Y50.0000 Z-8.2000 S1000
G1 F1000 X10.9891 Y50.4099 Z-8.2000 S1000
G1 F1000 X10.7571 Y50.7571 Z-8.2000 S1000
G1 F1000 X10.4099 Y50.9891 Z-8.2000 S1000
G1 F1000 X10.0000 Y51.0706 Z-8.2000 S1000
G1 F1000 X9.5901 Y50.9891 Z-8.2000 S1000
G1 F1000 X9.2429 Y50.7571 Z-8.2000 S1000
G1 F1000 X9.0109 Y50.4099 Z-8.2000 S1000
G1 F1000 X8.9294 Y50.0000 Z-8.2000 S1000
G1 F1000 X9.0109 Y49.5901 Z-8.2000 S1000
G1 F1000 X9.2429 Y49.2429 Z-8.2000 S1000
G1 F1000 X9.5901 Y49.0109 Z-8.2000 S1000
G1 F1000 X10.0000 Y48.9294 Z-8.2000 S1000
G1 F1000 X10.4099 Y49.0109 Z-8.2000 S1000
; Starting inflateGrp: Closed?:true

G0 Z10
G0 X461.4100 Y9.0109

G0 Z0
G1 F300 Z-1.5000
G1 F1000 X461.7572 Y9.2429 Z-1.5000 S1000
G1 F1000 X461.9892 Y9.5901 Z-1.5000 S1000
G1 F1000 X462.0707 Y10.0000 Z-1.5000 S1000
G1 F1000 X461.9892 Y10.4099 Z-1.5000 S1000
G1 F1000 X461.7572 Y10.7571 Z-1.5000 S1000
G1 F1000 X461.4100 Y10.9891 Z-1.5000 S1000
G1 F1000 X461.0001 Y11.0706 Z-1.5000 S1000
G1 F1000 X460.5902 Y10.9891 Z-1.5000 S1000
G1 F1000 X460.2430 Y10.7571 Z-1.5000 S1000
G1 F1000 X460.0110 Y10.4099 Z-1.5000 S1000
G1 F1000 X459.9295 Y10.0000 Z-1.5000 S1000
G1 F1000 X460.0110 Y9.5901 Z-1.5000 S1000
G1 F1000 X460.2430 Y9.2429 Z-1.5000 S1000
G1 F1000 X460.5902 Y9.0109 Z-1.5000 S1000
G1 F1000 X461.0001 Y8.9294 Z-1.5000 S1000
G1 F1000 X461.4100 Y9.0109 Z-1.5000 S1000
; Starting inflateGrp: Closed?:true
G1 F300 Z-3.0000
G1 F1000 X461.7572 Y9.2429 Z-3.0000 S1000
G1 F1000 X461.9892 Y9.5901 Z-3.0000 S1000
G1 F1000 X462.0707 Y10.0000 Z-3.0000 S1000
G1 F1000 X461.9892 Y10.4099 Z-3.0000 S1000
G1 F1000 X461.7572 Y10.7571 Z-3.0000 S1000
G1 F1000 X461.4100 Y10.9891 Z-3.0000 S1000
G1 F1000 X461.0001 Y11.0706 Z-3.0000 S1000
G1 F1000 X460.5902 Y10.9891 Z-3.0000 S1000
G1 F1000 X460.2430 Y10.7571 Z-3.0000 S1000
G1 F1000 X460.0110 Y10.4099 Z-3.0000 S1000
G1 F1000 X459.9295 Y10.0000 Z-3.0000 S1000
G1 F1000 X460.0110 Y9.5901 Z-3.0000 S1000
G1 F1000 X460.2430 Y9.2429 Z-3.0000 S1000
G1 F1000 X460.5902 Y9.0109 Z-3.0000 S1000
G1 F1000 X461.0001 Y8.9294 Z-3.0000 S1000
G1 F1000 X461.4100 Y9.0109 Z-3.0000 S1000
; Starting inflateGrp: Closed?:true
G1 F300 Z-4.5000
G1 F1000 X461.7572 Y9.2429 Z-4.5000 S1000
G1 F1000 X461.9892 Y9.5901 Z-4.5000 S1000
G1 F1000 X462.0707 Y10.0000 Z-4.5000 S1000
G1 F1000 X461.9892 Y10.4099 Z-4.5000 S1000
G1 F1000 X461.7572 Y10.7571 Z-4.5000 S1000
G1 F1000 X461.4100 Y10.9891 Z-4.5000 S1000
G1 F1000 X461.0001 Y11.0706 Z-4.5000 S1000
G1 F1000 X460.5902 Y10.9891 Z-4.5000 S1000
G1 F1000 X460.2430 Y10.7571 Z-4.5000 S1000
G1 F1000 X460.0110 Y10.4099 Z-4.5000 S1000
G1 F1000 X459.9295 Y10.0000 Z-4.5000 S1000
G1 F1000 X460.0110 Y9.5901 Z-4.5000 S1000
G1 F1000 X460.2430 Y9.2429 Z-4.5000 S1000
G1 F1000 X460.5902 Y9.0109 Z-4.5000 S1000
G1 F1000 X461.0001 Y8.9294 Z-4.5000 S1000
G1 F1000 X461.4100 Y9.0109 Z-4.5000 S1000
; Starting inflateGrp: Closed?:true
G1 F300 Z-6.0000
G1 F1000 X461.7572 Y9.2429 Z-6.0000 S1000
G1 F1000 X461.9892 Y9.5901 Z-6.0000 S1000
G1 F1000 X462.0707 Y10.0000 Z-6.0000 S1000
G1 F1000 X461.9892 Y10.4099 Z-6.0000 S1000
G1 F1000 X461.7572 Y10.7571 Z-6.0000 S1000
G1 F1000 X461.4100 Y10.9891 Z-6.0000 S1000
G1 F1000 X461.0001 Y11.0706 Z-6.0000 S1000
G1 F1000 X460.5902 Y10.9891 Z-6.0000 S1000
G1 F1000 X460.2430 Y10.7571 Z-6.0000 S1000
G1 F1000 X460.0110 Y10.4099 Z-6.0000 S1000
G1 F1000 X459.9295 Y10.0000 Z-6.0000 S1000
G1 F1000 X460.0110 Y9.5901 Z-6.0000 S1000
G1 F1000 X460.2430 Y9.2429 Z-6.0000 S1000
G1 F1000 X460.5902 Y9.0109 Z-6.0000 S1000
G1 F1000 X461.0001 Y8.9294 Z-6.0000 S1000
G1 F1000 X461.4100 Y9.0109 Z-6.0000 S1000
; Starting inflateGrp: Closed?:true
G1 F300 Z-7.5000
G1 F1000 X461.7572 Y9.2429 Z-7.5000 S1000
G1 F1000 X461.9892 Y9.5901 Z-7.5000 S1000
G1 F1000 X462.0707 Y10.0000 Z-7.5000 S1000
G1 F1000 X461.9892 Y10.4099 Z-7.5000 S1000
G1 F1000 X461.7572 Y10.7571 Z-7.5000 S1000
G1 F1000 X461.4100 Y10.9891 Z-7.5000 S1000
G1 F1000 X461.0001 Y11.0706 Z-7.5000 S1000
G1 F1000 X460.5902 Y10.9891 Z-7.5000 S1000
G1 F1000 X460.2430 Y10.7571 Z-7.5000 S1000
G1 F1000 X460.0110 Y10.4099 Z-7.5000 S1000
G1 F1000 X459.9295 Y10.0000 Z-7.5000 S1000
G1 F1000 X460.0110 Y9.5901 Z-7.5000 S1000
G1 F1000 X460.2430 Y9.2429 Z-7.5000 S1000
G1 F1000 X460.5902 Y9.0109 Z-7.5000 S1000
G1 F1000 X461.0001 Y8.9294 Z-7.5000 S1000
G1 F1000 X461.4100 Y9.0109 Z-7.5000 S1000
; Starting inflateGrp: Closed?:true
G1 F300 Z-8.2000
G1 F1000 X461.7572 Y9.2429 Z-8.2000 S1000
G1 F1000 X461.9892 Y9.5901 Z-8.2000 S1000
G1 F1000 X462.0707 Y10.0000 Z-8.2000 S1000
G1 F1000 X461.9892 Y10.4099 Z-8.2000 S1000
G1 F1000 X461.7572 Y10.7571 Z-8.2000 S1000
G1 F1000 X461.4100 Y10.9891 Z-8.2000 S1000
G1 F1000 X461.0001 Y11.0706 Z-8.2000 S1000
G1 F1000 X460.5902 Y10.9891 Z-8.2000 S1000
G1 F1000 X460.2430 Y10.7571 Z-8.2000 S1000
G1 F1000 X460.0110 Y10.4099 Z-8.2000 S1000
G1 F1000 X459.9295 Y10.0000 Z-8.2000 S1000
G1 F1000 X460.0110 Y9.5901 Z-8.2000 S1000
G1 F1000 X460.2430 Y9.2429 Z-8.2000 S1000
G1 F1000 X460.5902 Y9.0109 Z-8.2000 S1000
G1 F1000 X461.0001 Y8.9294 Z-8.2000 S1000
G1 F1000 X461.4100 Y9.0109 Z-8.2000 S1000
; Starting inflateGrp: Closed?:true

G0 Z10
G0 X10.4099 Y460.0109

G0 Z0
G1 F300 Z-1.5000
G1 F1000 X10.7571 Y460.2429 Z-1.5000 S1000
G1 F1000 X10.9891 Y460.5901 Z-1.5000 S1000
G1 F1000 X11.0706 Y461.0000 Z-1.5000 S1000
G1 F1000 X10.9891 Y461.4099 Z-1.5000 S1000
G1 F1000 X10.7571 Y461.7571 Z-1.5000 S1000
G1 F1000 X10.4099 Y461.9891 Z-1.5000 S1000
G1 F1000 X10.0000 Y462.0706 Z-1.5000 S1000
G1 F1000 X9.5901 Y461.9891 Z-1.5000 S1000
G1 F1000 X9.2429 Y461.7571 Z-1.5000 S1000
G1 F1000 X9.0109 Y461.4099 Z-1.5000 S1000
G1 F1000 X8.9294 Y461.0000 Z-1.5000 S1000
G1 F1000 X9.0109 Y460.5901 Z-1.5000 S1000
G1 F1000 X9.2429 Y460.2429 Z-1.5000 S1000
G1 F1000 X9.5901 Y460.0109 Z-1.5000 S1000
G1 F1000 X10.0000 Y459.9294 Z-1.5000 S1000
G1 F1000 X10.4099 Y460.0109 Z-1.5000 S1000
; Starting inflateGrp: Closed?:true
G1 F300 Z-3.0000
G1 F1000 X10.7571 Y460.2429 Z-3.0000 S1000
G1 F1000 X10.9891 Y460.5901 Z-3.0000 S1000
G1 F1000 X11.0706 Y461.0000 Z-3.0000 S1000
G1 F1000 X10.9891 Y461.4099 Z-3.0000 S1000
G1 F1000 X10.7571 Y461.7571 Z-3.0000 S1000
G1 F1000 X10.4099 Y461.9891 Z-3.0000 S1000
G1 F1000 X10.0000 Y462.0706 Z-3.0000 S1000
G1 F1000 X9.5901 Y461.9891 Z-3.0000 S1000
G1 F1000 X9.2429 Y461.7571 Z-3.0000 S1000
G1 F1000 X9.0109 Y461.4099 Z-3.0000 S1000
G1 F1000 X8.9294 Y461.0000 Z-3.0000 S1000
G1 F1000 X9.0109 Y460.5901 Z-3.0000 S1000
G1 F1000 X9.2429 Y460.2429 Z-3.0000 S1000
G1 F1000 X9.5901 Y460.0109 Z-3.0000 S1000
G1 F1000 X10.0000 Y459.9294 Z-3.0000 S1000
G1 F1000 X10.4099 Y460.0109 Z-3.0000 S1000
; Starting inflateGrp: Closed?:true
G1 F300 Z-4.5000
G1 F1000 X10.7571 Y460.2429 Z-4.5000 S1000
G1 F1000 X10.9891 Y460.5901 Z-4.5000 S1000
G1 F1000 X11.0706 Y461.0000 Z-4.5000 S1000
G1 F1000 X10.9891 Y461.4099 Z-4.5000 S1000
G1 F1000 X10.7571 Y461.7571 Z-4.5000 S1000
G1 F1000 X10.4099 Y461.9891 Z-4.5000 S1000
G1 F1000 X10.0000 Y462.0706 Z-4.5000 S1000
G1 F1000 X9.5901 Y461.9891 Z-4.5000 S1000
G1 F1000 X9.2429 Y461.7571 Z-4.5000 S1000
G1 F1000 X9.0109 Y461.4099 Z-4.5000 S1000
G1 F1000 X8.9294 Y461.0000 Z-4.5000 S1000
G1 F1000 X9.0109 Y460.5901 Z-4.5000 S1000
G1 F1000 X9.2429 Y460.2429 Z-4.5000 S1000
G1 F1000 X9.5901 Y460.0109 Z-4.5000 S1000
G1 F1000 X10.0000 Y459.9294 Z-4.5000 S1000
G1 F1000 X10.4099 Y460.0109 Z-4.5000 S1000
; Starting inflateGrp: Closed?:true
G1 F300 Z-6.0000
G1 F1000 X10.7571 Y460.2429 Z-6.0000 S1000
G1 F1000 X10.9891 Y460.5901 Z-6.0000 S1000
G1 F1000 X11.0706 Y461.0000 Z-6.0000 S1000
G1 F1000 X10.9891 Y461.4099 Z-6.0000 S1000
G1 F1000 X10.7571 Y461.7571 Z-6.0000 S1000
G1 F1000 X10.4099 Y461.9891 Z-6.0000 S1000
G1 F1000 X10.0000 Y462.0706 Z-6.0000 S1000
G1 F1000 X9.5901 Y461.9891 Z-6.0000 S1000
G1 F1000 X9.2429 Y461.7571 Z-6.0000 S1000
G1 F1000 X9.0109 Y461.4099 Z-6.0000 S1000
G1 F1000 X8.9294 Y461.0000 Z-6.0000 S1000
G1 F1000 X9.0109 Y460.5901 Z-6.0000 S1000
G1 F1000 X9.2429 Y460.2429 Z-6.0000 S1000
G1 F1000 X9.5901 Y460.0109 Z-6.0000 S1000
G1 F1000 X10.0000 Y459.9294 Z-6.0000 S1000
G1 F1000 X10.4099 Y460.0109 Z-6.0000 S1000
; Starting inflateGrp: Closed?:true
G1 F300 Z-7.5000
G1 F1000 X10.7571 Y460.2429 Z-7.5000 S1000
G1 F1000 X10.9891 Y460.5901 Z-7.5000 S1000
G1 F1000 X11.0706 Y461.0000 Z-7.5000 S1000
G1 F1000 X10.9891 Y461.4099 Z-7.5000 S1000
G1 F1000 X10.7571 Y461.7571 Z-7.5000 S1000
G1 F1000 X10.4099 Y461.9891 Z-7.5000 S1000
G1 F1000 X10.0000 Y462.0706 Z-7.5000 S1000
G1 F1000 X9.5901 Y461.9891 Z-7.5000 S1000
G1 F1000 X9.2429 Y461.7571 Z-7.5000 S1000
G1 F1000 X9.0109 Y461.4099 Z-7.5000 S1000
G1 F1000 X8.9294 Y461.0000 Z-7.5000 S1000
G1 F1000 X9.0109 Y460.5901 Z-7.5000 S1000
G1 F1000 X9.2429 Y460.2429 Z-7.5000 S1000
G1 F1000 X9.5901 Y460.0109 Z-7.5000 S1000
G1 F1000 X10.0000 Y459.9294 Z-7.5000 S1000
G1 F1000 X10.4099 Y460.0109 Z-7.5000 S1000
; Starting inflateGrp: Closed?:true
G1 F300 Z-8.2000
G1 F1000 X10.7571 Y460.2429 Z-8.2000 S1000
G1 F1000 X10.9891 Y460.5901 Z-8.2000 S1000
G1 F1000 X11.0706 Y461.0000 Z-8.2000 S1000
G1 F1000 X10.9891 Y461.4099 Z-8.2000 S1000
G1 F1000 X10.7571 Y461.7571 Z-8.2000 S1000
G1 F1000 X10.4099 Y461.9891 Z-8.2000 S1000
G1 F1000 X10.0000 Y462.0706 Z-8.2000 S1000
G1 F1000 X9.5901 Y461.9891 Z-8.2000 S1000
G1 F1000 X9.2429 Y461.7571 Z-8.2000 S1000
G1 F1000 X9.0109 Y461.4099 Z-8.2000 S1000
G1 F1000 X8.9294 Y461.0000 Z-8.2000 S1000
G1 F1000 X9.0109 Y460.5901 Z-8.2000 S1000
G1 F1000 X9.2429 Y460.2429 Z-8.2000 S1000
G1 F1000 X9.5901 Y460.0109 Z-8.2000 S1000
G1 F1000 X10.0000 Y459.9294 Z-8.2000 S1000
G1 F1000 X10.4099 Y460.0109 Z-8.2000 S1000
; Starting inflateGrp: Closed?:true

G0 Z10
G0 X50.4099 Y500.0109

G0 Z0
G1 F300 Z-1.5000
G1 F1000 X50.7571 Y500.2429 Z-1.5000 S1000
G1 F1000 X50.9891 Y500.5901 Z-1.5000 S1000
G1 F1000 X51.0706 Y501.0000 Z-1.5000 S1000
G1 F1000 X50.9891 Y501.4099 Z-1.5000 S1000
G1 F1000 X50.7571 Y501.7571 Z-1.5000 S1000
G1 F1000 X50.4099 Y501.9891 Z-1.5000 S1000
G1 F1000 X50.0000 Y502.0706 Z-1.5000 S1000
G1 F1000 X49.5901 Y501.9891 Z-1.5000 S1000
G1 F1000 X49.2429 Y501.7571 Z-1.5000 S1000
G1 F1000 X49.0109 Y501.4099 Z-1.5000 S1000
G1 F1000 X48.9294 Y501.0000 Z-1.5000 S1000
G1 F1000 X49.0109 Y500.5901 Z-1.5000 S1000
G1 F1000 X49.2429 Y500.2429 Z-1.5000 S1000
G1 F1000 X49.5901 Y500.0109 Z-1.5000 S1000
G1 F1000 X50.0000 Y499.9294 Z-1.5000 S1000
G1 F1000 X50.4099 Y500.0109 Z-1.5000 S1000
; Starting inflateGrp: Closed?:true
G1 F300 Z-3.0000
G1 F1000 X50.7571 Y500.2429 Z-3.0000 S1000
G1 F1000 X50.9891 Y500.5901 Z-3.0000 S1000
G1 F1000 X51.0706 Y501.0000 Z-3.0000 S1000
G1 F1000 X50.9891 Y501.4099 Z-3.0000 S1000
G1 F1000 X50.7571 Y501.7571 Z-3.0000 S1000
G1 F1000 X50.4099 Y501.9891 Z-3.0000 S1000
G1 F1000 X50.0000 Y502.0706 Z-3.0000 S1000
G1 F1000 X49.5901 Y501.9891 Z-3.0000 S1000
G1 F1000 X49.2429 Y501.7571 Z-3.0000 S1000
G1 F1000 X49.0109 Y501.4099 Z-3.0000 S1000
G1 F1000 X48.9294 Y501.0000 Z-3.0000 S1000
G1 F1000 X49.0109 Y500.5901 Z-3.0000 S1000
G1 F1000 X49.2429 Y500.2429 Z-3.0000 S1000
G1 F1000 X49.5901 Y500.0109 Z-3.0000 S1000
G1 F1000 X50.0000 Y499.9294 Z-3.0000 S1000
G1 F1000 X50.4099 Y500.0109 Z-3.0000 S1000
; Starting inflateGrp: Closed?:true
G1 F300 Z-4.5000
G1 F1000 X50.7571 Y500.2429 Z-4.5000 S1000
G1 F1000 X50.9891 Y500.5901 Z-4.5000 S1000
G1 F1000 X51.0706 Y501.0000 Z-4.5000 S1000
G1 F1000 X50.9891 Y501.4099 Z-4.5000 S1000
G1 F1000 X50.7571 Y501.7571 Z-4.5000 S1000
G1 F1000 X50.4099 Y501.9891 Z-4.5000 S1000
G1 F1000 X50.0000 Y502.0706 Z-4.5000 S1000
G1 F1000 X49.5901 Y501.9891 Z-4.5000 S1000
G1 F1000 X49.2429 Y501.7571 Z-4.5000 S1000
G1 F1000 X49.0109 Y501.4099 Z-4.5000 S1000
G1 F1000 X48.9294 Y501.0000 Z-4.5000 S1000
G1 F1000 X49.0109 Y500.5901 Z-4.5000 S1000
G1 F1000 X49.2429 Y500.2429 Z-4.5000 S1000
G1 F1000 X49.5901 Y500.0109 Z-4.5000 S1000
G1 F1000 X50.0000 Y499.9294 Z-4.5000 S1000
G1 F1000 X50.4099 Y500.0109 Z-4.5000 S1000
; Starting inflateGrp: Closed?:true
G1 F300 Z-6.0000
G1 F1000 X50.7571 Y500.2429 Z-6.0000 S1000
G1 F1000 X50.9891 Y500.5901 Z-6.0000 S1000
G1 F1000 X51.0706 Y501.0000 Z-6.0000 S1000
G1 F1000 X50.9891 Y501.4099 Z-6.0000 S1000
G1 F1000 X50.7571 Y501.7571 Z-6.0000 S1000
G1 F1000 X50.4099 Y501.9891 Z-6.0000 S1000
G1 F1000 X50.0000 Y502.0706 Z-6.0000 S1000
G1 F1000 X49.5901 Y501.9891 Z-6.0000 S1000
G1 F1000 X49.2429 Y501.7571 Z-6.0000 S1000
G1 F1000 X49.0109 Y501.4099 Z-6.0000 S1000
G1 F1000 X48.9294 Y501.0000 Z-6.0000 S1000
G1 F1000 X49.0109 Y500.5901 Z-6.0000 S1000
G1 F1000 X49.2429 Y500.2429 Z-6.0000 S1000
G1 F1000 X49.5901 Y500.0109 Z-6.0000 S1000
G1 F1000 X50.0000 Y499.9294 Z-6.0000 S1000
G1 F1000 X50.4099 Y500.0109 Z-6.0000 S1000
; Starting inflateGrp: Closed?:true
G1 F300 Z-7.5000
G1 F1000 X50.7571 Y500.2429 Z-7.5000 S1000
G1 F1000 X50.9891 Y500.5901 Z-7.5000 S1000
G1 F1000 X51.0706 Y501.0000 Z-7.5000 S1000
G1 F1000 X50.9891 Y501.4099 Z-7.5000 S1000
G1 F1000 X50.7571 Y501.7571 Z-7.5000 S1000
G1 F1000 X50.4099 Y501.9891 Z-7.5000 S1000
G1 F1000 X50.0000 Y502.0706 Z-7.5000 S1000
G1 F1000 X49.5901 Y501.9891 Z-7.5000 S1000
G1 F1000 X49.2429 Y501.7571 Z-7.5000 S1000
G1 F1000 X49.0109 Y501.4099 Z-7.5000 S1000
G1 F1000 X48.9294 Y501.0000 Z-7.5000 S1000
G1 F1000 X49.0109 Y500.5901 Z-7.5000 S1000
G1 F1000 X49.2429 Y500.2429 Z-7.5000 S1000
G1 F1000 X49.5901 Y500.0109 Z-7.5000 S1000
G1 F1000 X50.0000 Y499.9294 Z-7.5000 S1000
G1 F1000 X50.4099 Y500.0109 Z-7.5000 S1000
; Starting inflateGrp: Closed?:true
G1 F300 Z-8.2000
G1 F1000 X50.7571 Y500.2429 Z-8.2000 S1000
G1 F1000 X50.9891 Y500.5901 Z-8.2000 S1000
G1 F1000 X51.0706 Y501.0000 Z-8.2000 S1000
G1 F1000 X50.9891 Y501.4099 Z-8.2000 S1000
G1 F1000 X50.7571 Y501.7571 Z-8.2000 S1000
G1 F1000 X50.4099 Y501.9891 Z-8.2000 S1000
G1 F1000 X50.0000 Y502.0706 Z-8.2000 S1000
G1 F1000 X49.5901 Y501.9891 Z-8.2000 S1000
G1 F1000 X49.2429 Y501.7571 Z-8.2000 S1000
G1 F1000 X49.0109 Y501.4099 Z-8.2000 S1000
G1 F1000 X48.9294 Y501.0000 Z-8.2000 S1000
G1 F1000 X49.0109 Y500.5901 Z-8.2000 S1000
G1 F1000 X49.2429 Y500.2429 Z-8.2000 S1000
G1 F1000 X49.5901 Y500.0109 Z-8.2000 S1000
G1 F1000 X50.0000 Y499.9294 Z-8.2000 S1000
G1 F1000 X50.4099 Y500.0109 Z-8.2000 S1000
; retracting back to z-safe
G0 Z10
; Operation 1: CNC: Vector (path inside)
; Tool Diameter: 3
; Starting inflateGrp: Closed?:true

G0 Z10
G0 F1000 X207.9999 Y288.0002

G0 Z0
G1 F300 Z-1.5000
G1 F1000 X208.0794 Y288.4820 Z-1.5000 S1000
G1 F1000 X208.3093 Y288.9127 Z-1.5000 S1000
G1 F1000 X208.6655 Y289.2467 Z-1.5000 S1000
G1 F1000 X209.1100 Y289.4486 Z-1.5000 S1000
G1 F1000 X209.4999 Y289.5002 Z-1.5000 S1000
G1 F1000 X224.9999 Y289.5002 Z-1.5000 S1000
G1 F1000 X224.9999 Y301.4998 Z-1.5000 S1000
G1 F1000 X209.4999 Y301.4998 Z-1.5000 S1000
G1 F1000 X209.0181 Y301.5793 Z-1.5000 S1000
G1 F1000 X208.5874 Y301.8092 Z-1.5000 S1000
G1 F1000 X208.2534 Y302.1654 Z-1.5000 S1000
G1 F1000 X208.0515 Y302.6099 Z-1.5000 S1000
G1 F1000 X207.9999 Y302.9998 Z-1.5000 S1000
G1 F1000 X207.9999 Y345.0000 Z-1.5000 S1000
G1 F1000 X207.0001 Y345.0000 Z-1.5000 S1000
G1 F1000 X207.0001 Y326.5002 Z-1.5000 S1000
G1 F1000 X206.9206 Y326.0184 Z-1.5000 S1000
G1 F1000 X206.6907 Y325.5877 Z-1.5000 S1000
G1 F1000 X206.3345 Y325.2537 Z-1.5000 S1000
G1 F1000 X205.8900 Y325.0518 Z-1.5000 S1000
G1 F1000 X205.5001 Y325.0002 Z-1.5000 S1000
G1 F1000 X185.4998 Y325.0002 Z-1.5000 S1000
G1 F1000 X185.0180 Y325.0797 Z-1.5000 S1000
G1 F1000 X184.5873 Y325.3096 Z-1.5000 S1000
G1 F1000 X184.2533 Y325.6658 Z-1.5000 S1000
G1 F1000 X184.0514 Y326.1103 Z-1.5000 S1000
G1 F1000 X183.9998 Y326.5002 Z-1.5000 S1000
G1 F1000 X183.9998 Y345.0000 Z-1.5000 S1000
G1 F1000 X183.0000 Y345.0000 Z-1.5000 S1000
G1 F1000 X183.0000 Y302.9998 Z-1.5000 S1000
G1 F1000 X182.9205 Y302.5180 Z-1.5000 S1000
G1 F1000 X182.6906 Y302.0873 Z-1.5000 S1000
G1 F1000 X182.3344 Y301.7533 Z-1.5000 S1000
G1 F1000 X181.8899 Y301.5514 Z-1.5000 S1000
G1 F1000 X181.5000 Y301.4998 Z-1.5000 S1000
G1 F1000 X166.0000 Y301.4998 Z-1.5000 S1000
G1 F1000 X166.0000 Y289.5002 Z-1.5000 S1000
G1 F1000 X181.5000 Y289.5002 Z-1.5000 S1000
G1 F1000 X181.9818 Y289.4207 Z-1.5000 S1000
G1 F1000 X182.4125 Y289.1908 Z-1.5000 S1000
G1 F1000 X182.7465 Y288.8346 Z-1.5000 S1000
G1 F1000 X182.9484 Y288.3901 Z-1.5000 S1000
G1 F1000 X183.0000 Y288.0002 Z-1.5000 S1000
G1 F1000 X183.0000 Y286.0001 Z-1.5000 S1000
G1 F1000 X207.9999 Y286.0001 Z-1.5000 S1000
G1 F1000 X207.9999 Y288.0002 Z-1.5000 S1000
; Starting inflateGrp: Closed?:true
G1 F300 Z-3.0000
G1 F1000 X208.0794 Y288.4820 Z-3.0000 S1000
G1 F1000 X208.3093 Y288.9127 Z-3.0000 S1000
G1 F1000 X208.6655 Y289.2467 Z-3.0000 S1000
G1 F1000 X209.1100 Y289.4486 Z-3.0000 S1000
G1 F1000 X209.4999 Y289.5002 Z-3.0000 S1000
G1 F1000 X224.9999 Y289.5002 Z-3.0000 S1000
G1 F1000 X224.9999 Y301.4998 Z-3.0000 S1000
G1 F1000 X209.4999 Y301.4998 Z-3.0000 S1000
G1 F1000 X209.0181 Y301.5793 Z-3.0000 S1000
G1 F1000 X208.5874 Y301.8092 Z-3.0000 S1000
G1 F1000 X208.2534 Y302.1654 Z-3.0000 S1000
G1 F1000 X208.0515 Y302.6099 Z-3.0000 S1000
G1 F1000 X207.9999 Y302.9998 Z-3.0000 S1000
G1 F1000 X207.9999 Y345.0000 Z-3.0000 S1000
G1 F1000 X207.0001 Y345.0000 Z-3.0000 S1000
G1 F1000 X207.0001 Y326.5002 Z-3.0000 S1000
G1 F1000 X206.9206 Y326.0184 Z-3.0000 S1000
G1 F1000 X206.6907 Y325.5877 Z-3.0000 S1000
G1 F1000 X206.3345 Y325.2537 Z-3.0000 S1000
G1 F1000 X205.8900 Y325.0518 Z-3.0000 S1000
G1 F1000 X205.5001 Y325.0002 Z-3.0000 S1000
G1 F1000 X185.4998 Y325.0002 Z-3.0000 S1000
G1 F1000 X185.0180 Y325.0797 Z-3.0000 S1000
G1 F1000 X184.5873 Y325.3096 Z-3.0000 S1000
G1 F1000 X184.2533 Y325.6658 Z-3.0000 S1000
G1 F1000 X184.0514 Y326.1103 Z-3.0000 S1000
G1 F1000 X183.9998 Y326.5002 Z-3.0000 S1000
G1 F1000 X183.9998 Y345.0000 Z-3.0000 S1000
G1 F1000 X183.0000 Y345.0000 Z-3.0000 S1000
G1 F1000 X183.0000 Y302.9998 Z-3.0000 S1000
G1 F1000 X182.9205 Y302.5180 Z-3.0000 S1000
G1 F1000 X182.6906 Y302.0873 Z-3.0000 S1000
G1 F1000 X182.3344 Y301.7533 Z-3.0000 S1000
G1 F1000 X181.8899 Y301.5514 Z-3.0000 S1000
G1 F1000 X181.5000 Y301.4998 Z-3.0000 S1000
G1 F1000 X166.0000 Y301.4998 Z-3.0000 S1000
G1 F1000 X166.0000 Y289.5002 Z-3.0000 S1000
G1 F1000 X181.5000 Y289.5002 Z-3.0000 S1000
G1 F1000 X181.9818 Y289.4207 Z-3.0000 S1000
G1 F1000 X182.4125 Y289.1908 Z-3.0000 S1000
G1 F1000 X182.7465 Y288.8346 Z-3.0000 S1000
G1 F1000 X182.9484 Y288.3901 Z-3.0000 S1000
G1 F1000 X183.0000 Y288.0002 Z-3.0000 S1000
G1 F1000 X183.0000 Y286.0001 Z-3.0000 S1000
G1 F1000 X207.9999 Y286.0001 Z-3.0000 S1000
G1 F1000 X207.9999 Y288.0002 Z-3.0000 S1000
; Starting inflateGrp: Closed?:true
G1 F300 Z-4.5000
G1 F1000 X208.0794 Y288.4820 Z-4.5000 S1000
G1 F1000 X208.3093 Y288.9127 Z-4.5000 S1000
G1 F1000 X208.6655 Y289.2467 Z-4.5000 S1000
G1 F1000 X209.1100 Y289.4486 Z-4.5000 S1000
G1 F1000 X209.4999 Y289.5002 Z-4.5000 S1000
G1 F1000 X224.9999 Y289.5002 Z-4.5000 S1000
G1 F1000 X224.9999 Y301.4998 Z-4.5000 S1000
G1 F1000 X209.4999 Y301.4998 Z-4.5000 S1000
G1 F1000 X209.0181 Y301.5793 Z-4.5000 S1000
G1 F1000 X208.5874 Y301.8092 Z-4.5000 S1000
G1 F1000 X208.2534 Y302.1654 Z-4.5000 S1000
G1 F1000 X208.0515 Y302.6099 Z-4.5000 S1000
G1 F1000 X207.9999 Y302.9998 Z-4.5000 S1000
G1 F1000 X207.9999 Y345.0000 Z-4.5000 S1000
G1 F1000 X207.0001 Y345.0000 Z-4.5000 S1000
G1 F1000 X207.0001 Y326.5002 Z-4.5000 S1000
G1 F1000 X206.9206 Y326.0184 Z-4.5000 S1000
G1 F1000 X206.6907 Y325.5877 Z-4.5000 S1000
G1 F1000 X206.3345 Y325.2537 Z-4.5000 S1000
G1 F1000 X205.8900 Y325.0518 Z-4.5000 S1000
G1 F1000 X205.5001 Y325.0002 Z-4.5000 S1000
G1 F1000 X185.4998 Y325.0002 Z-4.5000 S1000
G1 F1000 X185.0180 Y325.0797 Z-4.5000 S1000
G1 F1000 X184.5873 Y325.3096 Z-4.5000 S1000
G1 F1000 X184.2533 Y325.6658 Z-4.5000 S1000
G1 F1000 X184.0514 Y326.1103 Z-4.5000 S1000
G1 F1000 X183.9998 Y326.5002 Z-4.5000 S1000
G1 F1000 X183.9998 Y345.0000 Z-4.5000 S1000
G1 F1000 X183.0000 Y345.0000 Z-4.5000 S1000
G1 F1000 X183.0000 Y302.9998 Z-4.5000 S1000
G1 F1000 X182.9205 Y302.5180 Z-4.5000 S1000
G1 F1000 X182.6906 Y302.0873 Z-4.5000 S1000
G1 F1000 X182.3344 Y301.7533 Z-4.5000 S1000
G1 F1000 X181.8899 Y301.5514 Z-4.5000 S1000
G1 F1000 X181.5000 Y301.4998 Z-4.5000 S1000
G1 F1000 X166.0000 Y301.4998 Z-4.5000 S1000
G1 F1000 X166.0000 Y289.5002 Z-4.5000 S1000
G1 F1000 X181.5000 Y289.5002 Z-4.5000 S1000
G1 F1000 X181.9818 Y289.4207 Z-4.5000 S1000
G1 F1000 X182.4125 Y289.1908 Z-4.5000 S1000
G1 F1000 X182.7465 Y288.8346 Z-4.5000 S1000
G1 F1000 X182.9484 Y288.3901 Z-4.5000 S1000
G1 F1000 X183.0000 Y288.0002 Z-4.5000 S1000
G1 F1000 X183.0000 Y286.0001 Z-4.5000 S1000
G1 F1000 X207.9999 Y286.0001 Z-4.5000 S1000
G1 F1000 X207.9999 Y288.0002 Z-4.5000 S1000
; Starting inflateGrp: Closed?:true
G1 F300 Z-6.0000
G1 F1000 X208.0794 Y288.4820 Z-6.0000 S1000
G1 F1000 X208.3093 Y288.9127 Z-6.0000 S1000
G1 F1000 X208.6655 Y289.2467 Z-6.0000 S1000
G1 F1000 X209.1100 Y289.4486 Z-6.0000 S1000
G1 F1000 X209.4999 Y289.5002 Z-6.0000 S1000
G1 F1000 X224.9999 Y289.5002 Z-6.0000 S1000
G1 F1000 X224.9999 Y301.4998 Z-6.0000 S1000
G1 F1000 X209.4999 Y301.4998 Z-6.0000 S1000
G1 F1000 X209.0181 Y301.5793 Z-6.0000 S1000
G1 F1000 X208.5874 Y301.8092 Z-6.0000 S1000
G1 F1000 X208.2534 Y302.1654 Z-6.0000 S1000
G1 F1000 X208.0515 Y302.6099 Z-6.0000 S1000
G1 F1000 X207.9999 Y302.9998 Z-6.0000 S1000
G1 F1000 X207.9999 Y345.0000 Z-6.0000 S1000
G1 F1000 X207.0001 Y345.0000 Z-6.0000 S1000
G1 F1000 X207.0001 Y326.5002 Z-6.0000 S1000
G1 F1000 X206.9206 Y326.0184 Z-6.0000 S1000
G1 F1000 X206.6907 Y325.5877 Z-6.0000 S1000
G1 F1000 X206.3345 Y325.2537 Z-6.0000 S1000
G1 F1000 X205.8900 Y325.0518 Z-6.0000 S1000
G1 F1000 X205.5001 Y325.0002 Z-6.0000 S1000
G1 F1000 X185.4998 Y325.0002 Z-6.0000 S1000
G1 F1000 X185.0180 Y325.0797 Z-6.0000 S1000
G1 F1000 X184.5873 Y325.3096 Z-6.0000 S1000
G1 F1000 X184.2533 Y325.6658 Z-6.0000 S1000
G1 F1000 X184.0514 Y326.1103 Z-6.0000 S1000
G1 F1000 X183.9998 Y326.5002 Z-6.0000 S1000
G1 F1000 X183.9998 Y345.0000 Z-6.0000 S1000
G1 F1000 X183.0000 Y345.0000 Z-6.0000 S1000
G1 F1000 X183.0000 Y302.9998 Z-6.0000 S1000
G1 F1000 X182.9205 Y302.5180 Z-6.0000 S1000
G1 F1000 X182.6906 Y302.0873 Z-6.0000 S1000
G1 F1000 X182.3344 Y301.7533 Z-6.0000 S1000
G1 F1000 X181.8899 Y301.5514 Z-6.0000 S1000
G1 F1000 X181.5000 Y301.4998 Z-6.0000 S1000
G1 F1000 X166.0000 Y301.4998 Z-6.0000 S1000
G1 F1000 X166.0000 Y289.5002 Z-6.0000 S1000
G1 F1000 X181.5000 Y289.5002 Z-6.0000 S1000
G1 F1000 X181.9818 Y289.4207 Z-6.0000 S1000
G1 F1000 X182.4125 Y289.1908 Z-6.0000 S1000
G1 F1000 X182.7465 Y288.8346 Z-6.0000 S1000
G1 F1000 X182.9484 Y288.3901 Z-6.0000 S1000
G1 F1000 X183.0000 Y288.0002 Z-6.0000 S1000
G1 F1000 X183.0000 Y286.0001 Z-6.0000 S1000
G1 F1000 X207.9999 Y286.0001 Z-6.0000 S1000
G1 F1000 X207.9999 Y288.0002 Z-6.0000 S1000
; Starting inflateGrp: Closed?:true
G1 F300 Z-7.5000
G1 F1000 X208.0794 Y288.4820 Z-7.5000 S1000
G1 F1000 X208.3093 Y288.9127 Z-7.5000 S1000
G1 F1000 X208.6655 Y289.2467 Z-7.5000 S1000
G1 F1000 X209.1100 Y289.4486 Z-7.5000 S1000
G1 F1000 X209.4999 Y289.5002 Z-7.5000 S1000
G1 F1000 X224.9999 Y289.5002 Z-7.5000 S1000
G1 F1000 X224.9999 Y301.4998 Z-7.5000 S1000
G1 F1000 X209.4999 Y301.4998 Z-7.5000 S1000
G1 F1000 X209.0181 Y301.5793 Z-7.5000 S1000
G1 F1000 X208.5874 Y301.8092 Z-7.5000 S1000
G1 F1000 X208.2534 Y302.1654 Z-7.5000 S1000
G1 F1000 X208.0515 Y302.6099 Z-7.5000 S1000
G1 F1000 X207.9999 Y302.9998 Z-7.5000 S1000
G1 F1000 X207.9999 Y345.0000 Z-7.5000 S1000
G1 F1000 X207.0001 Y345.0000 Z-7.5000 S1000
G1 F1000 X207.0001 Y326.5002 Z-7.5000 S1000
G1 F1000 X206.9206 Y326.0184 Z-7.5000 S1000
G1 F1000 X206.6907 Y325.5877 Z-7.5000 S1000
G1 F1000 X206.3345 Y325.2537 Z-7.5000 S1000
G1 F1000 X205.8900 Y325.0518 Z-7.5000 S1000
G1 F1000 X205.5001 Y325.0002 Z-7.5000 S1000
G1 F1000 X185.4998 Y325.0002 Z-7.5000 S1000
G1 F1000 X185.0180 Y325.0797 Z-7.5000 S1000
G1 F1000 X184.5873 Y325.3096 Z-7.5000 S1000
G1 F1000 X184.2533 Y325.6658 Z-7.5000 S1000
G1 F1000 X184.0514 Y326.1103 Z-7.5000 S1000
G1 F1000 X183.9998 Y326.5002 Z-7.5000 S1000
G1 F1000 X183.9998 Y345.0000 Z-7.5000 S1000
G1 F1000 X183.0000 Y345.0000 Z-7.5000 S1000
G1 F1000 X183.0000 Y302.9998 Z-7.5000 S1000
G1 F1000 X182.9205 Y302.5180 Z-7.5000 S1000
G1 F1000 X182.6906 Y302.0873 Z-7.5000 S1000
G1 F1000 X182.3344 Y301.7533 Z-7.5000 S1000
G1 F1000 X181.8899 Y301.5514 Z-7.5000 S1000
G1 F1000 X181.5000 Y301.4998 Z-7.5000 S1000
G1 F1000 X166.0000 Y301.4998 Z-7.5000 S1000
G1 F1000 X166.0000 Y289.5002 Z-7.5000 S1000
G1 F1000 X181.5000 Y289.5002 Z-7.5000 S1000
G1 F1000 X181.9818 Y289.4207 Z-7.5000 S1000
G1 F1000 X182.4125 Y289.1908 Z-7.5000 S1000
G1 F1000 X182.7465 Y288.8346 Z-7.5000 S1000
G1 F1000 X182.9484 Y288.3901 Z-7.5000 S1000
G1 F1000 X183.0000 Y288.0002 Z-7.5000 S1000
G1 F1000 X183.0000 Y286.0001 Z-7.5000 S1000
G1 F1000 X207.9999 Y286.0001 Z-7.5000 S1000
G1 F1000 X207.9999 Y288.0002 Z-7.5000 S1000
; Starting inflateGrp: Closed?:true
G1 F300 Z-8.2000
G1 F1000 X208.0794 Y288.4820 Z-8.2000 S1000
G1 F1000 X208.3093 Y288.9127 Z-8.2000 S1000
G1 F1000 X208.6655 Y289.2467 Z-8.2000 S1000
G1 F1000 X209.1100 Y289.4486 Z-8.2000 S1000
G1 F1000 X209.4999 Y289.5002 Z-8.2000 S1000
G1 F1000 X224.9999 Y289.5002 Z-8.2000 S1000
G1 F1000 X224.9999 Y301.4998 Z-8.2000 S1000
G1 F1000 X209.4999 Y301.4998 Z-8.2000 S1000
G1 F1000 X209.0181 Y301.5793 Z-8.2000 S1000
G1 F1000 X208.5874 Y301.8092 Z-8.2000 S1000
G1 F1000 X208.2534 Y302.1654 Z-8.2000 S1000
G1 F1000 X208.0515 Y302.6099 Z-8.2000 S1000
G1 F1000 X207.9999 Y302.9998 Z-8.2000 S1000
G1 F1000 X207.9999 Y345.0000 Z-8.2000 S1000
G1 F1000 X207.0001 Y345.0000 Z-8.2000 S1000
G1 F1000 X207.0001 Y326.5002 Z-8.2000 S1000
G1 F1000 X206.9206 Y326.0184 Z-8.2000 S1000
G1 F1000 X206.6907 Y325.5877 Z-8.2000 S1000
G1 F1000 X206.3345 Y325.2537 Z-8.2000 S1000
G1 F1000 X205.8900 Y325.0518 Z-8.2000 S1000
G1 F1000 X205.5001 Y325.0002 Z-8.2000 S1000
G1 F1000 X185.4998 Y325.0002 Z-8.2000 S1000
G1 F1000 X185.0180 Y325.0797 Z-8.2000 S1000
G1 F1000 X184.5873 Y325.3096 Z-8.2000 S1000
G1 F1000 X184.2533 Y325.6658 Z-8.2000 S1000
G1 F1000 X184.0514 Y326.1103 Z-8.2000 S1000
G1 F1000 X183.9998 Y326.5002 Z-8.2000 S1000
G1 F1000 X183.9998 Y345.0000 Z-8.2000 S1000
G1 F1000 X183.0000 Y345.0000 Z-8.2000 S1000
G1 F1000 X183.0000 Y302.9998 Z-8.2000 S1000
G1 F1000 X182.9205 Y302.5180 Z-8.2000 S1000
G1 F1000 X182.6906 Y302.0873 Z-8.2000 S1000
G1 F1000 X182.3344 Y301.7533 Z-8.2000 S1000
G1 F1000 X181.8899 Y301.5514 Z-8.2000 S1000
G1 F1000 X181.5000 Y301.4998 Z-8.2000 S1000
G1 F1000 X166.0000 Y301.4998 Z-8.2000 S1000
G1 F1000 X166.0000 Y289.5002 Z-8.2000 S1000
G1 F1000 X181.5000 Y289.5002 Z-8.2000 S1000
G1 F1000 X181.9818 Y289.4207 Z-8.2000 S1000
G1 F1000 X182.4125 Y289.1908 Z-8.2000 S1000
G1 F1000 X182.7465 Y288.8346 Z-8.2000 S1000
G1 F1000 X182.9484 Y288.3901 Z-8.2000 S1000
G1 F1000 X183.0000 Y288.0002 Z-8.2000 S1000
G1 F1000 X183.0000 Y286.0001 Z-8.2000 S1000
G1 F1000 X207.9999 Y286.0001 Z-8.2000 S1000
G1 F1000 X207.9999 Y288.0002 Z-8.2000 S1000
; Starting inflateGrp: Closed?:true

G0 Z10
G0 X328.0000 Y288.0001

G0 Z0
G1 F300 Z-1.5000
G1 F1000 X328.0795 Y288.4819 Z-1.5000 S1000
G1 F1000 X328.3094 Y288.9126 Z-1.5000 S1000
G1 F1000 X328.6656 Y289.2466 Z-1.5000 S1000
G1 F1000 X329.1101 Y289.4485 Z-1.5000 S1000
G1 F1000 X329.5000 Y289.5001 Z-1.5000 S1000
G1 F1000 X344.9999 Y289.5001 Z-1.5000 S1000
G1 F1000 X344.9999 Y301.4997 Z-1.5000 S1000
G1 F1000 X329.5000 Y301.4997 Z-1.5000 S1000
G1 F1000 X329.0182 Y301.5792 Z-1.5000 S1000
G1 F1000 X328.5875 Y301.8091 Z-1.5000 S1000
G1 F1000 X328.2535 Y302.1653 Z-1.5000 S1000
G1 F1000 X328.0516 Y302.6098 Z-1.5000 S1000
G1 F1000 X328.0000 Y302.9997 Z-1.5000 S1000
G1 F1000 X328.0000 Y344.9999 Z-1.5000 S1000
G1 F1000 X327.0002 Y344.9999 Z-1.5000 S1000
G1 F1000 X327.0002 Y326.5001 Z-1.5000 S1000
G1 F1000 X326.9207 Y326.0183 Z-1.5000 S1000
G1 F1000 X326.6908 Y325.5876 Z-1.5000 S1000
G1 F1000 X326.3346 Y325.2536 Z-1.5000 S1000
G1 F1000 X325.8901 Y325.0517 Z-1.5000 S1000
G1 F1000 X325.5002 Y325.0001 Z-1.5000 S1000
G1 F1000 X305.4999 Y325.0001 Z-1.5000 S1000
G1 F1000 X305.0181 Y325.0796 Z-1.5000 S1000
G1 F1000 X304.5874 Y325.3095 Z-1.5000 S1000
G1 F1000 X304.2534 Y325.6657 Z-1.5000 S1000
G1 F1000 X304.0515 Y326.1102 Z-1.5000 S1000
G1 F1000 X303.9999 Y326.5001 Z-1.5000 S1000
G1 F1000 X303.9999 Y344.9999 Z-1.5000 S1000
G1 F1000 X303.0001 Y344.9999 Z-1.5000 S1000
G1 F1000 X303.0001 Y302.9997 Z-1.5000 S1000
G1 F1000 X302.9206 Y302.5179 Z-1.5000 S1000
G1 F1000 X302.6907 Y302.0872 Z-1.5000 S1000
G1 F1000 X302.3345 Y301.7532 Z-1.5000 S1000
G1 F1000 X301.8900 Y301.5513 Z-1.5000 S1000
G1 F1000 X301.5001 Y301.4997 Z-1.5000 S1000
G1 F1000 X286.0001 Y301.4997 Z-1.5000 S1000
G1 F1000 X286.0001 Y289.5001 Z-1.5000 S1000
G1 F1000 X301.5001 Y289.5001 Z-1.5000 S1000
G1 F1000 X301.9819 Y289.4206 Z-1.5000 S1000
G1 F1000 X302.4126 Y289.1907 Z-1.5000 S1000
G1 F1000 X302.7466 Y288.8345 Z-1.5000 S1000
G1 F1000 X302.9485 Y288.3900 Z-1.5000 S1000
G1 F1000 X303.0001 Y288.0001 Z-1.5000 S1000
G1 F1000 X303.0001 Y286.0001 Z-1.5000 S1000
G1 F1000 X328.0000 Y286.0001 Z-1.5000 S1000
G1 F1000 X328.0000 Y288.0001 Z-1.5000 S1000
; Starting inflateGrp: Closed?:true
G1 F300 Z-3.0000
G1 F1000 X328.0795 Y288.4819 Z-3.0000 S1000
G1 F1000 X328.3094 Y288.9126 Z-3.0000 S1000
G1 F1000 X328.6656 Y289.2466 Z-3.0000 S1000
G1 F1000 X329.1101 Y289.4485 Z-3.0000 S1000
G1 F1000 X329.5000 Y289.5001 Z-3.0000 S1000
G1 F1000 X344.9999 Y289.5001 Z-3.0000 S1000
G1 F1000 X344.9999 Y301.4997 Z-3.0000 S1000
G1 F1000 X329.5000 Y301.4997 Z-3.0000 S1000
G1 F1000 X329.0182 Y301.5792 Z-3.0000 S1000
G1 F1000 X328.5875 Y301.8091 Z-3.0000 S1000
G1 F1000 X328.2535 Y302.1653 Z-3.0000 S1000
G1 F1000 X328.0516 Y302.6098 Z-3.0000 S1000
G1 F1000 X328.0000 Y302.9997 Z-3.0000 S1000
G1 F1000 X328.0000 Y344.9999 Z-3.0000 S1000
G1 F1000 X327.0002 Y344.9999 Z-3.0000 S1000
G1 F1000 X327.0002 Y326.5001 Z-3.0000 S1000
G1 F1000 X326.9207 Y326.0183 Z-3.0000 S1000
G1 F1000 X326.6908 Y325.5876 Z-3.0000 S1000
G1 F1000 X326.3346 Y325.2536 Z-3.0000 S1000
G1 F1000 X325.8901 Y325.0517 Z-3.0000 S1000
G1 F1000 X325.5002 Y325.0001 Z-3.0000 S1000
G1 F1000 X305.4999 Y325.0001 Z-3.0000 S1000
G1 F1000 X305.0181 Y325.0796 Z-3.0000 S1000
G1 F1000 X304.5874 Y325.3095 Z-3.0000 S1000
G1 F1000 X304.2534 Y325.6657 Z-3.0000 S1000
G1 F1000 X304.0515 Y326.1102 Z-3.0000 S1000
G1 F1000 X303.9999 Y326.5001 Z-3.0000 S1000
G1 F1000 X303.9999 Y344.9999 Z-3.0000 S1000
G1 F1000 X303.0001 Y344.9999 Z-3.0000 S1000
G1 F1000 X303.0001 Y302.9997 Z-3.0000 S1000
G1 F1000 X302.9206 Y302.5179 Z-3.0000 S1000
G1 F1000 X302.6907 Y302.0872 Z-3.0000 S1000
G1 F1000 X302.3345 Y301.7532 Z-3.0000 S1000
G1 F1000 X301.8900 Y301.5513 Z-3.0000 S1000
G1 F1000 X301.5001 Y301.4997 Z-3.0000 S1000
G1 F1000 X286.0001 Y301.4997 Z-3.0000 S1000
G1 F1000 X286.0001 Y289.5001 Z-3.0000 S1000
G1 F1000 X301.5001 Y289.5001 Z-3.0000 S1000
G1 F1000 X301.9819 Y289.4206 Z-3.0000 S1000
G1 F1000 X302.4126 Y289.1907 Z-3.0000 S1000
G1 F1000 X302.7466 Y288.8345 Z-3.0000 S1000
G1 F1000 X302.9485 Y288.3900 Z-3.0000 S1000
G1 F1000 X303.0001 Y288.0001 Z-3.0000 S1000
G1 F1000 X303.0001 Y286.0001 Z-3.0000 S1000
G1 F1000 X328.0000 Y286.0001 Z-3.0000 S1000
G1 F1000 X328.0000 Y288.0001 Z-3.0000 S1000
; Starting inflateGrp: Closed?:true
G1 F300 Z-4.5000
G1 F1000 X328.0795 Y288.4819 Z-4.5000 S1000
G1 F1000 X328.3094 Y288.9126 Z-4.5000 S1000
G1 F1000 X328.6656 Y289.2466 Z-4.5000 S1000
G1 F1000 X329.1101 Y289.4485 Z-4.5000 S1000
G1 F1000 X329.5000 Y289.5001 Z-4.5000 S1000
G1 F1000 X344.9999 Y289.5001 Z-4.5000 S1000
G1 F1000 X344.9999 Y301.4997 Z-4.5000 S1000
G1 F1000 X329.5000 Y301.4997 Z-4.5000 S1000
G1 F1000 X329.0182 Y301.5792 Z-4.5000 S1000
G1 F1000 X328.5875 Y301.8091 Z-4.5000 S1000
G1 F1000 X328.2535 Y302.1653 Z-4.5000 S1000
G1 F1000 X328.0516 Y302.6098 Z-4.5000 S1000
G1 F1000 X328.0000 Y302.9997 Z-4.5000 S1000
G1 F1000 X328.0000 Y344.9999 Z-4.5000 S1000
G1 F1000 X327.0002 Y344.9999 Z-4.5000 S1000
G1 F1000 X327.0002 Y326.5001 Z-4.5000 S1000
G1 F1000 X326.9207 Y326.0183 Z-4.5000 S1000
G1 F1000 X326.6908 Y325.5876 Z-4.5000 S1000
G1 F1000 X326.3346 Y325.2536 Z-4.5000 S1000
G1 F1000 X325.8901 Y325.0517 Z-4.5000 S1000
G1 F1000 X325.5002 Y325.0001 Z-4.5000 S1000
G1 F1000 X305.4999 Y325.0001 Z-4.5000 S1000
G1 F1000 X305.0181 Y325.0796 Z-4.5000 S1000
G1 F1000 X304.5874 Y325.3095 Z-4.5000 S1000
G1 F1000 X304.2534 Y325.6657 Z-4.5000 S1000
G1 F1000 X304.0515 Y326.1102 Z-4.5000 S1000
G1 F1000 X303.9999 Y326.5001 Z-4.5000 S1000
G1 F1000 X303.9999 Y344.9999 Z-4.5000 S1000
G1 F1000 X303.0001 Y344.9999 Z-4.5000 S1000
G1 F1000 X303.0001 Y302.9997 Z-4.5000 S1000
G1 F1000 X302.9206 Y302.5179 Z-4.5000 S1000
G1 F1000 X302.6907 Y302.0872 Z-4.5000 S1000
G1 F1000 X302.3345 Y301.7532 Z-4.5000 S1000
G1 F1000 X301.8900 Y301.5513 Z-4.5000 S1000
G1 F1000 X301.5001 Y301.4997 Z-4.5000 S1000
G1 F1000 X286.0001 Y301.4997 Z-4.5000 S1000
G1 F1000 X286.0001 Y289.5001 Z-4.5000 S1000
G1 F1000 X301.5001 Y289.5001 Z-4.5000 S1000
G1 F1000 X301.9819 Y289.4206 Z-4.5000 S1000
G1 F1000 X302.4126 Y289.1907 Z-4.5000 S1000
G1 F1000 X302.7466 Y288.8345 Z-4.5000 S1000
G1 F1000 X302.9485 Y288.3900 Z-4.5000 S1000
G1 F1000 X303.0001 Y288.0001 Z-4.5000 S1000
G1 F1000 X303.0001 Y286.0001 Z-4.5000 S1000
G1 F1000 X328.0000 Y286.0001 Z-4.5000 S1000
G1 F1000 X328.0000 Y288.0001 Z-4.5000 S1000
; Starting inflateGrp: Closed?:true
G1 F300 Z-6.0000
G1 F1000 X328.0795 Y288.4819 Z-6.0000 S1000
G1 F1000 X328.3094 Y288.9126 Z-6.0000 S1000
G1 F1000 X328.6656 Y289.2466 Z-6.0000 S1000
G1 F1000 X329.1101 Y289.4485 Z-6.0000 S1000
G1 F1000 X329.5000 Y289.5001 Z-6.0000 S1000
G1 F1000 X344.9999 Y289.5001 Z-6.0000 S1000
G1 F1000 X344.9999 Y301.4997 Z-6.0000 S1000
G1 F1000 X329.5000 Y301.4997 Z-6.0000 S1000
G1 F1000 X329.0182 Y301.5792 Z-6.0000 S1000
G1 F1000 X328.5875 Y301.8091 Z-6.0000 S1000
G1 F1000 X328.2535 Y302.1653 Z-6.0000 S1000
G1 F1000 X328.0516 Y302.6098 Z-6.0000 S1000
G1 F1000 X328.0000 Y302.9997 Z-6.0000 S1000
G1 F1000 X328.0000 Y344.9999 Z-6.0000 S1000
G1 F1000 X327.0002 Y344.9999 Z-6.0000 S1000
G1 F1000 X327.0002 Y326.5001 Z-6.0000 S1000
G1 F1000 X326.9207 Y326.0183 Z-6.0000 S1000
G1 F1000 X326.6908 Y325.5876 Z-6.0000 S1000
G1 F1000 X326.3346 Y325.2536 Z-6.0000 S1000
G1 F1000 X325.8901 Y325.0517 Z-6.0000 S1000
G1 F1000 X325.5002 Y325.0001 Z-6.0000 S1000
G1 F1000 X305.4999 Y325.0001 Z-6.0000 S1000
G1 F1000 X305.0181 Y325.0796 Z-6.0000 S1000
G1 F1000 X304.5874 Y325.3095 Z-6.0000 S1000
G1 F1000 X304.2534 Y325.6657 Z-6.0000 S1000
G1 F1000 X304.0515 Y326.1102 Z-6.0000 S1000
G1 F1000 X303.9999 Y326.5001 Z-6.0000 S1000
G1 F1000 X303.9999 Y344.9999 Z-6.0000 S1000
G1 F1000 X303.0001 Y344.9999 Z-6.0000 S1000
G1 F1000 X303.0001 Y302.9997 Z-6.0000 S1000
G1 F1000 X302.9206 Y302.5179 Z-6.0000 S1000
G1 F1000 X302.6907 Y302.0872 Z-6.0000 S1000
G1 F1000 X302.3345 Y301.7532 Z-6.0000 S1000
G1 F1000 X301.8900 Y301.5513 Z-6.0000 S1000
G1 F1000 X301.5001 Y301.4997 Z-6.0000 S1000
G1 F1000 X286.0001 Y301.4997 Z-6.0000 S1000
G1 F1000 X286.0001 Y289.5001 Z-6.0000 S1000
G1 F1000 X301.5001 Y289.5001 Z-6.0000 S1000
G1 F1000 X301.9819 Y289.4206 Z-6.0000 S1000
G1 F1000 X302.4126 Y289.1907 Z-6.0000 S1000
G1 F1000 X302.7466 Y288.8345 Z-6.0000 S1000
G1 F1000 X302.9485 Y288.3900 Z-6.0000 S1000
G1 F1000 X303.0001 Y288.0001 Z-6.0000 S1000
G1 F1000 X303.0001 Y286.0001 Z-6.0000 S1000
G1 F1000 X328.0000 Y286.0001 Z-6.0000 S1000
G1 F1000 X328.0000 Y288.0001 Z-6.0000 S1000
; Starting inflateGrp: Closed?:true
G1 F300 Z-7.5000
G1 F1000 X328.0795 Y288.4819 Z-7.5000 S1000
G1 F1000 X328.3094 Y288.9126 Z-7.5000 S1000
G1 F1000 X328.6656 Y289.2466 Z-7.5000 S1000
G1 F1000 X329.1101 Y289.4485 Z-7.5000 S1000
G1 F1000 X329.5000 Y289.5001 Z-7.5000 S1000
G1 F1000 X344.9999 Y289.5001 Z-7.5000 S1000
G1 F1000 X344.9999 Y301.4997 Z-7.5000 S1000
G1 F1000 X329.5000 Y301.4997 Z-7.5000 S1000
G1 F1000 X329.0182 Y301.5792 Z-7.5000 S1000
G1 F1000 X328.5875 Y301.8091 Z-7.5000 S1000
G1 F1000 X328.2535 Y302.1653 Z-7.5000 S1000
G1 F1000 X328.0516 Y302.6098 Z-7.5000 S1000
G1 F1000 X328.0000 Y302.9997 Z-7.5000 S1000
G1 F1000 X328.0000 Y344.9999 Z-7.5000 S1000
G1 F1000 X327.0002 Y344.9999 Z-7.5000 S1000
G1 F1000 X327.0002 Y326.5001 Z-7.5000 S1000
G1 F1000 X326.9207 Y326.0183 Z-7.5000 S1000
G1 F1000 X326.6908 Y325.5876 Z-7.5000 S1000
G1 F1000 X326.3346 Y325.2536 Z-7.5000 S1000
G1 F1000 X325.8901 Y325.0517 Z-7.5000 S1000
G1 F1000 X325.5002 Y325.0001 Z-7.5000 S1000
G1 F1000 X305.4999 Y325.0001 Z-7.5000 S1000
G1 F1000 X305.0181 Y325.0796 Z-7.5000 S1000
G1 F1000 X304.5874 Y325.3095 Z-7.5000 S1000
G1 F1000 X304.2534 Y325.6657 Z-7.5000 S1000
G1 F1000 X304.0515 Y326.1102 Z-7.5000 S1000
G1 F1000 X303.9999 Y326.5001 Z-7.5000 S1000
G1 F1000 X303.9999 Y344.9999 Z-7.5000 S1000
G1 F1000 X303.0001 Y344.9999 Z-7.5000 S1000
G1 F1000 X303.0001 Y302.9997 Z-7.5000 S1000
G1 F1000 X302.9206 Y302.5179 Z-7.5000 S1000
G1 F1000 X302.6907 Y302.0872 Z-7.5000 S1000
G1 F1000 X302.3345 Y301.7532 Z-7.5000 S1000
G1 F1000 X301.8900 Y301.5513 Z-7.5000 S1000
G1 F1000 X301.5001 Y301.4997 Z-7.5000 S1000
G1 F1000 X286.0001 Y301.4997 Z-7.5000 S1000
G1 F1000 X286.0001 Y289.5001 Z-7.5000 S1000
G1 F1000 X301.5001 Y289.5001 Z-7.5000 S1000
G1 F1000 X301.9819 Y289.4206 Z-7.5000 S1000
G1 F1000 X302.4126 Y289.1907 Z-7.5000 S1000
G1 F1000 X302.7466 Y288.8345 Z-7.5000 S1000
G1 F1000 X302.9485 Y288.3900 Z-7.5000 S1000
G1 F1000 X303.0001 Y288.0001 Z-7.5000 S1000
G1 F1000 X303.0001 Y286.0001 Z-7.5000 S1000
G1 F1000 X328.0000 Y286.0001 Z-7.5000 S1000
G1 F1000 X328.0000 Y288.0001 Z-7.5000 S1000
; Starting inflateGrp: Closed?:true
G1 F300 Z-8.2000
G1 F1000 X328.0795 Y288.4819 Z-8.2000 S1000
G1 F1000 X328.3094 Y288.9126 Z-8.2000 S1000
G1 F1000 X328.6656 Y289.2466 Z-8.2000 S1000
G1 F1000 X329.1101 Y289.4485 Z-8.2000 S1000
G1 F1000 X329.5000 Y289.5001 Z-8.2000 S1000
G1 F1000 X344.9999 Y289.5001 Z-8.2000 S1000
G1 F1000 X344.9999 Y301.4997 Z-8.2000 S1000
G1 F1000 X329.5000 Y301.4997 Z-8.2000 S1000
G1 F1000 X329.0182 Y301.5792 Z-8.2000 S1000
G1 F1000 X328.5875 Y301.8091 Z-8.2000 S1000
G1 F1000 X328.2535 Y302.1653 Z-8.2000 S1000
G1 F1000 X328.0516 Y302.6098 Z-8.2000 S1000
G1 F1000 X328.0000 Y302.9997 Z-8.2000 S1000
G1 F1000 X328.0000 Y344.9999 Z-8.2000 S1000
G1 F1000 X327.0002 Y344.9999 Z-8.2000 S1000
G1 F1000 X327.0002 Y326.5001 Z-8.2000 S1000
G1 F1000 X326.9207 Y326.0183 Z-8.2000 S1000
G1 F1000 X326.6908 Y325.5876 Z-8.2000 S1000
G1 F1000 X326.3346 Y325.2536 Z-8.2000 S1000
G1 F1000 X325.8901 Y325.0517 Z-8.2000 S1000
G1 F1000 X325.5002 Y325.0001 Z-8.2000 S1000
G1 F1000 X305.4999 Y325.0001 Z-8.2000 S1000
G1 F1000 X305.0181 Y325.0796 Z-8.2000 S1000
G1 F1000 X304.5874 Y325.3095 Z-8.2000 S1000
G1 F1000 X304.2534 Y325.6657 Z-8.2000 S1000
G1 F1000 X304.0515 Y326.1102 Z-8.2000 S1000
G1 F1000 X303.9999 Y326.5001 Z-8.2000 S1000
G1 F1000 X303.9999 Y344.9999 Z-8.2000 S1000
G1 F1000 X303.0001 Y344.9999 Z-8.2000 S1000
G1 F1000 X303.0001 Y302.9997 Z-8.2000 S1000
G1 F1000 X302.9206 Y302.5179 Z-8.2000 S1000
G1 F1000 X302.6907 Y302.0872 Z-8.2000 S1000
G1 F1000 X302.3345 Y301.7532 Z-8.2000 S1000
G1 F1000 X301.8900 Y301.5513 Z-8.2000 S1000
G1 F1000 X301.5001 Y301.4997 Z-8.2000 S1000
G1 F1000 X286.0001 Y301.4997 Z-8.2000 S1000
G1 F1000 X286.0001 Y289.5001 Z-8.2000 S1000
G1 F1000 X301.5001 Y289.5001 Z-8.2000 S1000
G1 F1000 X301.9819 Y289.4206 Z-8.2000 S1000
G1 F1000 X302.4126 Y289.1907 Z-8.2000 S1000
G1 F1000 X302.7466 Y288.8345 Z-8.2000 S1000
G1 F1000 X302.9485 Y288.3900 Z-8.2000 S1000
G1 F1000 X303.0001 Y288.0001 Z-8.2000 S1000
G1 F1000 X303.0001 Y286.0001 Z-8.2000 S1000
G1 F1000 X328.0000 Y286.0001 Z-8.2000 S1000
G1 F1000 X328.0000 Y288.0001 Z-8.2000 S1000
; Starting inflateGrp: Closed?:true

G0 Z10
G0 X183.9999 Y184.4999

G0 Z0
G1 F300 Z-1.5000
G1 F1000 X184.0794 Y184.9817 Z-1.5000 S1000
G1 F1000 X184.3093 Y185.4124 Z-1.5000 S1000
G1 F1000 X184.6655 Y185.7464 Z-1.5000 S1000
G1 F1000 X185.1100 Y185.9483 Z-1.5000 S1000
G1 F1000 X185.4999 Y185.9999 Z-1.5000 S1000
G1 F1000 X205.5002 Y185.9999 Z-1.5000 S1000
G1 F1000 X205.9820 Y185.9204 Z-1.5000 S1000
G1 F1000 X206.4127 Y185.6905 Z-1.5000 S1000
G1 F1000 X206.7467 Y185.3343 Z-1.5000 S1000
G1 F1000 X206.9486 Y184.8898 Z-1.5000 S1000
G1 F1000 X207.0002 Y184.4999 Z-1.5000 S1000
G1 F1000 X207.0002 Y166.0001 Z-1.5000 S1000
G1 F1000 X208.0000 Y166.0001 Z-1.5000 S1000
G1 F1000 X208.0000 Y208.0003 Z-1.5000 S1000
G1 F1000 X208.0795 Y208.4821 Z-1.5000 S1000
G1 F1000 X208.3094 Y208.9128 Z-1.5000 S1000
G1 F1000 X208.6656 Y209.2468 Z-1.5000 S1000
G1 F1000 X209.1101 Y209.4487 Z-1.5000 S1000
G1 F1000 X209.5000 Y209.5003 Z-1.5000 S1000
G1 F1000 X224.9999 Y209.5003 Z-1.5000 S1000
G1 F1000 X224.9999 Y221.4999 Z-1.5000 S1000
G1 F1000 X209.5000 Y221.4999 Z-1.5000 S1000
G1 F1000 X209.0182 Y221.5794 Z-1.5000 S1000
G1 F1000 X208.5875 Y221.8093 Z-1.5000 S1000
G1 F1000 X208.2535 Y222.1655 Z-1.5000 S1000
G1 F1000 X208.0516 Y222.6100 Z-1.5000 S1000
G1 F1000 X208.0000 Y222.9999 Z-1.5000 S1000
G1 F1000 X208.0000 Y224.9999 Z-1.5000 S1000
G1 F1000 X183.0001 Y224.9999 Z-1.5000 S1000
G1 F1000 X183.0001 Y222.9999 Z-1.5000 S1000
G1 F1000 X182.9206 Y222.5181 Z-1.5000 S1000
G1 F1000 X182.6907 Y222.0874 Z-1.5000 S1000
G1 F1000 X182.3345 Y221.7534 Z-1.5000 S1000
G1 F1000 X181.8900 Y221.5515 Z-1.5000 S1000
G1 F1000 X181.5001 Y221.4999 Z-1.5000 S1000
G1 F1000 X166.0001 Y221.4999 Z-1.5000 S1000
G1 F1000 X166.0001 Y209.5003 Z-1.5000 S1000
G1 F1000 X181.5001 Y209.5003 Z-1.5000 S1000
G1 F1000 X181.9819 Y209.4208 Z-1.5000 S1000
G1 F1000 X182.4126 Y209.1909 Z-1.5000 S1000
G1 F1000 X182.7466 Y208.8347 Z-1.5000 S1000
G1 F1000 X182.9485 Y208.3902 Z-1.5000 S1000
G1 F1000 X183.0001 Y208.0003 Z-1.5000 S1000
G1 F1000 X183.0001 Y166.0001 Z-1.5000 S1000
G1 F1000 X183.9999 Y166.0001 Z-1.5000 S1000
G1 F1000 X183.9999 Y184.4999 Z-1.5000 S1000
; Starting inflateGrp: Closed?:true
G1 F300 Z-3.0000
G1 F1000 X184.0794 Y184.9817 Z-3.0000 S1000
G1 F1000 X184.3093 Y185.4124 Z-3.0000 S1000
G1 F1000 X184.6655 Y185.7464 Z-3.0000 S1000
G1 F1000 X185.1100 Y185.9483 Z-3.0000 S1000
G1 F1000 X185.4999 Y185.9999 Z-3.0000 S1000
G1 F1000 X205.5002 Y185.9999 Z-3.0000 S1000
G1 F1000 X205.9820 Y185.9204 Z-3.0000 S1000
G1 F1000 X206.4127 Y185.6905 Z-3.0000 S1000
G1 F1000 X206.7467 Y185.3343 Z-3.0000 S1000
G1 F1000 X206.9486 Y184.8898 Z-3.0000 S1000
G1 F1000 X207.0002 Y184.4999 Z-3.0000 S1000
G1 F1000 X207.0002 Y166.0001 Z-3.0000 S1000
G1 F1000 X208.0000 Y166.0001 Z-3.0000 S1000
G1 F1000 X208.0000 Y208.0003 Z-3.0000 S1000
G1 F1000 X208.0795 Y208.4821 Z-3.0000 S1000
G1 F1000 X208.3094 Y208.9128 Z-3.0000 S1000
G1 F1000 X208.6656 Y209.2468 Z-3.0000 S1000
G1 F1000 X209.1101 Y209.4487 Z-3.0000 S1000
G1 F1000 X209.5000 Y209.5003 Z-3.0000 S1000
G1 F1000 X224.9999 Y209.5003 Z-3.0000 S1000
G1 F1000 X224.9999 Y221.4999 Z-3.0000 S1000
G1 F1000 X209.5000 Y221.4999 Z-3.0000 S1000
G1 F1000 X209.0182 Y221.5794 Z-3.0000 S1000
G1 F1000 X208.5875 Y221.8093 Z-3.0000 S1000
G1 F1000 X208.2535 Y222.1655 Z-3.0000 S1000
G1 F1000 X208.0516 Y222.6100 Z-3.0000 S1000
G1 F1000 X208.0000 Y222.9999 Z-3.0000 S1000
G1 F1000 X208.0000 Y224.9999 Z-3.0000 S1000
G1 F1000 X183.0001 Y224.9999 Z-3.0000 S1000
G1 F1000 X183.0001 Y222.9999 Z-3.0000 S1000
G1 F1000 X182.9206 Y222.5181 Z-3.0000 S1000
G1 F1000 X182.6907 Y222.0874 Z-3.0000 S1000
G1 F1000 X182.3345 Y221.7534 Z-3.0000 S1000
G1 F1000 X181.8900 Y221.5515 Z-3.0000 S1000
G1 F1000 X181.5001 Y221.4999 Z-3.0000 S1000
G1 F1000 X166.0001 Y221.4999 Z-3.0000 S1000
G1 F1000 X166.0001 Y209.5003 Z-3.0000 S1000
G1 F1000 X181.5001 Y209.5003 Z-3.0000 S1000
G1 F1000 X181.9819 Y209.4208 Z-3.0000 S1000
G1 F1000 X182.4126 Y209.1909 Z-3.0000 S1000
G1 F1000 X182.7466 Y208.8347 Z-3.0000 S1000
G1 F1000 X182.9485 Y208.3902 Z-3.0000 S1000
G1 F1000 X183.0001 Y208.0003 Z-3.0000 S1000
G1 F1000 X183.0001 Y166.0001 Z-3.0000 S1000
G1 F1000 X183.9999 Y166.0001 Z-3.0000 S1000
G1 F1000 X183.9999 Y184.4999 Z-3.0000 S1000
; Starting inflateGrp: Closed?:true
G1 F300 Z-4.5000
G1 F1000 X184.0794 Y184.9817 Z-4.5000 S1000
G1 F1000 X184.3093 Y185.4124 Z-4.5000 S1000
G1 F1000 X184.6655 Y185.7464 Z-4.5000 S1000
G1 F1000 X185.1100 Y185.9483 Z-4.5000 S1000
G1 F1000 X185.4999 Y185.9999 Z-4.5000 S1000
G1 F1000 X205.5002 Y185.9999 Z-4.5000 S1000
G1 F1000 X205.9820 Y185.9204 Z-4.5000 S1000
G1 F1000 X206.4127 Y185.6905 Z-4.5000 S1000
G1 F1000 X206.7467 Y185.3343 Z-4.5000 S1000
G1 F1000 X206.9486 Y184.8898 Z-4.5000 S1000
G1 F1000 X207.0002 Y184.4999 Z-4.5000 S1000
G1 F1000 X207.0002 Y166.0001 Z-4.5000 S1000
G1 F1000 X208.0000 Y166.0001 Z-4.5000 S1000
G1 F1000 X208.0000 Y208.0003 Z-4.5000 S1000
G1 F1000 X208.0795 Y208.4821 Z-4.5000 S1000
G1 F1000 X208.3094 Y208.9128 Z-4.5000 S1000
G1 F1000 X208.6656 Y209.2468 Z-4.5000 S1000
G1 F1000 X209.1101 Y209.4487 Z-4.5000 S1000
G1 F1000 X209.5000 Y209.5003 Z-4.5000 S1000
G1 F1000 X224.9999 Y209.5003 Z-4.5000 S1000
G1 F1000 X224.9999 Y221.4999 Z-4.5000 S1000
G1 F1000 X209.5000 Y221.4999 Z-4.5000 S1000
G1 F1000 X209.0182 Y221.5794 Z-4.5000 S1000
G1 F1000 X208.5875 Y221.8093 Z-4.5000 S1000
G1 F1000 X208.2535 Y222.1655 Z-4.5000 S1000
G1 F1000 X208.0516 Y222.6100 Z-4.5000 S1000
G1 F1000 X208.0000 Y222.9999 Z-4.5000 S1000
G1 F1000 X208.0000 Y224.9999 Z-4.5000 S1000
G1 F1000 X183.0001 Y224.9999 Z-4.5000 S1000
G1 F1000 X183.0001 Y222.9999 Z-4.5000 S1000
G1 F1000 X182.9206 Y222.5181 Z-4.5000 S1000
G1 F1000 X182.6907 Y222.0874 Z-4.5000 S1000
G1 F1000 X182.3345 Y221.7534 Z-4.5000 S1000
G1 F1000 X181.8900 Y221.5515 Z-4.5000 S1000
G1 F1000 X181.5001 Y221.4999 Z-4.5000 S1000
G1 F1000 X166.0001 Y221.4999 Z-4.5000 S1000
G1 F1000 X166.0001 Y209.5003 Z-4.5000 S1000
G1 F1000 X181.5001 Y209.5003 Z-4.5000 S1000
G1 F1000 X181.9819 Y209.4208 Z-4.5000 S1000
G1 F1000 X182.4126 Y209.1909 Z-4.5000 S1000
G1 F1000 X182.7466 Y208.8347 Z-4.5000 S1000
G1 F1000 X182.9485 Y208.3902 Z-4.5000 S1000
G1 F1000 X183.0001 Y208.0003 Z-4.5000 S1000
G1 F1000 X183.0001 Y166.0001 Z-4.5000 S1000
G1 F1000 X183.9999 Y166.0001 Z-4.5000 S1000
G1 F1000 X183.9999 Y184.4999 Z-4.5000 S1000
; Starting inflateGrp: Closed?:true
G1 F300 Z-6.0000
G1 F1000 X184.0794 Y184.9817 Z-6.0000 S1000
G1 F1000 X184.3093 Y185.4124 Z-6.0000 S1000
G1 F1000 X184.6655 Y185.7464 Z-6.0000 S1000
G1 F1000 X185.1100 Y185.9483 Z-6.0000 S1000
G1 F1000 X185.4999 Y185.9999 Z-6.0000 S1000
G1 F1000 X205.5002 Y185.9999 Z-6.0000 S1000
G1 F1000 X205.9820 Y185.9204 Z-6.0000 S1000
G1 F1000 X206.4127 Y185.6905 Z-6.0000 S1000
G1 F1000 X206.7467 Y185.3343 Z-6.0000 S1000
G1 F1000 X206.9486 Y184.8898 Z-6.0000 S1000
G1 F1000 X207.0002 Y184.4999 Z-6.0000 S1000
G1 F1000 X207.0002 Y166.0001 Z-6.0000 S1000
G1 F1000 X208.0000 Y166.0001 Z-6.0000 S1000
G1 F1000 X208.0000 Y208.0003 Z-6.0000 S1000
G1 F1000 X208.0795 Y208.4821 Z-6.0000 S1000
G1 F1000 X208.3094 Y208.9128 Z-6.0000 S1000
G1 F1000 X208.6656 Y209.2468 Z-6.0000 S1000
G1 F1000 X209.1101 Y209.4487 Z-6.0000 S1000
G1 F1000 X209.5000 Y209.5003 Z-6.0000 S1000
G1 F1000 X224.9999 Y209.5003 Z-6.0000 S1000
G1 F1000 X224.9999 Y221.4999 Z-6.0000 S1000
G1 F1000 X209.5000 Y221.4999 Z-6.0000 S1000
G1 F1000 X209.0182 Y221.5794 Z-6.0000 S1000
G1 F1000 X208.5875 Y221.8093 Z-6.0000 S1000
G1 F1000 X208.2535 Y222.1655 Z-6.0000 S1000
G1 F1000 X208.0516 Y222.6100 Z-6.0000 S1000
G1 F1000 X208.0000 Y222.9999 Z-6.0000 S1000
G1 F1000 X208.0000 Y224.9999 Z-6.0000 S1000
G1 F1000 X183.0001 Y224.9999 Z-6.0000 S1000
G1 F1000 X183.0001 Y222.9999 Z-6.0000 S1000
G1 F1000 X182.9206 Y222.5181 Z-6.0000 S1000
G1 F1000 X182.6907 Y222.0874 Z-6.0000 S1000
G1 F1000 X182.3345 Y221.7534 Z-6.0000 S1000
G1 F1000 X181.8900 Y221.5515 Z-6.0000 S1000
G1 F1000 X181.5001 Y221.4999 Z-6.0000 S1000
G1 F1000 X166.0001 Y221.4999 Z-6.0000 S1000
G1 F1000 X166.0001 Y209.5003 Z-6.0000 S1000
G1 F1000 X181.5001 Y209.5003 Z-6.0000 S1000
G1 F1000 X181.9819 Y209.4208 Z-6.0000 S1000
G1 F1000 X182.4126 Y209.1909 Z-6.0000 S1000
G1 F1000 X182.7466 Y208.8347 Z-6.0000 S1000
G1 F1000 X182.9485 Y208.3902 Z-6.0000 S1000
G1 F1000 X183.0001 Y208.0003 Z-6.0000 S1000
G1 F1000 X183.0001 Y166.0001 Z-6.0000 S1000
G1 F1000 X183.9999 Y166.0001 Z-6.0000 S1000
G1 F1000 X183.9999 Y184.4999 Z-6.0000 S1000
; Starting inflateGrp: Closed?:true
G1 F300 Z-7.5000
G1 F1000 X184.0794 Y184.9817 Z-7.5000 S1000
G1 F1000 X184.3093 Y185.4124 Z-7.5000 S1000
G1 F1000 X184.6655 Y185.7464 Z-7.5000 S1000
G1 F1000 X185.1100 Y185.9483 Z-7.5000 S1000
G1 F1000 X185.4999 Y185.9999 Z-7.5000 S1000
G1 F1000 X205.5002 Y185.9999 Z-7.5000 S1000
G1 F1000 X205.9820 Y185.9204 Z-7.5000 S1000
G1 F1000 X206.4127 Y185.6905 Z-7.5000 S1000
G1 F1000 X206.7467 Y185.3343 Z-7.5000 S1000
G1 F1000 X206.9486 Y184.8898 Z-7.5000 S1000
G1 F1000 X207.0002 Y184.4999 Z-7.5000 S1000
G1 F1000 X207.0002 Y166.0001 Z-7.5000 S1000
G1 F1000 X208.0000 Y166.0001 Z-7.5000 S1000
G1 F1000 X208.0000 Y208.0003 Z-7.5000 S1000
G1 F1000 X208.0795 Y208.4821 Z-7.5000 S1000
G1 F1000 X208.3094 Y208.9128 Z-7.5000 S1000
G1 F1000 X208.6656 Y209.2468 Z-7.5000 S1000
G1 F1000 X209.1101 Y209.4487 Z-7.5000 S1000
G1 F1000 X209.5000 Y209.5003 Z-7.5000 S1000
G1 F1000 X224.9999 Y209.5003 Z-7.5000 S1000
G1 F1000 X224.9999 Y221.4999 Z-7.5000 S1000
G1 F1000 X209.5000 Y221.4999 Z-7.5000 S1000
G1 F1000 X209.0182 Y221.5794 Z-7.5000 S1000
G1 F1000 X208.5875 Y221.8093 Z-7.5000 S1000
G1 F1000 X208.2535 Y222.1655 Z-7.5000 S1000
G1 F1000 X208.0516 Y222.6100 Z-7.5000 S1000
G1 F1000 X208.0000 Y222.9999 Z-7.5000 S1000
G1 F1000 X208.0000 Y224.9999 Z-7.5000 S1000
G1 F1000 X183.0001 Y224.9999 Z-7.5000 S1000
G1 F1000 X183.0001 Y222.9999 Z-7.5000 S1000
G1 F1000 X182.9206 Y222.5181 Z-7.5000 S1000
G1 F1000 X182.6907 Y222.0874 Z-7.5000 S1000
G1 F1000 X182.3345 Y221.7534 Z-7.5000 S1000
G1 F1000 X181.8900 Y221.5515 Z-7.5000 S1000
G1 F1000 X181.5001 Y221.4999 Z-7.5000 S1000
G1 F1000 X166.0001 Y221.4999 Z-7.5000 S1000
G1 F1000 X166.0001 Y209.5003 Z-7.5000 S1000
G1 F1000 X181.5001 Y209.5003 Z-7.5000 S1000
G1 F1000 X181.9819 Y209.4208 Z-7.5000 S1000
G1 F1000 X182.4126 Y209.1909 Z-7.5000 S1000
G1 F1000 X182.7466 Y208.8347 Z-7.5000 S1000
G1 F1000 X182.9485 Y208.3902 Z-7.5000 S1000
G1 F1000 X183.0001 Y208.0003 Z-7.5000 S1000
G1 F1000 X183.0001 Y166.0001 Z-7.5000 S1000
G1 F1000 X183.9999 Y166.0001 Z-7.5000 S1000
G1 F1000 X183.9999 Y184.4999 Z-7.5000 S1000
; Starting inflateGrp: Closed?:true
G1 F300 Z-8.2000
G1 F1000 X184.0794 Y184.9817 Z-8.2000 S1000
G1 F1000 X184.3093 Y185.4124 Z-8.2000 S1000
G1 F1000 X184.6655 Y185.7464 Z-8.2000 S1000
G1 F1000 X185.1100 Y185.9483 Z-8.2000 S1000
G1 F1000 X185.4999 Y185.9999 Z-8.2000 S1000
G1 F1000 X205.5002 Y185.9999 Z-8.2000 S1000
G1 F1000 X205.9820 Y185.9204 Z-8.2000 S1000
G1 F1000 X206.4127 Y185.6905 Z-8.2000 S1000
G1 F1000 X206.7467 Y185.3343 Z-8.2000 S1000
G1 F1000 X206.9486 Y184.8898 Z-8.2000 S1000
G1 F1000 X207.0002 Y184.4999 Z-8.2000 S1000
G1 F1000 X207.0002 Y166.0001 Z-8.2000 S1000
G1 F1000 X208.0000 Y166.0001 Z-8.2000 S1000
G1 F1000 X208.0000 Y208.0003 Z-8.2000 S1000
G1 F1000 X208.0795 Y208.4821 Z-8.2000 S1000
G1 F1000 X208.3094 Y208.9128 Z-8.2000 S1000
G1 F1000 X208.6656 Y209.2468 Z-8.2000 S1000
G1 F1000 X209.1101 Y209.4487 Z-8.2000 S1000
G1 F1000 X209.5000 Y209.5003 Z-8.2000 S1000
G1 F1000 X224.9999 Y209.5003 Z-8.2000 S1000
G1 F1000 X224.9999 Y221.4999 Z-8.2000 S1000
G1 F1000 X209.5000 Y221.4999 Z-8.2000 S1000
G1 F1000 X209.0182 Y221.5794 Z-8.2000 S1000
G1 F1000 X208.5875 Y221.8093 Z-8.2000 S1000
G1 F1000 X208.2535 Y222.1655 Z-8.2000 S1000
G1 F1000 X208.0516 Y222.6100 Z-8.2000 S1000
G1 F1000 X208.0000 Y222.9999 Z-8.2000 S1000
G1 F1000 X208.0000 Y224.9999 Z-8.2000 S1000
G1 F1000 X183.0001 Y224.9999 Z-8.2000 S1000
G1 F1000 X183.0001 Y222.9999 Z-8.2000 S1000
G1 F1000 X182.9206 Y222.5181 Z-8.2000 S1000
G1 F1000 X182.6907 Y222.0874 Z-8.2000 S1000
G1 F1000 X182.3345 Y221.7534 Z-8.2000 S1000
G1 F1000 X181.8900 Y221.5515 Z-8.2000 S1000
G1 F1000 X181.5001 Y221.4999 Z-8.2000 S1000
G1 F1000 X166.0001 Y221.4999 Z-8.2000 S1000
G1 F1000 X166.0001 Y209.5003 Z-8.2000 S1000
G1 F1000 X181.5001 Y209.5003 Z-8.2000 S1000
G1 F1000 X181.9819 Y209.4208 Z-8.2000 S1000
G1 F1000 X182.4126 Y209.1909 Z-8.2000 S1000
G1 F1000 X182.7466 Y208.8347 Z-8.2000 S1000
G1 F1000 X182.9485 Y208.3902 Z-8.2000 S1000
G1 F1000 X183.0001 Y208.0003 Z-8.2000 S1000
G1 F1000 X183.0001 Y166.0001 Z-8.2000 S1000
G1 F1000 X183.9999 Y166.0001 Z-8.2000 S1000
G1 F1000 X183.9999 Y184.4999 Z-8.2000 S1000
; Starting inflateGrp: Closed?:true

G0 Z10
G0 X303.9999 Y184.4999

G0 Z0
G1 F300 Z-1.5000
G1 F1000 X304.0794 Y184.9817 Z-1.5000 S1000
G1 F1000 X304.3093 Y185.4124 Z-1.5000 S1000
G1 F1000 X304.6655 Y185.7464 Z-1.5000 S1000
G1 F1000 X305.1100 Y185.9483 Z-1.5000 S1000
G1 F1000 X305.4999 Y185.9999 Z-1.5000 S1000
G1 F1000 X325.5002 Y185.9999 Z-1.5000 S1000
G1 F1000 X325.9820 Y185.9204 Z-1.5000 S1000
G1 F1000 X326.4127 Y185.6905 Z-1.5000 S1000
G1 F1000 X326.7467 Y185.3343 Z-1.5000 S1000
G1 F1000 X326.9486 Y184.8898 Z-1.5000 S1000
G1 F1000 X327.0002 Y184.4999 Z-1.5000 S1000
G1 F1000 X327.0002 Y166.0001 Z-1.5000 S1000
G1 F1000 X328.0000 Y166.0001 Z-1.5000 S1000
G1 F1000 X328.0000 Y208.0003 Z-1.5000 S1000
G1 F1000 X328.0795 Y208.4821 Z-1.5000 S1000
G1 F1000 X328.3094 Y208.9128 Z-1.5000 S1000
G1 F1000 X328.6656 Y209.2468 Z-1.5000 S1000
G1 F1000 X329.1101 Y209.4487 Z-1.5000 S1000
G1 F1000 X329.5000 Y209.5003 Z-1.5000 S1000
G1 F1000 X344.9999 Y209.5003 Z-1.5000 S1000
G1 F1000 X344.9999 Y221.4999 Z-1.5000 S1000
G1 F1000 X329.5000 Y221.4999 Z-1.5000 S1000
G1 F1000 X329.0182 Y221.5794 Z-1.5000 S1000
G1 F1000 X328.5875 Y221.8093 Z-1.5000 S1000
G1 F1000 X328.2535 Y222.1655 Z-1.5000 S1000
G1 F1000 X328.0516 Y222.6100 Z-1.5000 S1000
G1 F1000 X328.0000 Y222.9999 Z-1.5000 S1000
G1 F1000 X328.0000 Y224.9999 Z-1.5000 S1000
G1 F1000 X303.0001 Y224.9999 Z-1.5000 S1000
G1 F1000 X303.0001 Y222.9999 Z-1.5000 S1000
G1 F1000 X302.9206 Y222.5181 Z-1.5000 S1000
G1 F1000 X302.6907 Y222.0874 Z-1.5000 S1000
G1 F1000 X302.3345 Y221.7534 Z-1.5000 S1000
G1 F1000 X301.8900 Y221.5515 Z-1.5000 S1000
G1 F1000 X301.5001 Y221.4999 Z-1.5000 S1000
G1 F1000 X286.0001 Y221.4999 Z-1.5000 S1000
G1 F1000 X286.0001 Y209.5003 Z-1.5000 S1000
G1 F1000 X301.5001 Y209.5003 Z-1.5000 S1000
G1 F1000 X301.9819 Y209.4208 Z-1.5000 S1000
G1 F1000 X302.4126 Y209.1909 Z-1.5000 S1000
G1 F1000 X302.7466 Y208.8347 Z-1.5000 S1000
G1 F1000 X302.9485 Y208.3902 Z-1.5000 S1000
G1 F1000 X303.0001 Y208.0003 Z-1.5000 S1000
G1 F1000 X303.0001 Y166.0001 Z-1.5000 S1000
G1 F1000 X303.9999 Y166.0001 Z-1.5000 S1000
G1 F1000 X303.9999 Y184.4999 Z-1.5000 S1000
; Starting inflateGrp: Closed?:true
G1 F300 Z-3.0000
G1 F1000 X304.0794 Y184.9817 Z-3.0000 S1000
G1 F1000 X304.3093 Y185.4124 Z-3.0000 S1000
G1 F1000 X304.6655 Y185.7464 Z-3.0000 S1000
G1 F1000 X305.1100 Y185.9483 Z-3.0000 S1000
G1 F1000 X305.4999 Y185.9999 Z-3.0000 S1000
G1 F1000 X325.5002 Y185.9999 Z-3.0000 S1000
G1 F1000 X325.9820 Y185.9204 Z-3.0000 S1000
G1 F1000 X326.4127 Y185.6905 Z-3.0000 S1000
G1 F1000 X326.7467 Y185.3343 Z-3.0000 S1000
G1 F1000 X326.9486 Y184.8898 Z-3.0000 S1000
G1 F1000 X327.0002 Y184.4999 Z-3.0000 S1000
G1 F1000 X327.0002 Y166.0001 Z-3.0000 S1000
G1 F1000 X328.0000 Y166.0001 Z-3.0000 S1000
G1 F1000 X328.0000 Y208.0003 Z-3.0000 S1000
G1 F1000 X328.0795 Y208.4821 Z-3.0000 S1000
G1 F1000 X328.3094 Y208.9128 Z-3.0000 S1000
G1 F1000 X328.6656 Y209.2468 Z-3.0000 S1000
G1 F1000 X329.1101 Y209.4487 Z-3.0000 S1000
G1 F1000 X329.5000 Y209.5003 Z-3.0000 S1000
G1 F1000 X344.9999 Y209.5003 Z-3.0000 S1000
G1 F1000 X344.9999 Y221.4999 Z-3.0000 S1000
G1 F1000 X329.5000 Y221.4999 Z-3.0000 S1000
G1 F1000 X329.0182 Y221.5794 Z-3.0000 S1000
G1 F1000 X328.5875 Y221.8093 Z-3.0000 S1000
G1 F1000 X328.2535 Y222.1655 Z-3.0000 S1000
G1 F1000 X328.0516 Y222.6100 Z-3.0000 S1000
G1 F1000 X328.0000 Y222.9999 Z-3.0000 S1000
G1 F1000 X328.0000 Y224.9999 Z-3.0000 S1000
G1 F1000 X303.0001 Y224.9999 Z-3.0000 S1000
G1 F1000 X303.0001 Y222.9999 Z-3.0000 S1000
G1 F1000 X302.9206 Y222.5181 Z-3.0000 S1000
G1 F1000 X302.6907 Y222.0874 Z-3.0000 S1000
G1 F1000 X302.3345 Y221.7534 Z-3.0000 S1000
G1 F1000 X301.8900 Y221.5515 Z-3.0000 S1000
G1 F1000 X301.5001 Y221.4999 Z-3.0000 S1000
G1 F1000 X286.0001 Y221.4999 Z-3.0000 S1000
G1 F1000 X286.0001 Y209.5003 Z-3.0000 S1000
G1 F1000 X301.5001 Y209.5003 Z-3.0000 S1000
G1 F1000 X301.9819 Y209.4208 Z-3.0000 S1000
G1 F1000 X302.4126 Y209.1909 Z-3.0000 S1000
G1 F1000 X302.7466 Y208.8347 Z-3.0000 S1000
G1 F1000 X302.9485 Y208.3902 Z-3.0000 S1000
G1 F1000 X303.0001 Y208.0003 Z-3.0000 S1000
G1 F1000 X303.0001 Y166.0001 Z-3.0000 S1000
G1 F1000 X303.9999 Y166.0001 Z-3.0000 S1000
G1 F1000 X303.9999 Y184.4999 Z-3.0000 S1000
; Starting inflateGrp: Closed?:true
G1 F300 Z-4.5000
G1 F1000 X304.0794 Y184.9817 Z-4.5000 S1000
G1 F1000 X304.3093 Y185.4124 Z-4.5000 S1000
G1 F1000 X304.6655 Y185.7464 Z-4.5000 S1000
G1 F1000 X305.1100 Y185.9483 Z-4.5000 S1000
G1 F1000 X305.4999 Y185.9999 Z-4.5000 S1000
G1 F1000 X325.5002 Y185.9999 Z-4.5000 S1000
G1 F1000 X325.9820 Y185.9204 Z-4.5000 S1000
G1 F1000 X326.4127 Y185.6905 Z-4.5000 S1000
G1 F1000 X326.7467 Y185.3343 Z-4.5000 S1000
G1 F1000 X326.9486 Y184.8898 Z-4.5000 S1000
G1 F1000 X327.0002 Y184.4999 Z-4.5000 S1000
G1 F1000 X327.0002 Y166.0001 Z-4.5000 S1000
G1 F1000 X328.0000 Y166.0001 Z-4.5000 S1000
G1 F1000 X328.0000 Y208.0003 Z-4.5000 S1000
G1 F1000 X328.0795 Y208.4821 Z-4.5000 S1000
G1 F1000 X328.3094 Y208.9128 Z-4.5000 S1000
G1 F1000 X328.6656 Y209.2468 Z-4.5000 S1000
G1 F1000 X329.1101 Y209.4487 Z-4.5000 S1000
G1 F1000 X329.5000 Y209.5003 Z-4.5000 S1000
G1 F1000 X344.9999 Y209.5003 Z-4.5000 S1000
G1 F1000 X344.9999 Y221.4999 Z-4.5000 S1000
G1 F1000 X329.5000 Y221.4999 Z-4.5000 S1000
G1 F1000 X329.0182 Y221.5794 Z-4.5000 S1000
G1 F1000 X328.5875 Y221.8093 Z-4.5000 S1000
G1 F1000 X328.2535 Y222.1655 Z-4.5000 S1000
G1 F1000 X328.0516 Y222.6100 Z-4.5000 S1000
G1 F1000 X328.0000 Y222.9999 Z-4.5000 S1000
G1 F1000 X328.0000 Y224.9999 Z-4.5000 S1000
G1 F1000 X303.0001 Y224.9999 Z-4.5000 S1000
G1 F1000 X303.0001 Y222.9999 Z-4.5000 S1000
G1 F1000 X302.9206 Y222.5181 Z-4.5000 S1000
G1 F1000 X302.6907 Y222.0874 Z-4.5000 S1000
G1 F1000 X302.3345 Y221.7534 Z-4.5000 S1000
G1 F1000 X301.8900 Y221.5515 Z-4.5000 S1000
G1 F1000 X301.5001 Y221.4999 Z-4.5000 S1000
G1 F1000 X286.0001 Y221.4999 Z-4.5000 S1000
G1 F1000 X286.0001 Y209.5003 Z-4.5000 S1000
G1 F1000 X301.5001 Y209.5003 Z-4.5000 S1000
G1 F1000 X301.9819 Y209.4208 Z-4.5000 S1000
G1 F1000 X302.4126 Y209.1909 Z-4.5000 S1000
G1 F1000 X302.7466 Y208.8347 Z-4.5000 S1000
G1 F1000 X302.9485 Y208.3902 Z-4.5000 S1000
G1 F1000 X303.0001 Y208.0003 Z-4.5000 S1000
G1 F1000 X303.0001 Y166.0001 Z-4.5000 S1000
G1 F1000 X303.9999 Y166.0001 Z-4.5000 S1000
G1 F1000 X303.9999 Y184.4999 Z-4.5000 S1000
; Starting inflateGrp: Closed?:true
G1 F300 Z-6.0000
G1 F1000 X304.0794 Y184.9817 Z-6.0000 S1000
G1 F1000 X304.3093 Y185.4124 Z-6.0000 S1000
G1 F1000 X304.6655 Y185.7464 Z-6.0000 S1000
G1 F1000 X305.1100 Y185.9483 Z-6.0000 S1000
G1 F1000 X305.4999 Y185.9999 Z-6.0000 S1000
G1 F1000 X325.5002 Y185.9999 Z-6.0000 S1000
G1 F1000 X325.9820 Y185.9204 Z-6.0000 S1000
G1 F1000 X326.4127 Y185.6905 Z-6.0000 S1000
G1 F1000 X326.7467 Y185.3343 Z-6.0000 S1000
G1 F1000 X326.9486 Y184.8898 Z-6.0000 S1000
G1 F1000 X327.0002 Y184.4999 Z-6.0000 S1000
G1 F1000 X327.0002 Y166.0001 Z-6.0000 S1000
G1 F1000 X328.0000 Y166.0001 Z-6.0000 S1000
G1 F1000 X328.0000 Y208.0003 Z-6.0000 S1000
G1 F1000 X328.0795 Y208.4821 Z-6.0000 S1000
G1 F1000 X328.3094 Y208.9128 Z-6.0000 S1000
G1 F1000 X328.6656 Y209.2468 Z-6.0000 S1000
G1 F1000 X329.1101 Y209.4487 Z-6.0000 S1000
G1 F1000 X329.5000 Y209.5003 Z-6.0000 S1000
G1 F1000 X344.9999 Y209.5003 Z-6.0000 S1000
G1 F1000 X344.9999 Y221.4999 Z-6.0000 S1000
G1 F1000 X329.5000 Y221.4999 Z-6.0000 S1000
G1 F1000 X329.0182 Y221.5794 Z-6.0000 S1000
G1 F1000 X328.5875 Y221.8093 Z-6.0000 S1000
G1 F1000 X328.2535 Y222.1655 Z-6.0000 S1000
G1 F1000 X328.0516 Y222.6100 Z-6.0000 S1000
G1 F1000 X328.0000 Y222.9999 Z-6.0000 S1000
G1 F1000 X328.0000 Y224.9999 Z-6.0000 S1000
G1 F1000 X303.0001 Y224.9999 Z-6.0000 S1000
G1 F1000 X303.0001 Y222.9999 Z-6.0000 S1000
G1 F1000 X302.9206 Y222.5181 Z-6.0000 S1000
G1 F1000 X302.6907 Y222.0874 Z-6.0000 S1000
G1 F1000 X302.3345 Y221.7534 Z-6.0000 S1000
G1 F1000 X301.8900 Y221.5515 Z-6.0000 S1000
G1 F1000 X301.5001 Y221.4999 Z-6.0000 S1000
G1 F1000 X286.0001 Y221.4999 Z-6.0000 S1000
G1 F1000 X286.0001 Y209.5003 Z-6.0000 S1000
G1 F1000 X301.5001 Y209.5003 Z-6.0000 S1000
G1 F1000 X301.9819 Y209.4208 Z-6.0000 S1000
G1 F1000 X302.4126 Y209.1909 Z-6.0000 S1000
G1 F1000 X302.7466 Y208.8347 Z-6.0000 S1000
G1 F1000 X302.9485 Y208.3902 Z-6.0000 S1000
G1 F1000 X303.0001 Y208.0003 Z-6.0000 S1000
G1 F1000 X303.0001 Y166.0001 Z-6.0000 S1000
G1 F1000 X303.9999 Y166.0001 Z-6.0000 S1000
G1 F1000 X303.9999 Y184.4999 Z-6.0000 S1000
; Starting inflateGrp: Closed?:true
G1 F300 Z-7.5000
G1 F1000 X304.0794 Y184.9817 Z-7.5000 S1000
G1 F1000 X304.3093 Y185.4124 Z-7.5000 S1000
G1 F1000 X304.6655 Y185.7464 Z-7.5000 S1000
G1 F1000 X305.1100 Y185.9483 Z-7.5000 S1000
G1 F1000 X305.4999 Y185.9999 Z-7.5000 S1000
G1 F1000 X325.5002 Y185.9999 Z-7.5000 S1000
G1 F1000 X325.9820 Y185.9204 Z-7.5000 S1000
G1 F1000 X326.4127 Y185.6905 Z-7.5000 S1000
G1 F1000 X326.7467 Y185.3343 Z-7.5000 S1000
G1 F1000 X326.9486 Y184.8898 Z-7.5000 S1000
G1 F1000 X327.0002 Y184.4999 Z-7.5000 S1000
G1 F1000 X327.0002 Y166.0001 Z-7.5000 S1000
G1 F1000 X328.0000 Y166.0001 Z-7.5000 S1000
G1 F1000 X328.0000 Y208.0003 Z-7.5000 S1000
G1 F1000 X328.0795 Y208.4821 Z-7.5000 S1000
G1 F1000 X328.3094 Y208.9128 Z-7.5000 S1000
G1 F1000 X328.6656 Y209.2468 Z-7.5000 S1000
G1 F1000 X329.1101 Y209.4487 Z-7.5000 S1000
G1 F1000 X329.5000 Y209.5003 Z-7.5000 S1000
G1 F1000 X344.9999 Y209.5003 Z-7.5000 S1000
G1 F1000 X344.9999 Y221.4999 Z-7.5000 S1000
G1 F1000 X329.5000 Y221.4999 Z-7.5000 S1000
G1 F1000 X329.0182 Y221.5794 Z-7.5000 S1000
G1 F1000 X328.5875 Y221.8093 Z-7.5000 S1000
G1 F1000 X328.2535 Y222.1655 Z-7.5000 S1000
G1 F1000 X328.0516 Y222.6100 Z-7.5000 S1000
G1 F1000 X328.0000 Y222.9999 Z-7.5000 S1000
G1 F1000 X328.0000 Y224.9999 Z-7.5000 S1000
G1 F1000 X303.0001 Y224.9999 Z-7.5000 S1000
G1 F1000 X303.0001 Y222.9999 Z-7.5000 S1000
G1 F1000 X302.9206 Y222.5181 Z-7.5000 S1000
G1 F1000 X302.6907 Y222.0874 Z-7.5000 S1000
G1 F1000 X302.3345 Y221.7534 Z-7.5000 S1000
G1 F1000 X301.8900 Y221.5515 Z-7.5000 S1000
G1 F1000 X301.5001 Y221.4999 Z-7.5000 S1000
G1 F1000 X286.0001 Y221.4999 Z-7.5000 S1000
G1 F1000 X286.0001 Y209.5003 Z-7.5000 S1000
G1 F1000 X301.5001 Y209.5003 Z-7.5000 S1000
G1 F1000 X301.9819 Y209.4208 Z-7.5000 S1000
G1 F1000 X302.4126 Y209.1909 Z-7.5000 S1000
G1 F1000 X302.7466 Y208.8347 Z-7.5000 S1000
G1 F1000 X302.9485 Y208.3902 Z-7.5000 S1000
G1 F1000 X303.0001 Y208.0003 Z-7.5000 S1000
G1 F1000 X303.0001 Y166.0001 Z-7.5000 S1000
G1 F1000 X303.9999 Y166.0001 Z-7.5000 S1000
G1 F1000 X303.9999 Y184.4999 Z-7.5000 S1000
; Starting inflateGrp: Closed?:true
G1 F300 Z-8.2000
G1 F1000 X304.0794 Y184.9817 Z-8.2000 S1000
G1 F1000 X304.3093 Y185.4124 Z-8.2000 S1000
G1 F1000 X304.6655 Y185.7464 Z-8.2000 S1000
G1 F1000 X305.1100 Y185.9483 Z-8.2000 S1000
G1 F1000 X305.4999 Y185.9999 Z-8.2000 S1000
G1 F1000 X325.5002 Y185.9999 Z-8.2000 S1000
G1 F1000 X325.9820 Y185.9204 Z-8.2000 S1000
G1 F1000 X326.4127 Y185.6905 Z-8.2000 S1000
G1 F1000 X326.7467 Y185.3343 Z-8.2000 S1000
G1 F1000 X326.9486 Y184.8898 Z-8.2000 S1000
G1 F1000 X327.0002 Y184.4999 Z-8.2000 S1000
G1 F1000 X327.0002 Y166.0001 Z-8.2000 S1000
G1 F1000 X328.0000 Y166.0001 Z-8.2000 S1000
G1 F1000 X328.0000 Y208.0003 Z-8.2000 S1000
G1 F1000 X328.0795 Y208.4821 Z-8.2000 S1000
G1 F1000 X328.3094 Y208.9128 Z-8.2000 S1000
G1 F1000 X328.6656 Y209.2468 Z-8.2000 S1000
G1 F1000 X329.1101 Y209.4487 Z-8.2000 S1000
G1 F1000 X329.5000 Y209.5003 Z-8.2000 S1000
G1 F1000 X344.9999 Y209.5003 Z-8.2000 S1000
G1 F1000 X344.9999 Y221.4999 Z-8.2000 S1000
G1 F1000 X329.5000 Y221.4999 Z-8.2000 S1000
G1 F1000 X329.0182 Y221.5794 Z-8.2000 S1000
G1 F1000 X328.5875 Y221.8093 Z-8.2000 S1000
G1 F1000 X328.2535 Y222.1655 Z-8.2000 S1000
G1 F1000 X328.0516 Y222.6100 Z-8.2000 S1000
G1 F1000 X328.0000 Y222.9999 Z-8.2000 S1000
G1 F1000 X328.0000 Y224.9999 Z-8.2000 S1000
G1 F1000 X303.0001 Y224.9999 Z-8.2000 S1000
G1 F1000 X303.0001 Y222.9999 Z-8.2000 S1000
G1 F1000 X302.9206 Y222.5181 Z-8.2000 S1000
G1 F1000 X302.6907 Y222.0874 Z-8.2000 S1000
G1 F1000 X302.3345 Y221.7534 Z-8.2000 S1000
G1 F1000 X301.8900 Y221.5515 Z-8.2000 S1000
G1 F1000 X301.5001 Y221.4999 Z-8.2000 S1000
G1 F1000 X286.0001 Y221.4999 Z-8.2000 S1000
G1 F1000 X286.0001 Y209.5003 Z-8.2000 S1000
G1 F1000 X301.5001 Y209.5003 Z-8.2000 S1000
G1 F1000 X301.9819 Y209.4208 Z-8.2000 S1000
G1 F1000 X302.4126 Y209.1909 Z-8.2000 S1000
G1 F1000 X302.7466 Y208.8347 Z-8.2000 S1000
G1 F1000 X302.9485 Y208.3902 Z-8.2000 S1000
G1 F1000 X303.0001 Y208.0003 Z-8.2000 S1000
G1 F1000 X303.0001 Y166.0001 Z-8.2000 S1000
G1 F1000 X303.9999 Y166.0001 Z-8.2000 S1000
G1 F1000 X303.9999 Y184.4999 Z-8.2000 S1000
; retracting back to z-safe
G0 Z10

M5 S0; Spindle Off
