; GCODE Generated by cam.openbuilds.com on 2020-09-02 
G21 ; mm-mode
G54; Work Coordinates
G21; mm-mode
G90; Absolute Positioning
M3 S1000; Spindle On

; Operation 0: CNC: Vector (path inside)
; Tool Diameter: 3
; Starting inflateGrp: Closed?:true

G0 Z10
G0 F1000 X10.4099 Y29.0109

G0 Z0
G1 F300 Z-1.6000
G1 F1000 X10.7571 Y29.2429 Z-1.6000 S1000
G1 F1000 X10.9891 Y29.5901 Z-1.6000 S1000
G1 F1000 X11.0706 Y30.0000 Z-1.6000 S1000
G1 F1000 X10.9891 Y30.4099 Z-1.6000 S1000
G1 F1000 X10.7571 Y30.7571 Z-1.6000 S1000
G1 F1000 X10.4099 Y30.9891 Z-1.6000 S1000
G1 F1000 X10.0000 Y31.0706 Z-1.6000 S1000
G1 F1000 X9.5901 Y30.9891 Z-1.6000 S1000
G1 F1000 X9.2429 Y30.7571 Z-1.6000 S1000
G1 F1000 X9.0109 Y30.4099 Z-1.6000 S1000
G1 F1000 X8.9294 Y30.0000 Z-1.6000 S1000
G1 F1000 X9.0109 Y29.5901 Z-1.6000 S1000
G1 F1000 X9.2429 Y29.2429 Z-1.6000 S1000
G1 F1000 X9.5901 Y29.0109 Z-1.6000 S1000
G1 F1000 X10.0000 Y28.9294 Z-1.6000 S1000
G1 F1000 X10.4099 Y29.0109 Z-1.6000 S1000
; Starting inflateGrp: Closed?:true
G1 F300 Z-3.2000
G1 F1000 X10.7571 Y29.2429 Z-3.2000 S1000
G1 F1000 X10.9891 Y29.5901 Z-3.2000 S1000
G1 F1000 X11.0706 Y30.0000 Z-3.2000 S1000
G1 F1000 X10.9891 Y30.4099 Z-3.2000 S1000
G1 F1000 X10.7571 Y30.7571 Z-3.2000 S1000
G1 F1000 X10.4099 Y30.9891 Z-3.2000 S1000
G1 F1000 X10.0000 Y31.0706 Z-3.2000 S1000
G1 F1000 X9.5901 Y30.9891 Z-3.2000 S1000
G1 F1000 X9.2429 Y30.7571 Z-3.2000 S1000
G1 F1000 X9.0109 Y30.4099 Z-3.2000 S1000
G1 F1000 X8.9294 Y30.0000 Z-3.2000 S1000
G1 F1000 X9.0109 Y29.5901 Z-3.2000 S1000
G1 F1000 X9.2429 Y29.2429 Z-3.2000 S1000
G1 F1000 X9.5901 Y29.0109 Z-3.2000 S1000
G1 F1000 X10.0000 Y28.9294 Z-3.2000 S1000
G1 F1000 X10.4099 Y29.0109 Z-3.2000 S1000
; Starting inflateGrp: Closed?:true

G0 Z10
G0 X10.4099 Y49.0109

G0 Z0
G1 F300 Z-1.6000
G1 F1000 X10.7571 Y49.2429 Z-1.6000 S1000
G1 F1000 X10.9891 Y49.5901 Z-1.6000 S1000
G1 F1000 X11.0706 Y50.0000 Z-1.6000 S1000
G1 F1000 X10.9891 Y50.4099 Z-1.6000 S1000
G1 F1000 X10.7571 Y50.7571 Z-1.6000 S1000
G1 F1000 X10.4099 Y50.9891 Z-1.6000 S1000
G1 F1000 X10.0000 Y51.0706 Z-1.6000 S1000
G1 F1000 X9.5901 Y50.9891 Z-1.6000 S1000
G1 F1000 X9.2429 Y50.7571 Z-1.6000 S1000
G1 F1000 X9.0109 Y50.4099 Z-1.6000 S1000
G1 F1000 X8.9294 Y50.0000 Z-1.6000 S1000
G1 F1000 X9.0109 Y49.5901 Z-1.6000 S1000
G1 F1000 X9.2429 Y49.2429 Z-1.6000 S1000
G1 F1000 X9.5901 Y49.0109 Z-1.6000 S1000
G1 F1000 X10.0000 Y48.9294 Z-1.6000 S1000
G1 F1000 X10.4099 Y49.0109 Z-1.6000 S1000
; Starting inflateGrp: Closed?:true
G1 F300 Z-3.2000
G1 F1000 X10.7571 Y49.2429 Z-3.2000 S1000
G1 F1000 X10.9891 Y49.5901 Z-3.2000 S1000
G1 F1000 X11.0706 Y50.0000 Z-3.2000 S1000
G1 F1000 X10.9891 Y50.4099 Z-3.2000 S1000
G1 F1000 X10.7571 Y50.7571 Z-3.2000 S1000
G1 F1000 X10.4099 Y50.9891 Z-3.2000 S1000
G1 F1000 X10.0000 Y51.0706 Z-3.2000 S1000
G1 F1000 X9.5901 Y50.9891 Z-3.2000 S1000
G1 F1000 X9.2429 Y50.7571 Z-3.2000 S1000
G1 F1000 X9.0109 Y50.4099 Z-3.2000 S1000
G1 F1000 X8.9294 Y50.0000 Z-3.2000 S1000
G1 F1000 X9.0109 Y49.5901 Z-3.2000 S1000
G1 F1000 X9.2429 Y49.2429 Z-3.2000 S1000
G1 F1000 X9.5901 Y49.0109 Z-3.2000 S1000
G1 F1000 X10.0000 Y48.9294 Z-3.2000 S1000
G1 F1000 X10.4099 Y49.0109 Z-3.2000 S1000
; Starting inflateGrp: Closed?:true

G0 Z10
G0 X50.4099 Y9.0109

G0 Z0
G1 F300 Z-1.6000
G1 F1000 X50.7571 Y9.2429 Z-1.6000 S1000
G1 F1000 X50.9891 Y9.5901 Z-1.6000 S1000
G1 F1000 X51.0706 Y10.0000 Z-1.6000 S1000
G1 F1000 X50.9891 Y10.4099 Z-1.6000 S1000
G1 F1000 X50.7571 Y10.7571 Z-1.6000 S1000
G1 F1000 X50.4099 Y10.9891 Z-1.6000 S1000
G1 F1000 X50.0000 Y11.0706 Z-1.6000 S1000
G1 F1000 X49.5901 Y10.9891 Z-1.6000 S1000
G1 F1000 X49.2429 Y10.7571 Z-1.6000 S1000
G1 F1000 X49.0109 Y10.4099 Z-1.6000 S1000
G1 F1000 X48.9294 Y10.0000 Z-1.6000 S1000
G1 F1000 X49.0109 Y9.5901 Z-1.6000 S1000
G1 F1000 X49.2429 Y9.2429 Z-1.6000 S1000
G1 F1000 X49.5901 Y9.0109 Z-1.6000 S1000
G1 F1000 X50.0000 Y8.9294 Z-1.6000 S1000
G1 F1000 X50.4099 Y9.0109 Z-1.6000 S1000
; Starting inflateGrp: Closed?:true
G1 F300 Z-3.2000
G1 F1000 X50.7571 Y9.2429 Z-3.2000 S1000
G1 F1000 X50.9891 Y9.5901 Z-3.2000 S1000
G1 F1000 X51.0706 Y10.0000 Z-3.2000 S1000
G1 F1000 X50.9891 Y10.4099 Z-3.2000 S1000
G1 F1000 X50.7571 Y10.7571 Z-3.2000 S1000
G1 F1000 X50.4099 Y10.9891 Z-3.2000 S1000
G1 F1000 X50.0000 Y11.0706 Z-3.2000 S1000
G1 F1000 X49.5901 Y10.9891 Z-3.2000 S1000
G1 F1000 X49.2429 Y10.7571 Z-3.2000 S1000
G1 F1000 X49.0109 Y10.4099 Z-3.2000 S1000
G1 F1000 X48.9294 Y10.0000 Z-3.2000 S1000
G1 F1000 X49.0109 Y9.5901 Z-3.2000 S1000
G1 F1000 X49.2429 Y9.2429 Z-3.2000 S1000
G1 F1000 X49.5901 Y9.0109 Z-3.2000 S1000
G1 F1000 X50.0000 Y8.9294 Z-3.2000 S1000
G1 F1000 X50.4099 Y9.0109 Z-3.2000 S1000
; Starting inflateGrp: Closed?:true

G0 Z10
G0 X10.4099 Y9.0109

G0 Z0
G1 F300 Z-1.6000
G1 F1000 X10.7571 Y9.2429 Z-1.6000 S1000
G1 F1000 X10.9891 Y9.5901 Z-1.6000 S1000
G1 F1000 X11.0706 Y10.0000 Z-1.6000 S1000
G1 F1000 X10.9891 Y10.4099 Z-1.6000 S1000
G1 F1000 X10.7571 Y10.7571 Z-1.6000 S1000
G1 F1000 X10.4099 Y10.9891 Z-1.6000 S1000
G1 F1000 X10.0000 Y11.0706 Z-1.6000 S1000
G1 F1000 X9.5901 Y10.9891 Z-1.6000 S1000
G1 F1000 X9.2429 Y10.7571 Z-1.6000 S1000
G1 F1000 X9.0109 Y10.4099 Z-1.6000 S1000
G1 F1000 X8.9294 Y10.0000 Z-1.6000 S1000
G1 F1000 X9.0109 Y9.5901 Z-1.6000 S1000
G1 F1000 X9.2429 Y9.2429 Z-1.6000 S1000
G1 F1000 X9.5901 Y9.0109 Z-1.6000 S1000
G1 F1000 X10.0000 Y8.9294 Z-1.6000 S1000
G1 F1000 X10.4099 Y9.0109 Z-1.6000 S1000
; Starting inflateGrp: Closed?:true
G1 F300 Z-3.2000
G1 F1000 X10.7571 Y9.2429 Z-3.2000 S1000
G1 F1000 X10.9891 Y9.5901 Z-3.2000 S1000
G1 F1000 X11.0706 Y10.0000 Z-3.2000 S1000
G1 F1000 X10.9891 Y10.4099 Z-3.2000 S1000
G1 F1000 X10.7571 Y10.7571 Z-3.2000 S1000
G1 F1000 X10.4099 Y10.9891 Z-3.2000 S1000
G1 F1000 X10.0000 Y11.0706 Z-3.2000 S1000
G1 F1000 X9.5901 Y10.9891 Z-3.2000 S1000
G1 F1000 X9.2429 Y10.7571 Z-3.2000 S1000
G1 F1000 X9.0109 Y10.4099 Z-3.2000 S1000
G1 F1000 X8.9294 Y10.0000 Z-3.2000 S1000
G1 F1000 X9.0109 Y9.5901 Z-3.2000 S1000
G1 F1000 X9.2429 Y9.2429 Z-3.2000 S1000
G1 F1000 X9.5901 Y9.0109 Z-3.2000 S1000
G1 F1000 X10.0000 Y8.9294 Z-3.2000 S1000
G1 F1000 X10.4099 Y9.0109 Z-3.2000 S1000
; Starting inflateGrp: Closed?:true

G0 Z10
G0 X30.4099 Y9.0109

G0 Z0
G1 F300 Z-1.6000
G1 F1000 X30.7571 Y9.2429 Z-1.6000 S1000
G1 F1000 X30.9891 Y9.5901 Z-1.6000 S1000
G1 F1000 X31.0706 Y10.0000 Z-1.6000 S1000
G1 F1000 X30.9891 Y10.4099 Z-1.6000 S1000
G1 F1000 X30.7571 Y10.7571 Z-1.6000 S1000
G1 F1000 X30.4099 Y10.9891 Z-1.6000 S1000
G1 F1000 X30.0000 Y11.0706 Z-1.6000 S1000
G1 F1000 X29.5901 Y10.9891 Z-1.6000 S1000
G1 F1000 X29.2429 Y10.7571 Z-1.6000 S1000
G1 F1000 X29.0109 Y10.4099 Z-1.6000 S1000
G1 F1000 X28.9294 Y10.0000 Z-1.6000 S1000
G1 F1000 X29.0109 Y9.5901 Z-1.6000 S1000
G1 F1000 X29.2429 Y9.2429 Z-1.6000 S1000
G1 F1000 X29.5901 Y9.0109 Z-1.6000 S1000
G1 F1000 X30.0000 Y8.9294 Z-1.6000 S1000
G1 F1000 X30.4099 Y9.0109 Z-1.6000 S1000
; Starting inflateGrp: Closed?:true
G1 F300 Z-3.2000
G1 F1000 X30.7571 Y9.2429 Z-3.2000 S1000
G1 F1000 X30.9891 Y9.5901 Z-3.2000 S1000
G1 F1000 X31.0706 Y10.0000 Z-3.2000 S1000
G1 F1000 X30.9891 Y10.4099 Z-3.2000 S1000
G1 F1000 X30.7571 Y10.7571 Z-3.2000 S1000
G1 F1000 X30.4099 Y10.9891 Z-3.2000 S1000
G1 F1000 X30.0000 Y11.0706 Z-3.2000 S1000
G1 F1000 X29.5901 Y10.9891 Z-3.2000 S1000
G1 F1000 X29.2429 Y10.7571 Z-3.2000 S1000
G1 F1000 X29.0109 Y10.4099 Z-3.2000 S1000
G1 F1000 X28.9294 Y10.0000 Z-3.2000 S1000
G1 F1000 X29.0109 Y9.5901 Z-3.2000 S1000
G1 F1000 X29.2429 Y9.2429 Z-3.2000 S1000
G1 F1000 X29.5901 Y9.0109 Z-3.2000 S1000
G1 F1000 X30.0000 Y8.9294 Z-3.2000 S1000
G1 F1000 X30.4099 Y9.0109 Z-3.2000 S1000
; retracting back to z-safe
G0 Z10
; Operation 1: CNC: Vector (path outside)
; Tool Diameter: 3
; Starting inflateGrp: Closed?:true

G0 Z10
G0 F1000 X60.0000 Y-1.5000

G0 Z0
G1 F300 Z-1.6000
G1 F1000 X34.5000 Y-1.5000 Z-1.6000 S1000
G1 F1000 X34.5000 Y-1.5000 Z-0.2000 S1000
G1 F1000 X25.5000 Y-1.5000 Z-0.2000 S1000
G1 F1000 X25.5000 Y-1.5000 Z-1.6000 S1000
G1 F1000 X0.0000 Y-1.5000 Z-1.6000 S1000
G1 F1000 X0.0000 Y-1.5000 Z-1.6000 S1000
G1 F1000 X-0.3899 Y-1.4484 Z-1.6000 S1000
G1 F1000 X-0.8344 Y-1.2465 Z-1.6000 S1000
G1 F1000 X-1.1906 Y-0.9125 Z-1.6000 S1000
G1 F1000 X-1.4205 Y-0.4818 Z-1.6000 S1000
G1 F1000 X-1.5000 Y0.0000 Z-1.6000 S1000
G1 F1000 X-1.5000 Y25.5000 Z-1.6000 S1000
G1 F1000 X-1.5000 Y25.5000 Z-0.2000 S1000
G1 F1000 X-1.5000 Y34.5000 Z-0.2000 S1000
G1 F1000 X-1.5000 Y34.5000 Z-1.6000 S1000
G1 F1000 X-1.5000 Y60.0000 Z-1.6000 S1000
G1 F1000 X-1.5000 Y60.0000 Z-1.6000 S1000
G1 F1000 X-1.4484 Y60.3899 Z-1.6000 S1000
G1 F1000 X-1.2465 Y60.8344 Z-1.6000 S1000
G1 F1000 X-0.9125 Y61.1906 Z-1.6000 S1000
G1 F1000 X-0.4818 Y61.4205 Z-1.6000 S1000
G1 F1000 X0.0000 Y61.5000 Z-1.6000 S1000
G1 F1000 X20.0000 Y61.5000 Z-1.6000 S1000
G1 F1000 X20.6638 Y61.3451 Z-1.6000 S1000
G1 F1000 X21.0607 Y61.0607 Z-1.6000 S1000
G1 F1000 X61.0607 Y21.0607 Z-1.6000 S1000
G1 F1000 X61.4205 Y20.4818 Z-1.6000 S1000
G1 F1000 X61.5000 Y20.0000 Z-1.6000 S1000
G1 F1000 X61.5000 Y0.0000 Z-1.6000 S1000
G1 F1000 X61.4484 Y-0.3899 Z-1.6000 S1000
G1 F1000 X61.2465 Y-0.8344 Z-1.6000 S1000
G1 F1000 X60.9125 Y-1.1906 Z-1.6000 S1000
G1 F1000 X60.4818 Y-1.4205 Z-1.6000 S1000
G1 F1000 X60.0000 Y-1.5000 Z-1.6000 S1000
; Starting inflateGrp: Closed?:true
G1 F300 Z-3.2000
G1 F1000 X34.5000 Y-1.5000 Z-3.2000 S1000
G1 F1000 X34.5000 Y-1.5000 Z-0.2000 S1000
G1 F1000 X25.5000 Y-1.5000 Z-0.2000 S1000
G1 F1000 X25.5000 Y-1.5000 Z-3.2000 S1000
G1 F1000 X0.0000 Y-1.5000 Z-3.2000 S1000
G1 F1000 X0.0000 Y-1.5000 Z-3.2000 S1000
G1 F1000 X-0.3899 Y-1.4484 Z-3.2000 S1000
G1 F1000 X-0.8344 Y-1.2465 Z-3.2000 S1000
G1 F1000 X-1.1906 Y-0.9125 Z-3.2000 S1000
G1 F1000 X-1.4205 Y-0.4818 Z-3.2000 S1000
G1 F1000 X-1.5000 Y0.0000 Z-3.2000 S1000
G1 F1000 X-1.5000 Y25.5000 Z-3.2000 S1000
G1 F1000 X-1.5000 Y25.5000 Z-0.2000 S1000
G1 F1000 X-1.5000 Y34.5000 Z-0.2000 S1000
G1 F1000 X-1.5000 Y34.5000 Z-3.2000 S1000
G1 F1000 X-1.5000 Y60.0000 Z-3.2000 S1000
G1 F1000 X-1.5000 Y60.0000 Z-3.2000 S1000
G1 F1000 X-1.4484 Y60.3899 Z-3.2000 S1000
G1 F1000 X-1.2465 Y60.8344 Z-3.2000 S1000
G1 F1000 X-0.9125 Y61.1906 Z-3.2000 S1000
G1 F1000 X-0.4818 Y61.4205 Z-3.2000 S1000
G1 F1000 X0.0000 Y61.5000 Z-3.2000 S1000
G1 F1000 X20.0000 Y61.5000 Z-3.2000 S1000
G1 F1000 X20.6638 Y61.3451 Z-3.2000 S1000
G1 F1000 X21.0607 Y61.0607 Z-3.2000 S1000
G1 F1000 X61.0607 Y21.0607 Z-3.2000 S1000
G1 F1000 X61.4205 Y20.4818 Z-3.2000 S1000
G1 F1000 X61.5000 Y20.0000 Z-3.2000 S1000
G1 F1000 X61.5000 Y0.0000 Z-3.2000 S1000
G1 F1000 X61.4484 Y-0.3899 Z-3.2000 S1000
G1 F1000 X61.2465 Y-0.8344 Z-3.2000 S1000
G1 F1000 X60.9125 Y-1.1906 Z-3.2000 S1000
G1 F1000 X60.4818 Y-1.4205 Z-3.2000 S1000
G1 F1000 X60.0000 Y-1.5000 Z-3.2000 S1000
; retracting back to z-safe
G0 Z10

M5 S0; Spindle Off
