; GCODE Generated by cam.openbuilds.com on 2020-09-01 
G21 ; mm-mode
G54; Work Coordinates
G21; mm-mode
G90; Absolute Positioning
M3 S1000; Spindle On

; Operation 0: CNC: Vector (path inside)
; Tool Diameter: 3
; Starting inflateGrp: Closed?:true

G0 Z10
G0 F1000 X130.4101 Y89.0107

G0 Z0
G1 F300 Z-1.5000
G1 F1000 X130.7573 Y89.2427 Z-1.5000 S1000
G1 F1000 X130.9893 Y89.5899 Z-1.5000 S1000
G1 F1000 X131.0708 Y89.9998 Z-1.5000 S1000
G1 F1000 X130.9893 Y90.4096 Z-1.5000 S1000
G1 F1000 X130.7572 Y90.7569 Z-1.5000 S1000
G1 F1000 X130.4101 Y90.9889 Z-1.5000 S1000
G1 F1000 X130.0002 Y91.0704 Z-1.5000 S1000
G1 F1000 X129.5903 Y90.9889 Z-1.5000 S1000
G1 F1000 X129.2432 Y90.7569 Z-1.5000 S1000
G1 F1000 X129.0111 Y90.4096 Z-1.5000 S1000
G1 F1000 X128.9296 Y89.9998 Z-1.5000 S1000
G1 F1000 X129.0111 Y89.5899 Z-1.5000 S1000
G1 F1000 X129.2431 Y89.2427 Z-1.5000 S1000
G1 F1000 X129.5903 Y89.0107 Z-1.5000 S1000
G1 F1000 X130.0002 Y88.9292 Z-1.5000 S1000
G1 F1000 X130.4101 Y89.0107 Z-1.5000 S1000
; Starting inflateGrp: Closed?:true
G1 F300 Z-3.0000
G1 F1000 X130.7573 Y89.2427 Z-3.0000 S1000
G1 F1000 X130.9893 Y89.5899 Z-3.0000 S1000
G1 F1000 X131.0708 Y89.9998 Z-3.0000 S1000
G1 F1000 X130.9893 Y90.4096 Z-3.0000 S1000
G1 F1000 X130.7572 Y90.7569 Z-3.0000 S1000
G1 F1000 X130.4101 Y90.9889 Z-3.0000 S1000
G1 F1000 X130.0002 Y91.0704 Z-3.0000 S1000
G1 F1000 X129.5903 Y90.9889 Z-3.0000 S1000
G1 F1000 X129.2432 Y90.7569 Z-3.0000 S1000
G1 F1000 X129.0111 Y90.4096 Z-3.0000 S1000
G1 F1000 X128.9296 Y89.9998 Z-3.0000 S1000
G1 F1000 X129.0111 Y89.5899 Z-3.0000 S1000
G1 F1000 X129.2431 Y89.2427 Z-3.0000 S1000
G1 F1000 X129.5903 Y89.0107 Z-3.0000 S1000
G1 F1000 X130.0002 Y88.9292 Z-3.0000 S1000
G1 F1000 X130.4101 Y89.0107 Z-3.0000 S1000
; Starting inflateGrp: Closed?:true
G1 F300 Z-4.5000
G1 F1000 X130.7573 Y89.2427 Z-4.5000 S1000
G1 F1000 X130.9893 Y89.5899 Z-4.5000 S1000
G1 F1000 X131.0708 Y89.9998 Z-4.5000 S1000
G1 F1000 X130.9893 Y90.4096 Z-4.5000 S1000
G1 F1000 X130.7572 Y90.7569 Z-4.5000 S1000
G1 F1000 X130.4101 Y90.9889 Z-4.5000 S1000
G1 F1000 X130.0002 Y91.0704 Z-4.5000 S1000
G1 F1000 X129.5903 Y90.9889 Z-4.5000 S1000
G1 F1000 X129.2432 Y90.7569 Z-4.5000 S1000
G1 F1000 X129.0111 Y90.4096 Z-4.5000 S1000
G1 F1000 X128.9296 Y89.9998 Z-4.5000 S1000
G1 F1000 X129.0111 Y89.5899 Z-4.5000 S1000
G1 F1000 X129.2431 Y89.2427 Z-4.5000 S1000
G1 F1000 X129.5903 Y89.0107 Z-4.5000 S1000
G1 F1000 X130.0002 Y88.9292 Z-4.5000 S1000
G1 F1000 X130.4101 Y89.0107 Z-4.5000 S1000
; Starting inflateGrp: Closed?:true
G1 F300 Z-6.0000
G1 F1000 X130.7573 Y89.2427 Z-6.0000 S1000
G1 F1000 X130.9893 Y89.5899 Z-6.0000 S1000
G1 F1000 X131.0708 Y89.9998 Z-6.0000 S1000
G1 F1000 X130.9893 Y90.4096 Z-6.0000 S1000
G1 F1000 X130.7572 Y90.7569 Z-6.0000 S1000
G1 F1000 X130.4101 Y90.9889 Z-6.0000 S1000
G1 F1000 X130.0002 Y91.0704 Z-6.0000 S1000
G1 F1000 X129.5903 Y90.9889 Z-6.0000 S1000
G1 F1000 X129.2432 Y90.7569 Z-6.0000 S1000
G1 F1000 X129.0111 Y90.4096 Z-6.0000 S1000
G1 F1000 X128.9296 Y89.9998 Z-6.0000 S1000
G1 F1000 X129.0111 Y89.5899 Z-6.0000 S1000
G1 F1000 X129.2431 Y89.2427 Z-6.0000 S1000
G1 F1000 X129.5903 Y89.0107 Z-6.0000 S1000
G1 F1000 X130.0002 Y88.9292 Z-6.0000 S1000
G1 F1000 X130.4101 Y89.0107 Z-6.0000 S1000
; Starting inflateGrp: Closed?:true
G1 F300 Z-7.5000
G1 F1000 X130.7573 Y89.2427 Z-7.5000 S1000
G1 F1000 X130.9893 Y89.5899 Z-7.5000 S1000
G1 F1000 X131.0708 Y89.9998 Z-7.5000 S1000
G1 F1000 X130.9893 Y90.4096 Z-7.5000 S1000
G1 F1000 X130.7572 Y90.7569 Z-7.5000 S1000
G1 F1000 X130.4101 Y90.9889 Z-7.5000 S1000
G1 F1000 X130.0002 Y91.0704 Z-7.5000 S1000
G1 F1000 X129.5903 Y90.9889 Z-7.5000 S1000
G1 F1000 X129.2432 Y90.7569 Z-7.5000 S1000
G1 F1000 X129.0111 Y90.4096 Z-7.5000 S1000
G1 F1000 X128.9296 Y89.9998 Z-7.5000 S1000
G1 F1000 X129.0111 Y89.5899 Z-7.5000 S1000
G1 F1000 X129.2431 Y89.2427 Z-7.5000 S1000
G1 F1000 X129.5903 Y89.0107 Z-7.5000 S1000
G1 F1000 X130.0002 Y88.9292 Z-7.5000 S1000
G1 F1000 X130.4101 Y89.0107 Z-7.5000 S1000
; Starting inflateGrp: Closed?:true
G1 F300 Z-9.0000
G1 F1000 X130.7573 Y89.2427 Z-9.0000 S1000
G1 F1000 X130.9893 Y89.5899 Z-9.0000 S1000
G1 F1000 X131.0708 Y89.9998 Z-9.0000 S1000
G1 F1000 X130.9893 Y90.4096 Z-9.0000 S1000
G1 F1000 X130.7572 Y90.7569 Z-9.0000 S1000
G1 F1000 X130.4101 Y90.9889 Z-9.0000 S1000
G1 F1000 X130.0002 Y91.0704 Z-9.0000 S1000
G1 F1000 X129.5903 Y90.9889 Z-9.0000 S1000
G1 F1000 X129.2432 Y90.7569 Z-9.0000 S1000
G1 F1000 X129.0111 Y90.4096 Z-9.0000 S1000
G1 F1000 X128.9296 Y89.9998 Z-9.0000 S1000
G1 F1000 X129.0111 Y89.5899 Z-9.0000 S1000
G1 F1000 X129.2431 Y89.2427 Z-9.0000 S1000
G1 F1000 X129.5903 Y89.0107 Z-9.0000 S1000
G1 F1000 X130.0002 Y88.9292 Z-9.0000 S1000
G1 F1000 X130.4101 Y89.0107 Z-9.0000 S1000
; Starting inflateGrp: Closed?:true
G1 F300 Z-10.5000
G1 F1000 X130.7573 Y89.2427 Z-10.5000 S1000
G1 F1000 X130.9893 Y89.5899 Z-10.5000 S1000
G1 F1000 X131.0708 Y89.9998 Z-10.5000 S1000
G1 F1000 X130.9893 Y90.4096 Z-10.5000 S1000
G1 F1000 X130.7572 Y90.7569 Z-10.5000 S1000
G1 F1000 X130.4101 Y90.9889 Z-10.5000 S1000
G1 F1000 X130.0002 Y91.0704 Z-10.5000 S1000
G1 F1000 X129.5903 Y90.9889 Z-10.5000 S1000
G1 F1000 X129.2432 Y90.7569 Z-10.5000 S1000
G1 F1000 X129.0111 Y90.4096 Z-10.5000 S1000
G1 F1000 X128.9296 Y89.9998 Z-10.5000 S1000
G1 F1000 X129.0111 Y89.5899 Z-10.5000 S1000
G1 F1000 X129.2431 Y89.2427 Z-10.5000 S1000
G1 F1000 X129.5903 Y89.0107 Z-10.5000 S1000
G1 F1000 X130.0002 Y88.9292 Z-10.5000 S1000
G1 F1000 X130.4101 Y89.0107 Z-10.5000 S1000
; Starting inflateGrp: Closed?:true
G1 F300 Z-12.0000
G1 F1000 X130.7573 Y89.2427 Z-12.0000 S1000
G1 F1000 X130.9893 Y89.5899 Z-12.0000 S1000
G1 F1000 X131.0708 Y89.9998 Z-12.0000 S1000
G1 F1000 X130.9893 Y90.4096 Z-12.0000 S1000
G1 F1000 X130.7572 Y90.7569 Z-12.0000 S1000
G1 F1000 X130.4101 Y90.9889 Z-12.0000 S1000
G1 F1000 X130.0002 Y91.0704 Z-12.0000 S1000
G1 F1000 X129.5903 Y90.9889 Z-12.0000 S1000
G1 F1000 X129.2432 Y90.7569 Z-12.0000 S1000
G1 F1000 X129.0111 Y90.4096 Z-12.0000 S1000
G1 F1000 X128.9296 Y89.9998 Z-12.0000 S1000
G1 F1000 X129.0111 Y89.5899 Z-12.0000 S1000
G1 F1000 X129.2431 Y89.2427 Z-12.0000 S1000
G1 F1000 X129.5903 Y89.0107 Z-12.0000 S1000
G1 F1000 X130.0002 Y88.9292 Z-12.0000 S1000
G1 F1000 X130.4101 Y89.0107 Z-12.0000 S1000
; Starting inflateGrp: Closed?:true
G1 F300 Z-13.5000
G1 F1000 X130.7573 Y89.2427 Z-13.5000 S1000
G1 F1000 X130.9893 Y89.5899 Z-13.5000 S1000
G1 F1000 X131.0708 Y89.9998 Z-13.5000 S1000
G1 F1000 X130.9893 Y90.4096 Z-13.5000 S1000
G1 F1000 X130.7572 Y90.7569 Z-13.5000 S1000
G1 F1000 X130.4101 Y90.9889 Z-13.5000 S1000
G1 F1000 X130.0002 Y91.0704 Z-13.5000 S1000
G1 F1000 X129.5903 Y90.9889 Z-13.5000 S1000
G1 F1000 X129.2432 Y90.7569 Z-13.5000 S1000
G1 F1000 X129.0111 Y90.4096 Z-13.5000 S1000
G1 F1000 X128.9296 Y89.9998 Z-13.5000 S1000
G1 F1000 X129.0111 Y89.5899 Z-13.5000 S1000
G1 F1000 X129.2431 Y89.2427 Z-13.5000 S1000
G1 F1000 X129.5903 Y89.0107 Z-13.5000 S1000
G1 F1000 X130.0002 Y88.9292 Z-13.5000 S1000
G1 F1000 X130.4101 Y89.0107 Z-13.5000 S1000
; Starting inflateGrp: Closed?:true
G1 F300 Z-15.0000
G1 F1000 X130.7573 Y89.2427 Z-15.0000 S1000
G1 F1000 X130.9893 Y89.5899 Z-15.0000 S1000
G1 F1000 X131.0708 Y89.9998 Z-15.0000 S1000
G1 F1000 X130.9893 Y90.4096 Z-15.0000 S1000
G1 F1000 X130.7572 Y90.7569 Z-15.0000 S1000
G1 F1000 X130.4101 Y90.9889 Z-15.0000 S1000
G1 F1000 X130.0002 Y91.0704 Z-15.0000 S1000
G1 F1000 X129.5903 Y90.9889 Z-15.0000 S1000
G1 F1000 X129.2432 Y90.7569 Z-15.0000 S1000
G1 F1000 X129.0111 Y90.4096 Z-15.0000 S1000
G1 F1000 X128.9296 Y89.9998 Z-15.0000 S1000
G1 F1000 X129.0111 Y89.5899 Z-15.0000 S1000
G1 F1000 X129.2431 Y89.2427 Z-15.0000 S1000
G1 F1000 X129.5903 Y89.0107 Z-15.0000 S1000
G1 F1000 X130.0002 Y88.9292 Z-15.0000 S1000
G1 F1000 X130.4101 Y89.0107 Z-15.0000 S1000
; Starting inflateGrp: Closed?:true
G1 F300 Z-16.5000
G1 F1000 X130.7573 Y89.2427 Z-16.5000 S1000
G1 F1000 X130.9893 Y89.5899 Z-16.5000 S1000
G1 F1000 X131.0708 Y89.9998 Z-16.5000 S1000
G1 F1000 X130.9893 Y90.4096 Z-16.5000 S1000
G1 F1000 X130.7572 Y90.7569 Z-16.5000 S1000
G1 F1000 X130.4101 Y90.9889 Z-16.5000 S1000
G1 F1000 X130.0002 Y91.0704 Z-16.5000 S1000
G1 F1000 X129.5903 Y90.9889 Z-16.5000 S1000
G1 F1000 X129.2432 Y90.7569 Z-16.5000 S1000
G1 F1000 X129.0111 Y90.4096 Z-16.5000 S1000
G1 F1000 X128.9296 Y89.9998 Z-16.5000 S1000
G1 F1000 X129.0111 Y89.5899 Z-16.5000 S1000
G1 F1000 X129.2431 Y89.2427 Z-16.5000 S1000
G1 F1000 X129.5903 Y89.0107 Z-16.5000 S1000
G1 F1000 X130.0002 Y88.9292 Z-16.5000 S1000
G1 F1000 X130.4101 Y89.0107 Z-16.5000 S1000
; Starting inflateGrp: Closed?:true
G1 F300 Z-18.0000
G1 F1000 X130.7573 Y89.2427 Z-18.0000 S1000
G1 F1000 X130.9893 Y89.5899 Z-18.0000 S1000
G1 F1000 X131.0708 Y89.9998 Z-18.0000 S1000
G1 F1000 X130.9893 Y90.4096 Z-18.0000 S1000
G1 F1000 X130.7572 Y90.7569 Z-18.0000 S1000
G1 F1000 X130.4101 Y90.9889 Z-18.0000 S1000
G1 F1000 X130.0002 Y91.0704 Z-18.0000 S1000
G1 F1000 X129.5903 Y90.9889 Z-18.0000 S1000
G1 F1000 X129.2432 Y90.7569 Z-18.0000 S1000
G1 F1000 X129.0111 Y90.4096 Z-18.0000 S1000
G1 F1000 X128.9296 Y89.9998 Z-18.0000 S1000
G1 F1000 X129.0111 Y89.5899 Z-18.0000 S1000
G1 F1000 X129.2431 Y89.2427 Z-18.0000 S1000
G1 F1000 X129.5903 Y89.0107 Z-18.0000 S1000
G1 F1000 X130.0002 Y88.9292 Z-18.0000 S1000
G1 F1000 X130.4101 Y89.0107 Z-18.0000 S1000
; Starting inflateGrp: Closed?:true
G1 F300 Z-19.2000
G1 F1000 X130.7573 Y89.2427 Z-19.2000 S1000
G1 F1000 X130.9893 Y89.5899 Z-19.2000 S1000
G1 F1000 X131.0708 Y89.9998 Z-19.2000 S1000
G1 F1000 X130.9893 Y90.4096 Z-19.2000 S1000
G1 F1000 X130.7572 Y90.7569 Z-19.2000 S1000
G1 F1000 X130.4101 Y90.9889 Z-19.2000 S1000
G1 F1000 X130.0002 Y91.0704 Z-19.2000 S1000
G1 F1000 X129.5903 Y90.9889 Z-19.2000 S1000
G1 F1000 X129.2432 Y90.7569 Z-19.2000 S1000
G1 F1000 X129.0111 Y90.4096 Z-19.2000 S1000
G1 F1000 X128.9296 Y89.9998 Z-19.2000 S1000
G1 F1000 X129.0111 Y89.5899 Z-19.2000 S1000
G1 F1000 X129.2431 Y89.2427 Z-19.2000 S1000
G1 F1000 X129.5903 Y89.0107 Z-19.2000 S1000
G1 F1000 X130.0002 Y88.9292 Z-19.2000 S1000
G1 F1000 X130.4101 Y89.0107 Z-19.2000 S1000
; Starting inflateGrp: Closed?:true

G0 Z10
G0 X130.4101 Y49.0107

G0 Z0
G1 F300 Z-1.5000
G1 F1000 X130.7573 Y49.2427 Z-1.5000 S1000
G1 F1000 X130.9893 Y49.5899 Z-1.5000 S1000
G1 F1000 X131.0708 Y49.9998 Z-1.5000 S1000
G1 F1000 X130.9893 Y50.4097 Z-1.5000 S1000
G1 F1000 X130.7573 Y50.7569 Z-1.5000 S1000
G1 F1000 X130.4101 Y50.9889 Z-1.5000 S1000
G1 F1000 X130.0002 Y51.0704 Z-1.5000 S1000
G1 F1000 X129.5903 Y50.9889 Z-1.5000 S1000
G1 F1000 X129.2431 Y50.7569 Z-1.5000 S1000
G1 F1000 X129.0111 Y50.4097 Z-1.5000 S1000
G1 F1000 X128.9296 Y49.9998 Z-1.5000 S1000
G1 F1000 X129.0111 Y49.5899 Z-1.5000 S1000
G1 F1000 X129.2431 Y49.2427 Z-1.5000 S1000
G1 F1000 X129.5903 Y49.0107 Z-1.5000 S1000
G1 F1000 X130.0002 Y48.9292 Z-1.5000 S1000
G1 F1000 X130.4101 Y49.0107 Z-1.5000 S1000
; Starting inflateGrp: Closed?:true
G1 F300 Z-3.0000
G1 F1000 X130.7573 Y49.2427 Z-3.0000 S1000
G1 F1000 X130.9893 Y49.5899 Z-3.0000 S1000
G1 F1000 X131.0708 Y49.9998 Z-3.0000 S1000
G1 F1000 X130.9893 Y50.4097 Z-3.0000 S1000
G1 F1000 X130.7573 Y50.7569 Z-3.0000 S1000
G1 F1000 X130.4101 Y50.9889 Z-3.0000 S1000
G1 F1000 X130.0002 Y51.0704 Z-3.0000 S1000
G1 F1000 X129.5903 Y50.9889 Z-3.0000 S1000
G1 F1000 X129.2431 Y50.7569 Z-3.0000 S1000
G1 F1000 X129.0111 Y50.4097 Z-3.0000 S1000
G1 F1000 X128.9296 Y49.9998 Z-3.0000 S1000
G1 F1000 X129.0111 Y49.5899 Z-3.0000 S1000
G1 F1000 X129.2431 Y49.2427 Z-3.0000 S1000
G1 F1000 X129.5903 Y49.0107 Z-3.0000 S1000
G1 F1000 X130.0002 Y48.9292 Z-3.0000 S1000
G1 F1000 X130.4101 Y49.0107 Z-3.0000 S1000
; Starting inflateGrp: Closed?:true
G1 F300 Z-4.5000
G1 F1000 X130.7573 Y49.2427 Z-4.5000 S1000
G1 F1000 X130.9893 Y49.5899 Z-4.5000 S1000
G1 F1000 X131.0708 Y49.9998 Z-4.5000 S1000
G1 F1000 X130.9893 Y50.4097 Z-4.5000 S1000
G1 F1000 X130.7573 Y50.7569 Z-4.5000 S1000
G1 F1000 X130.4101 Y50.9889 Z-4.5000 S1000
G1 F1000 X130.0002 Y51.0704 Z-4.5000 S1000
G1 F1000 X129.5903 Y50.9889 Z-4.5000 S1000
G1 F1000 X129.2431 Y50.7569 Z-4.5000 S1000
G1 F1000 X129.0111 Y50.4097 Z-4.5000 S1000
G1 F1000 X128.9296 Y49.9998 Z-4.5000 S1000
G1 F1000 X129.0111 Y49.5899 Z-4.5000 S1000
G1 F1000 X129.2431 Y49.2427 Z-4.5000 S1000
G1 F1000 X129.5903 Y49.0107 Z-4.5000 S1000
G1 F1000 X130.0002 Y48.9292 Z-4.5000 S1000
G1 F1000 X130.4101 Y49.0107 Z-4.5000 S1000
; Starting inflateGrp: Closed?:true
G1 F300 Z-6.0000
G1 F1000 X130.7573 Y49.2427 Z-6.0000 S1000
G1 F1000 X130.9893 Y49.5899 Z-6.0000 S1000
G1 F1000 X131.0708 Y49.9998 Z-6.0000 S1000
G1 F1000 X130.9893 Y50.4097 Z-6.0000 S1000
G1 F1000 X130.7573 Y50.7569 Z-6.0000 S1000
G1 F1000 X130.4101 Y50.9889 Z-6.0000 S1000
G1 F1000 X130.0002 Y51.0704 Z-6.0000 S1000
G1 F1000 X129.5903 Y50.9889 Z-6.0000 S1000
G1 F1000 X129.2431 Y50.7569 Z-6.0000 S1000
G1 F1000 X129.0111 Y50.4097 Z-6.0000 S1000
G1 F1000 X128.9296 Y49.9998 Z-6.0000 S1000
G1 F1000 X129.0111 Y49.5899 Z-6.0000 S1000
G1 F1000 X129.2431 Y49.2427 Z-6.0000 S1000
G1 F1000 X129.5903 Y49.0107 Z-6.0000 S1000
G1 F1000 X130.0002 Y48.9292 Z-6.0000 S1000
G1 F1000 X130.4101 Y49.0107 Z-6.0000 S1000
; Starting inflateGrp: Closed?:true
G1 F300 Z-7.5000
G1 F1000 X130.7573 Y49.2427 Z-7.5000 S1000
G1 F1000 X130.9893 Y49.5899 Z-7.5000 S1000
G1 F1000 X131.0708 Y49.9998 Z-7.5000 S1000
G1 F1000 X130.9893 Y50.4097 Z-7.5000 S1000
G1 F1000 X130.7573 Y50.7569 Z-7.5000 S1000
G1 F1000 X130.4101 Y50.9889 Z-7.5000 S1000
G1 F1000 X130.0002 Y51.0704 Z-7.5000 S1000
G1 F1000 X129.5903 Y50.9889 Z-7.5000 S1000
G1 F1000 X129.2431 Y50.7569 Z-7.5000 S1000
G1 F1000 X129.0111 Y50.4097 Z-7.5000 S1000
G1 F1000 X128.9296 Y49.9998 Z-7.5000 S1000
G1 F1000 X129.0111 Y49.5899 Z-7.5000 S1000
G1 F1000 X129.2431 Y49.2427 Z-7.5000 S1000
G1 F1000 X129.5903 Y49.0107 Z-7.5000 S1000
G1 F1000 X130.0002 Y48.9292 Z-7.5000 S1000
G1 F1000 X130.4101 Y49.0107 Z-7.5000 S1000
; Starting inflateGrp: Closed?:true
G1 F300 Z-9.0000
G1 F1000 X130.7573 Y49.2427 Z-9.0000 S1000
G1 F1000 X130.9893 Y49.5899 Z-9.0000 S1000
G1 F1000 X131.0708 Y49.9998 Z-9.0000 S1000
G1 F1000 X130.9893 Y50.4097 Z-9.0000 S1000
G1 F1000 X130.7573 Y50.7569 Z-9.0000 S1000
G1 F1000 X130.4101 Y50.9889 Z-9.0000 S1000
G1 F1000 X130.0002 Y51.0704 Z-9.0000 S1000
G1 F1000 X129.5903 Y50.9889 Z-9.0000 S1000
G1 F1000 X129.2431 Y50.7569 Z-9.0000 S1000
G1 F1000 X129.0111 Y50.4097 Z-9.0000 S1000
G1 F1000 X128.9296 Y49.9998 Z-9.0000 S1000
G1 F1000 X129.0111 Y49.5899 Z-9.0000 S1000
G1 F1000 X129.2431 Y49.2427 Z-9.0000 S1000
G1 F1000 X129.5903 Y49.0107 Z-9.0000 S1000
G1 F1000 X130.0002 Y48.9292 Z-9.0000 S1000
G1 F1000 X130.4101 Y49.0107 Z-9.0000 S1000
; Starting inflateGrp: Closed?:true
G1 F300 Z-10.5000
G1 F1000 X130.7573 Y49.2427 Z-10.5000 S1000
G1 F1000 X130.9893 Y49.5899 Z-10.5000 S1000
G1 F1000 X131.0708 Y49.9998 Z-10.5000 S1000
G1 F1000 X130.9893 Y50.4097 Z-10.5000 S1000
G1 F1000 X130.7573 Y50.7569 Z-10.5000 S1000
G1 F1000 X130.4101 Y50.9889 Z-10.5000 S1000
G1 F1000 X130.0002 Y51.0704 Z-10.5000 S1000
G1 F1000 X129.5903 Y50.9889 Z-10.5000 S1000
G1 F1000 X129.2431 Y50.7569 Z-10.5000 S1000
G1 F1000 X129.0111 Y50.4097 Z-10.5000 S1000
G1 F1000 X128.9296 Y49.9998 Z-10.5000 S1000
G1 F1000 X129.0111 Y49.5899 Z-10.5000 S1000
G1 F1000 X129.2431 Y49.2427 Z-10.5000 S1000
G1 F1000 X129.5903 Y49.0107 Z-10.5000 S1000
G1 F1000 X130.0002 Y48.9292 Z-10.5000 S1000
G1 F1000 X130.4101 Y49.0107 Z-10.5000 S1000
; Starting inflateGrp: Closed?:true
G1 F300 Z-12.0000
G1 F1000 X130.7573 Y49.2427 Z-12.0000 S1000
G1 F1000 X130.9893 Y49.5899 Z-12.0000 S1000
G1 F1000 X131.0708 Y49.9998 Z-12.0000 S1000
G1 F1000 X130.9893 Y50.4097 Z-12.0000 S1000
G1 F1000 X130.7573 Y50.7569 Z-12.0000 S1000
G1 F1000 X130.4101 Y50.9889 Z-12.0000 S1000
G1 F1000 X130.0002 Y51.0704 Z-12.0000 S1000
G1 F1000 X129.5903 Y50.9889 Z-12.0000 S1000
G1 F1000 X129.2431 Y50.7569 Z-12.0000 S1000
G1 F1000 X129.0111 Y50.4097 Z-12.0000 S1000
G1 F1000 X128.9296 Y49.9998 Z-12.0000 S1000
G1 F1000 X129.0111 Y49.5899 Z-12.0000 S1000
G1 F1000 X129.2431 Y49.2427 Z-12.0000 S1000
G1 F1000 X129.5903 Y49.0107 Z-12.0000 S1000
G1 F1000 X130.0002 Y48.9292 Z-12.0000 S1000
G1 F1000 X130.4101 Y49.0107 Z-12.0000 S1000
; Starting inflateGrp: Closed?:true
G1 F300 Z-13.5000
G1 F1000 X130.7573 Y49.2427 Z-13.5000 S1000
G1 F1000 X130.9893 Y49.5899 Z-13.5000 S1000
G1 F1000 X131.0708 Y49.9998 Z-13.5000 S1000
G1 F1000 X130.9893 Y50.4097 Z-13.5000 S1000
G1 F1000 X130.7573 Y50.7569 Z-13.5000 S1000
G1 F1000 X130.4101 Y50.9889 Z-13.5000 S1000
G1 F1000 X130.0002 Y51.0704 Z-13.5000 S1000
G1 F1000 X129.5903 Y50.9889 Z-13.5000 S1000
G1 F1000 X129.2431 Y50.7569 Z-13.5000 S1000
G1 F1000 X129.0111 Y50.4097 Z-13.5000 S1000
G1 F1000 X128.9296 Y49.9998 Z-13.5000 S1000
G1 F1000 X129.0111 Y49.5899 Z-13.5000 S1000
G1 F1000 X129.2431 Y49.2427 Z-13.5000 S1000
G1 F1000 X129.5903 Y49.0107 Z-13.5000 S1000
G1 F1000 X130.0002 Y48.9292 Z-13.5000 S1000
G1 F1000 X130.4101 Y49.0107 Z-13.5000 S1000
; Starting inflateGrp: Closed?:true
G1 F300 Z-15.0000
G1 F1000 X130.7573 Y49.2427 Z-15.0000 S1000
G1 F1000 X130.9893 Y49.5899 Z-15.0000 S1000
G1 F1000 X131.0708 Y49.9998 Z-15.0000 S1000
G1 F1000 X130.9893 Y50.4097 Z-15.0000 S1000
G1 F1000 X130.7573 Y50.7569 Z-15.0000 S1000
G1 F1000 X130.4101 Y50.9889 Z-15.0000 S1000
G1 F1000 X130.0002 Y51.0704 Z-15.0000 S1000
G1 F1000 X129.5903 Y50.9889 Z-15.0000 S1000
G1 F1000 X129.2431 Y50.7569 Z-15.0000 S1000
G1 F1000 X129.0111 Y50.4097 Z-15.0000 S1000
G1 F1000 X128.9296 Y49.9998 Z-15.0000 S1000
G1 F1000 X129.0111 Y49.5899 Z-15.0000 S1000
G1 F1000 X129.2431 Y49.2427 Z-15.0000 S1000
G1 F1000 X129.5903 Y49.0107 Z-15.0000 S1000
G1 F1000 X130.0002 Y48.9292 Z-15.0000 S1000
G1 F1000 X130.4101 Y49.0107 Z-15.0000 S1000
; Starting inflateGrp: Closed?:true
G1 F300 Z-16.5000
G1 F1000 X130.7573 Y49.2427 Z-16.5000 S1000
G1 F1000 X130.9893 Y49.5899 Z-16.5000 S1000
G1 F1000 X131.0708 Y49.9998 Z-16.5000 S1000
G1 F1000 X130.9893 Y50.4097 Z-16.5000 S1000
G1 F1000 X130.7573 Y50.7569 Z-16.5000 S1000
G1 F1000 X130.4101 Y50.9889 Z-16.5000 S1000
G1 F1000 X130.0002 Y51.0704 Z-16.5000 S1000
G1 F1000 X129.5903 Y50.9889 Z-16.5000 S1000
G1 F1000 X129.2431 Y50.7569 Z-16.5000 S1000
G1 F1000 X129.0111 Y50.4097 Z-16.5000 S1000
G1 F1000 X128.9296 Y49.9998 Z-16.5000 S1000
G1 F1000 X129.0111 Y49.5899 Z-16.5000 S1000
G1 F1000 X129.2431 Y49.2427 Z-16.5000 S1000
G1 F1000 X129.5903 Y49.0107 Z-16.5000 S1000
G1 F1000 X130.0002 Y48.9292 Z-16.5000 S1000
G1 F1000 X130.4101 Y49.0107 Z-16.5000 S1000
; Starting inflateGrp: Closed?:true
G1 F300 Z-18.0000
G1 F1000 X130.7573 Y49.2427 Z-18.0000 S1000
G1 F1000 X130.9893 Y49.5899 Z-18.0000 S1000
G1 F1000 X131.0708 Y49.9998 Z-18.0000 S1000
G1 F1000 X130.9893 Y50.4097 Z-18.0000 S1000
G1 F1000 X130.7573 Y50.7569 Z-18.0000 S1000
G1 F1000 X130.4101 Y50.9889 Z-18.0000 S1000
G1 F1000 X130.0002 Y51.0704 Z-18.0000 S1000
G1 F1000 X129.5903 Y50.9889 Z-18.0000 S1000
G1 F1000 X129.2431 Y50.7569 Z-18.0000 S1000
G1 F1000 X129.0111 Y50.4097 Z-18.0000 S1000
G1 F1000 X128.9296 Y49.9998 Z-18.0000 S1000
G1 F1000 X129.0111 Y49.5899 Z-18.0000 S1000
G1 F1000 X129.2431 Y49.2427 Z-18.0000 S1000
G1 F1000 X129.5903 Y49.0107 Z-18.0000 S1000
G1 F1000 X130.0002 Y48.9292 Z-18.0000 S1000
G1 F1000 X130.4101 Y49.0107 Z-18.0000 S1000
; Starting inflateGrp: Closed?:true
G1 F300 Z-19.2000
G1 F1000 X130.7573 Y49.2427 Z-19.2000 S1000
G1 F1000 X130.9893 Y49.5899 Z-19.2000 S1000
G1 F1000 X131.0708 Y49.9998 Z-19.2000 S1000
G1 F1000 X130.9893 Y50.4097 Z-19.2000 S1000
G1 F1000 X130.7573 Y50.7569 Z-19.2000 S1000
G1 F1000 X130.4101 Y50.9889 Z-19.2000 S1000
G1 F1000 X130.0002 Y51.0704 Z-19.2000 S1000
G1 F1000 X129.5903 Y50.9889 Z-19.2000 S1000
G1 F1000 X129.2431 Y50.7569 Z-19.2000 S1000
G1 F1000 X129.0111 Y50.4097 Z-19.2000 S1000
G1 F1000 X128.9296 Y49.9998 Z-19.2000 S1000
G1 F1000 X129.0111 Y49.5899 Z-19.2000 S1000
G1 F1000 X129.2431 Y49.2427 Z-19.2000 S1000
G1 F1000 X129.5903 Y49.0107 Z-19.2000 S1000
G1 F1000 X130.0002 Y48.9292 Z-19.2000 S1000
G1 F1000 X130.4101 Y49.0107 Z-19.2000 S1000
; Starting inflateGrp: Closed?:true

G0 Z10
G0 X30.4101 Y9.0107

G0 Z0
G1 F300 Z-1.5000
G1 F1000 X30.7573 Y9.2427 Z-1.5000 S1000
G1 F1000 X30.9893 Y9.5899 Z-1.5000 S1000
G1 F1000 X31.0708 Y9.9998 Z-1.5000 S1000
G1 F1000 X30.9893 Y10.4097 Z-1.5000 S1000
G1 F1000 X30.7573 Y10.7569 Z-1.5000 S1000
G1 F1000 X30.4101 Y10.9889 Z-1.5000 S1000
G1 F1000 X30.0002 Y11.0704 Z-1.5000 S1000
G1 F1000 X29.5903 Y10.9889 Z-1.5000 S1000
G1 F1000 X29.2431 Y10.7569 Z-1.5000 S1000
G1 F1000 X29.0111 Y10.4097 Z-1.5000 S1000
G1 F1000 X28.9296 Y9.9998 Z-1.5000 S1000
G1 F1000 X29.0111 Y9.5899 Z-1.5000 S1000
G1 F1000 X29.2431 Y9.2427 Z-1.5000 S1000
G1 F1000 X29.5903 Y9.0107 Z-1.5000 S1000
G1 F1000 X30.0002 Y8.9292 Z-1.5000 S1000
G1 F1000 X30.4101 Y9.0107 Z-1.5000 S1000
; Starting inflateGrp: Closed?:true
G1 F300 Z-3.0000
G1 F1000 X30.7573 Y9.2427 Z-3.0000 S1000
G1 F1000 X30.9893 Y9.5899 Z-3.0000 S1000
G1 F1000 X31.0708 Y9.9998 Z-3.0000 S1000
G1 F1000 X30.9893 Y10.4097 Z-3.0000 S1000
G1 F1000 X30.7573 Y10.7569 Z-3.0000 S1000
G1 F1000 X30.4101 Y10.9889 Z-3.0000 S1000
G1 F1000 X30.0002 Y11.0704 Z-3.0000 S1000
G1 F1000 X29.5903 Y10.9889 Z-3.0000 S1000
G1 F1000 X29.2431 Y10.7569 Z-3.0000 S1000
G1 F1000 X29.0111 Y10.4097 Z-3.0000 S1000
G1 F1000 X28.9296 Y9.9998 Z-3.0000 S1000
G1 F1000 X29.0111 Y9.5899 Z-3.0000 S1000
G1 F1000 X29.2431 Y9.2427 Z-3.0000 S1000
G1 F1000 X29.5903 Y9.0107 Z-3.0000 S1000
G1 F1000 X30.0002 Y8.9292 Z-3.0000 S1000
G1 F1000 X30.4101 Y9.0107 Z-3.0000 S1000
; Starting inflateGrp: Closed?:true
G1 F300 Z-4.5000
G1 F1000 X30.7573 Y9.2427 Z-4.5000 S1000
G1 F1000 X30.9893 Y9.5899 Z-4.5000 S1000
G1 F1000 X31.0708 Y9.9998 Z-4.5000 S1000
G1 F1000 X30.9893 Y10.4097 Z-4.5000 S1000
G1 F1000 X30.7573 Y10.7569 Z-4.5000 S1000
G1 F1000 X30.4101 Y10.9889 Z-4.5000 S1000
G1 F1000 X30.0002 Y11.0704 Z-4.5000 S1000
G1 F1000 X29.5903 Y10.9889 Z-4.5000 S1000
G1 F1000 X29.2431 Y10.7569 Z-4.5000 S1000
G1 F1000 X29.0111 Y10.4097 Z-4.5000 S1000
G1 F1000 X28.9296 Y9.9998 Z-4.5000 S1000
G1 F1000 X29.0111 Y9.5899 Z-4.5000 S1000
G1 F1000 X29.2431 Y9.2427 Z-4.5000 S1000
G1 F1000 X29.5903 Y9.0107 Z-4.5000 S1000
G1 F1000 X30.0002 Y8.9292 Z-4.5000 S1000
G1 F1000 X30.4101 Y9.0107 Z-4.5000 S1000
; Starting inflateGrp: Closed?:true
G1 F300 Z-6.0000
G1 F1000 X30.7573 Y9.2427 Z-6.0000 S1000
G1 F1000 X30.9893 Y9.5899 Z-6.0000 S1000
G1 F1000 X31.0708 Y9.9998 Z-6.0000 S1000
G1 F1000 X30.9893 Y10.4097 Z-6.0000 S1000
G1 F1000 X30.7573 Y10.7569 Z-6.0000 S1000
G1 F1000 X30.4101 Y10.9889 Z-6.0000 S1000
G1 F1000 X30.0002 Y11.0704 Z-6.0000 S1000
G1 F1000 X29.5903 Y10.9889 Z-6.0000 S1000
G1 F1000 X29.2431 Y10.7569 Z-6.0000 S1000
G1 F1000 X29.0111 Y10.4097 Z-6.0000 S1000
G1 F1000 X28.9296 Y9.9998 Z-6.0000 S1000
G1 F1000 X29.0111 Y9.5899 Z-6.0000 S1000
G1 F1000 X29.2431 Y9.2427 Z-6.0000 S1000
G1 F1000 X29.5903 Y9.0107 Z-6.0000 S1000
G1 F1000 X30.0002 Y8.9292 Z-6.0000 S1000
G1 F1000 X30.4101 Y9.0107 Z-6.0000 S1000
; Starting inflateGrp: Closed?:true
G1 F300 Z-7.5000
G1 F1000 X30.7573 Y9.2427 Z-7.5000 S1000
G1 F1000 X30.9893 Y9.5899 Z-7.5000 S1000
G1 F1000 X31.0708 Y9.9998 Z-7.5000 S1000
G1 F1000 X30.9893 Y10.4097 Z-7.5000 S1000
G1 F1000 X30.7573 Y10.7569 Z-7.5000 S1000
G1 F1000 X30.4101 Y10.9889 Z-7.5000 S1000
G1 F1000 X30.0002 Y11.0704 Z-7.5000 S1000
G1 F1000 X29.5903 Y10.9889 Z-7.5000 S1000
G1 F1000 X29.2431 Y10.7569 Z-7.5000 S1000
G1 F1000 X29.0111 Y10.4097 Z-7.5000 S1000
G1 F1000 X28.9296 Y9.9998 Z-7.5000 S1000
G1 F1000 X29.0111 Y9.5899 Z-7.5000 S1000
G1 F1000 X29.2431 Y9.2427 Z-7.5000 S1000
G1 F1000 X29.5903 Y9.0107 Z-7.5000 S1000
G1 F1000 X30.0002 Y8.9292 Z-7.5000 S1000
G1 F1000 X30.4101 Y9.0107 Z-7.5000 S1000
; Starting inflateGrp: Closed?:true
G1 F300 Z-9.0000
G1 F1000 X30.7573 Y9.2427 Z-9.0000 S1000
G1 F1000 X30.9893 Y9.5899 Z-9.0000 S1000
G1 F1000 X31.0708 Y9.9998 Z-9.0000 S1000
G1 F1000 X30.9893 Y10.4097 Z-9.0000 S1000
G1 F1000 X30.7573 Y10.7569 Z-9.0000 S1000
G1 F1000 X30.4101 Y10.9889 Z-9.0000 S1000
G1 F1000 X30.0002 Y11.0704 Z-9.0000 S1000
G1 F1000 X29.5903 Y10.9889 Z-9.0000 S1000
G1 F1000 X29.2431 Y10.7569 Z-9.0000 S1000
G1 F1000 X29.0111 Y10.4097 Z-9.0000 S1000
G1 F1000 X28.9296 Y9.9998 Z-9.0000 S1000
G1 F1000 X29.0111 Y9.5899 Z-9.0000 S1000
G1 F1000 X29.2431 Y9.2427 Z-9.0000 S1000
G1 F1000 X29.5903 Y9.0107 Z-9.0000 S1000
G1 F1000 X30.0002 Y8.9292 Z-9.0000 S1000
G1 F1000 X30.4101 Y9.0107 Z-9.0000 S1000
; Starting inflateGrp: Closed?:true
G1 F300 Z-10.5000
G1 F1000 X30.7573 Y9.2427 Z-10.5000 S1000
G1 F1000 X30.9893 Y9.5899 Z-10.5000 S1000
G1 F1000 X31.0708 Y9.9998 Z-10.5000 S1000
G1 F1000 X30.9893 Y10.4097 Z-10.5000 S1000
G1 F1000 X30.7573 Y10.7569 Z-10.5000 S1000
G1 F1000 X30.4101 Y10.9889 Z-10.5000 S1000
G1 F1000 X30.0002 Y11.0704 Z-10.5000 S1000
G1 F1000 X29.5903 Y10.9889 Z-10.5000 S1000
G1 F1000 X29.2431 Y10.7569 Z-10.5000 S1000
G1 F1000 X29.0111 Y10.4097 Z-10.5000 S1000
G1 F1000 X28.9296 Y9.9998 Z-10.5000 S1000
G1 F1000 X29.0111 Y9.5899 Z-10.5000 S1000
G1 F1000 X29.2431 Y9.2427 Z-10.5000 S1000
G1 F1000 X29.5903 Y9.0107 Z-10.5000 S1000
G1 F1000 X30.0002 Y8.9292 Z-10.5000 S1000
G1 F1000 X30.4101 Y9.0107 Z-10.5000 S1000
; Starting inflateGrp: Closed?:true
G1 F300 Z-12.0000
G1 F1000 X30.7573 Y9.2427 Z-12.0000 S1000
G1 F1000 X30.9893 Y9.5899 Z-12.0000 S1000
G1 F1000 X31.0708 Y9.9998 Z-12.0000 S1000
G1 F1000 X30.9893 Y10.4097 Z-12.0000 S1000
G1 F1000 X30.7573 Y10.7569 Z-12.0000 S1000
G1 F1000 X30.4101 Y10.9889 Z-12.0000 S1000
G1 F1000 X30.0002 Y11.0704 Z-12.0000 S1000
G1 F1000 X29.5903 Y10.9889 Z-12.0000 S1000
G1 F1000 X29.2431 Y10.7569 Z-12.0000 S1000
G1 F1000 X29.0111 Y10.4097 Z-12.0000 S1000
G1 F1000 X28.9296 Y9.9998 Z-12.0000 S1000
G1 F1000 X29.0111 Y9.5899 Z-12.0000 S1000
G1 F1000 X29.2431 Y9.2427 Z-12.0000 S1000
G1 F1000 X29.5903 Y9.0107 Z-12.0000 S1000
G1 F1000 X30.0002 Y8.9292 Z-12.0000 S1000
G1 F1000 X30.4101 Y9.0107 Z-12.0000 S1000
; Starting inflateGrp: Closed?:true
G1 F300 Z-13.5000
G1 F1000 X30.7573 Y9.2427 Z-13.5000 S1000
G1 F1000 X30.9893 Y9.5899 Z-13.5000 S1000
G1 F1000 X31.0708 Y9.9998 Z-13.5000 S1000
G1 F1000 X30.9893 Y10.4097 Z-13.5000 S1000
G1 F1000 X30.7573 Y10.7569 Z-13.5000 S1000
G1 F1000 X30.4101 Y10.9889 Z-13.5000 S1000
G1 F1000 X30.0002 Y11.0704 Z-13.5000 S1000
G1 F1000 X29.5903 Y10.9889 Z-13.5000 S1000
G1 F1000 X29.2431 Y10.7569 Z-13.5000 S1000
G1 F1000 X29.0111 Y10.4097 Z-13.5000 S1000
G1 F1000 X28.9296 Y9.9998 Z-13.5000 S1000
G1 F1000 X29.0111 Y9.5899 Z-13.5000 S1000
G1 F1000 X29.2431 Y9.2427 Z-13.5000 S1000
G1 F1000 X29.5903 Y9.0107 Z-13.5000 S1000
G1 F1000 X30.0002 Y8.9292 Z-13.5000 S1000
G1 F1000 X30.4101 Y9.0107 Z-13.5000 S1000
; Starting inflateGrp: Closed?:true
G1 F300 Z-15.0000
G1 F1000 X30.7573 Y9.2427 Z-15.0000 S1000
G1 F1000 X30.9893 Y9.5899 Z-15.0000 S1000
G1 F1000 X31.0708 Y9.9998 Z-15.0000 S1000
G1 F1000 X30.9893 Y10.4097 Z-15.0000 S1000
G1 F1000 X30.7573 Y10.7569 Z-15.0000 S1000
G1 F1000 X30.4101 Y10.9889 Z-15.0000 S1000
G1 F1000 X30.0002 Y11.0704 Z-15.0000 S1000
G1 F1000 X29.5903 Y10.9889 Z-15.0000 S1000
G1 F1000 X29.2431 Y10.7569 Z-15.0000 S1000
G1 F1000 X29.0111 Y10.4097 Z-15.0000 S1000
G1 F1000 X28.9296 Y9.9998 Z-15.0000 S1000
G1 F1000 X29.0111 Y9.5899 Z-15.0000 S1000
G1 F1000 X29.2431 Y9.2427 Z-15.0000 S1000
G1 F1000 X29.5903 Y9.0107 Z-15.0000 S1000
G1 F1000 X30.0002 Y8.9292 Z-15.0000 S1000
G1 F1000 X30.4101 Y9.0107 Z-15.0000 S1000
; Starting inflateGrp: Closed?:true
G1 F300 Z-16.5000
G1 F1000 X30.7573 Y9.2427 Z-16.5000 S1000
G1 F1000 X30.9893 Y9.5899 Z-16.5000 S1000
G1 F1000 X31.0708 Y9.9998 Z-16.5000 S1000
G1 F1000 X30.9893 Y10.4097 Z-16.5000 S1000
G1 F1000 X30.7573 Y10.7569 Z-16.5000 S1000
G1 F1000 X30.4101 Y10.9889 Z-16.5000 S1000
G1 F1000 X30.0002 Y11.0704 Z-16.5000 S1000
G1 F1000 X29.5903 Y10.9889 Z-16.5000 S1000
G1 F1000 X29.2431 Y10.7569 Z-16.5000 S1000
G1 F1000 X29.0111 Y10.4097 Z-16.5000 S1000
G1 F1000 X28.9296 Y9.9998 Z-16.5000 S1000
G1 F1000 X29.0111 Y9.5899 Z-16.5000 S1000
G1 F1000 X29.2431 Y9.2427 Z-16.5000 S1000
G1 F1000 X29.5903 Y9.0107 Z-16.5000 S1000
G1 F1000 X30.0002 Y8.9292 Z-16.5000 S1000
G1 F1000 X30.4101 Y9.0107 Z-16.5000 S1000
; Starting inflateGrp: Closed?:true
G1 F300 Z-18.0000
G1 F1000 X30.7573 Y9.2427 Z-18.0000 S1000
G1 F1000 X30.9893 Y9.5899 Z-18.0000 S1000
G1 F1000 X31.0708 Y9.9998 Z-18.0000 S1000
G1 F1000 X30.9893 Y10.4097 Z-18.0000 S1000
G1 F1000 X30.7573 Y10.7569 Z-18.0000 S1000
G1 F1000 X30.4101 Y10.9889 Z-18.0000 S1000
G1 F1000 X30.0002 Y11.0704 Z-18.0000 S1000
G1 F1000 X29.5903 Y10.9889 Z-18.0000 S1000
G1 F1000 X29.2431 Y10.7569 Z-18.0000 S1000
G1 F1000 X29.0111 Y10.4097 Z-18.0000 S1000
G1 F1000 X28.9296 Y9.9998 Z-18.0000 S1000
G1 F1000 X29.0111 Y9.5899 Z-18.0000 S1000
G1 F1000 X29.2431 Y9.2427 Z-18.0000 S1000
G1 F1000 X29.5903 Y9.0107 Z-18.0000 S1000
G1 F1000 X30.0002 Y8.9292 Z-18.0000 S1000
G1 F1000 X30.4101 Y9.0107 Z-18.0000 S1000
; Starting inflateGrp: Closed?:true
G1 F300 Z-19.2000
G1 F1000 X30.7573 Y9.2427 Z-19.2000 S1000
G1 F1000 X30.9893 Y9.5899 Z-19.2000 S1000
G1 F1000 X31.0708 Y9.9998 Z-19.2000 S1000
G1 F1000 X30.9893 Y10.4097 Z-19.2000 S1000
G1 F1000 X30.7573 Y10.7569 Z-19.2000 S1000
G1 F1000 X30.4101 Y10.9889 Z-19.2000 S1000
G1 F1000 X30.0002 Y11.0704 Z-19.2000 S1000
G1 F1000 X29.5903 Y10.9889 Z-19.2000 S1000
G1 F1000 X29.2431 Y10.7569 Z-19.2000 S1000
G1 F1000 X29.0111 Y10.4097 Z-19.2000 S1000
G1 F1000 X28.9296 Y9.9998 Z-19.2000 S1000
G1 F1000 X29.0111 Y9.5899 Z-19.2000 S1000
G1 F1000 X29.2431 Y9.2427 Z-19.2000 S1000
G1 F1000 X29.5903 Y9.0107 Z-19.2000 S1000
G1 F1000 X30.0002 Y8.9292 Z-19.2000 S1000
G1 F1000 X30.4101 Y9.0107 Z-19.2000 S1000
; Starting inflateGrp: Closed?:true

G0 Z10
G0 X10.4100 Y49.0107

G0 Z0
G1 F300 Z-1.5000
G1 F1000 X10.7573 Y49.2428 Z-1.5000 S1000
G1 F1000 X10.9893 Y49.5899 Z-1.5000 S1000
G1 F1000 X11.0708 Y49.9998 Z-1.5000 S1000
G1 F1000 X10.9893 Y50.4097 Z-1.5000 S1000
G1 F1000 X10.7573 Y50.7568 Z-1.5000 S1000
G1 F1000 X10.4100 Y50.9889 Z-1.5000 S1000
G1 F1000 X10.0002 Y51.0704 Z-1.5000 S1000
G1 F1000 X9.5903 Y50.9889 Z-1.5000 S1000
G1 F1000 X9.2431 Y50.7569 Z-1.5000 S1000
G1 F1000 X9.0111 Y50.4097 Z-1.5000 S1000
G1 F1000 X8.9296 Y49.9998 Z-1.5000 S1000
G1 F1000 X9.0111 Y49.5899 Z-1.5000 S1000
G1 F1000 X9.2431 Y49.2427 Z-1.5000 S1000
G1 F1000 X9.5903 Y49.0107 Z-1.5000 S1000
G1 F1000 X10.0002 Y48.9292 Z-1.5000 S1000
G1 F1000 X10.4100 Y49.0107 Z-1.5000 S1000
; Starting inflateGrp: Closed?:true
G1 F300 Z-3.0000
G1 F1000 X10.7573 Y49.2428 Z-3.0000 S1000
G1 F1000 X10.9893 Y49.5899 Z-3.0000 S1000
G1 F1000 X11.0708 Y49.9998 Z-3.0000 S1000
G1 F1000 X10.9893 Y50.4097 Z-3.0000 S1000
G1 F1000 X10.7573 Y50.7568 Z-3.0000 S1000
G1 F1000 X10.4100 Y50.9889 Z-3.0000 S1000
G1 F1000 X10.0002 Y51.0704 Z-3.0000 S1000
G1 F1000 X9.5903 Y50.9889 Z-3.0000 S1000
G1 F1000 X9.2431 Y50.7569 Z-3.0000 S1000
G1 F1000 X9.0111 Y50.4097 Z-3.0000 S1000
G1 F1000 X8.9296 Y49.9998 Z-3.0000 S1000
G1 F1000 X9.0111 Y49.5899 Z-3.0000 S1000
G1 F1000 X9.2431 Y49.2427 Z-3.0000 S1000
G1 F1000 X9.5903 Y49.0107 Z-3.0000 S1000
G1 F1000 X10.0002 Y48.9292 Z-3.0000 S1000
G1 F1000 X10.4100 Y49.0107 Z-3.0000 S1000
; Starting inflateGrp: Closed?:true
G1 F300 Z-4.5000
G1 F1000 X10.7573 Y49.2428 Z-4.5000 S1000
G1 F1000 X10.9893 Y49.5899 Z-4.5000 S1000
G1 F1000 X11.0708 Y49.9998 Z-4.5000 S1000
G1 F1000 X10.9893 Y50.4097 Z-4.5000 S1000
G1 F1000 X10.7573 Y50.7568 Z-4.5000 S1000
G1 F1000 X10.4100 Y50.9889 Z-4.5000 S1000
G1 F1000 X10.0002 Y51.0704 Z-4.5000 S1000
G1 F1000 X9.5903 Y50.9889 Z-4.5000 S1000
G1 F1000 X9.2431 Y50.7569 Z-4.5000 S1000
G1 F1000 X9.0111 Y50.4097 Z-4.5000 S1000
G1 F1000 X8.9296 Y49.9998 Z-4.5000 S1000
G1 F1000 X9.0111 Y49.5899 Z-4.5000 S1000
G1 F1000 X9.2431 Y49.2427 Z-4.5000 S1000
G1 F1000 X9.5903 Y49.0107 Z-4.5000 S1000
G1 F1000 X10.0002 Y48.9292 Z-4.5000 S1000
G1 F1000 X10.4100 Y49.0107 Z-4.5000 S1000
; Starting inflateGrp: Closed?:true
G1 F300 Z-6.0000
G1 F1000 X10.7573 Y49.2428 Z-6.0000 S1000
G1 F1000 X10.9893 Y49.5899 Z-6.0000 S1000
G1 F1000 X11.0708 Y49.9998 Z-6.0000 S1000
G1 F1000 X10.9893 Y50.4097 Z-6.0000 S1000
G1 F1000 X10.7573 Y50.7568 Z-6.0000 S1000
G1 F1000 X10.4100 Y50.9889 Z-6.0000 S1000
G1 F1000 X10.0002 Y51.0704 Z-6.0000 S1000
G1 F1000 X9.5903 Y50.9889 Z-6.0000 S1000
G1 F1000 X9.2431 Y50.7569 Z-6.0000 S1000
G1 F1000 X9.0111 Y50.4097 Z-6.0000 S1000
G1 F1000 X8.9296 Y49.9998 Z-6.0000 S1000
G1 F1000 X9.0111 Y49.5899 Z-6.0000 S1000
G1 F1000 X9.2431 Y49.2427 Z-6.0000 S1000
G1 F1000 X9.5903 Y49.0107 Z-6.0000 S1000
G1 F1000 X10.0002 Y48.9292 Z-6.0000 S1000
G1 F1000 X10.4100 Y49.0107 Z-6.0000 S1000
; Starting inflateGrp: Closed?:true
G1 F300 Z-7.5000
G1 F1000 X10.7573 Y49.2428 Z-7.5000 S1000
G1 F1000 X10.9893 Y49.5899 Z-7.5000 S1000
G1 F1000 X11.0708 Y49.9998 Z-7.5000 S1000
G1 F1000 X10.9893 Y50.4097 Z-7.5000 S1000
G1 F1000 X10.7573 Y50.7568 Z-7.5000 S1000
G1 F1000 X10.4100 Y50.9889 Z-7.5000 S1000
G1 F1000 X10.0002 Y51.0704 Z-7.5000 S1000
G1 F1000 X9.5903 Y50.9889 Z-7.5000 S1000
G1 F1000 X9.2431 Y50.7569 Z-7.5000 S1000
G1 F1000 X9.0111 Y50.4097 Z-7.5000 S1000
G1 F1000 X8.9296 Y49.9998 Z-7.5000 S1000
G1 F1000 X9.0111 Y49.5899 Z-7.5000 S1000
G1 F1000 X9.2431 Y49.2427 Z-7.5000 S1000
G1 F1000 X9.5903 Y49.0107 Z-7.5000 S1000
G1 F1000 X10.0002 Y48.9292 Z-7.5000 S1000
G1 F1000 X10.4100 Y49.0107 Z-7.5000 S1000
; Starting inflateGrp: Closed?:true
G1 F300 Z-9.0000
G1 F1000 X10.7573 Y49.2428 Z-9.0000 S1000
G1 F1000 X10.9893 Y49.5899 Z-9.0000 S1000
G1 F1000 X11.0708 Y49.9998 Z-9.0000 S1000
G1 F1000 X10.9893 Y50.4097 Z-9.0000 S1000
G1 F1000 X10.7573 Y50.7568 Z-9.0000 S1000
G1 F1000 X10.4100 Y50.9889 Z-9.0000 S1000
G1 F1000 X10.0002 Y51.0704 Z-9.0000 S1000
G1 F1000 X9.5903 Y50.9889 Z-9.0000 S1000
G1 F1000 X9.2431 Y50.7569 Z-9.0000 S1000
G1 F1000 X9.0111 Y50.4097 Z-9.0000 S1000
G1 F1000 X8.9296 Y49.9998 Z-9.0000 S1000
G1 F1000 X9.0111 Y49.5899 Z-9.0000 S1000
G1 F1000 X9.2431 Y49.2427 Z-9.0000 S1000
G1 F1000 X9.5903 Y49.0107 Z-9.0000 S1000
G1 F1000 X10.0002 Y48.9292 Z-9.0000 S1000
G1 F1000 X10.4100 Y49.0107 Z-9.0000 S1000
; Starting inflateGrp: Closed?:true
G1 F300 Z-10.5000
G1 F1000 X10.7573 Y49.2428 Z-10.5000 S1000
G1 F1000 X10.9893 Y49.5899 Z-10.5000 S1000
G1 F1000 X11.0708 Y49.9998 Z-10.5000 S1000
G1 F1000 X10.9893 Y50.4097 Z-10.5000 S1000
G1 F1000 X10.7573 Y50.7568 Z-10.5000 S1000
G1 F1000 X10.4100 Y50.9889 Z-10.5000 S1000
G1 F1000 X10.0002 Y51.0704 Z-10.5000 S1000
G1 F1000 X9.5903 Y50.9889 Z-10.5000 S1000
G1 F1000 X9.2431 Y50.7569 Z-10.5000 S1000
G1 F1000 X9.0111 Y50.4097 Z-10.5000 S1000
G1 F1000 X8.9296 Y49.9998 Z-10.5000 S1000
G1 F1000 X9.0111 Y49.5899 Z-10.5000 S1000
G1 F1000 X9.2431 Y49.2427 Z-10.5000 S1000
G1 F1000 X9.5903 Y49.0107 Z-10.5000 S1000
G1 F1000 X10.0002 Y48.9292 Z-10.5000 S1000
G1 F1000 X10.4100 Y49.0107 Z-10.5000 S1000
; Starting inflateGrp: Closed?:true
G1 F300 Z-12.0000
G1 F1000 X10.7573 Y49.2428 Z-12.0000 S1000
G1 F1000 X10.9893 Y49.5899 Z-12.0000 S1000
G1 F1000 X11.0708 Y49.9998 Z-12.0000 S1000
G1 F1000 X10.9893 Y50.4097 Z-12.0000 S1000
G1 F1000 X10.7573 Y50.7568 Z-12.0000 S1000
G1 F1000 X10.4100 Y50.9889 Z-12.0000 S1000
G1 F1000 X10.0002 Y51.0704 Z-12.0000 S1000
G1 F1000 X9.5903 Y50.9889 Z-12.0000 S1000
G1 F1000 X9.2431 Y50.7569 Z-12.0000 S1000
G1 F1000 X9.0111 Y50.4097 Z-12.0000 S1000
G1 F1000 X8.9296 Y49.9998 Z-12.0000 S1000
G1 F1000 X9.0111 Y49.5899 Z-12.0000 S1000
G1 F1000 X9.2431 Y49.2427 Z-12.0000 S1000
G1 F1000 X9.5903 Y49.0107 Z-12.0000 S1000
G1 F1000 X10.0002 Y48.9292 Z-12.0000 S1000
G1 F1000 X10.4100 Y49.0107 Z-12.0000 S1000
; Starting inflateGrp: Closed?:true
G1 F300 Z-13.5000
G1 F1000 X10.7573 Y49.2428 Z-13.5000 S1000
G1 F1000 X10.9893 Y49.5899 Z-13.5000 S1000
G1 F1000 X11.0708 Y49.9998 Z-13.5000 S1000
G1 F1000 X10.9893 Y50.4097 Z-13.5000 S1000
G1 F1000 X10.7573 Y50.7568 Z-13.5000 S1000
G1 F1000 X10.4100 Y50.9889 Z-13.5000 S1000
G1 F1000 X10.0002 Y51.0704 Z-13.5000 S1000
G1 F1000 X9.5903 Y50.9889 Z-13.5000 S1000
G1 F1000 X9.2431 Y50.7569 Z-13.5000 S1000
G1 F1000 X9.0111 Y50.4097 Z-13.5000 S1000
G1 F1000 X8.9296 Y49.9998 Z-13.5000 S1000
G1 F1000 X9.0111 Y49.5899 Z-13.5000 S1000
G1 F1000 X9.2431 Y49.2427 Z-13.5000 S1000
G1 F1000 X9.5903 Y49.0107 Z-13.5000 S1000
G1 F1000 X10.0002 Y48.9292 Z-13.5000 S1000
G1 F1000 X10.4100 Y49.0107 Z-13.5000 S1000
; Starting inflateGrp: Closed?:true
G1 F300 Z-15.0000
G1 F1000 X10.7573 Y49.2428 Z-15.0000 S1000
G1 F1000 X10.9893 Y49.5899 Z-15.0000 S1000
G1 F1000 X11.0708 Y49.9998 Z-15.0000 S1000
G1 F1000 X10.9893 Y50.4097 Z-15.0000 S1000
G1 F1000 X10.7573 Y50.7568 Z-15.0000 S1000
G1 F1000 X10.4100 Y50.9889 Z-15.0000 S1000
G1 F1000 X10.0002 Y51.0704 Z-15.0000 S1000
G1 F1000 X9.5903 Y50.9889 Z-15.0000 S1000
G1 F1000 X9.2431 Y50.7569 Z-15.0000 S1000
G1 F1000 X9.0111 Y50.4097 Z-15.0000 S1000
G1 F1000 X8.9296 Y49.9998 Z-15.0000 S1000
G1 F1000 X9.0111 Y49.5899 Z-15.0000 S1000
G1 F1000 X9.2431 Y49.2427 Z-15.0000 S1000
G1 F1000 X9.5903 Y49.0107 Z-15.0000 S1000
G1 F1000 X10.0002 Y48.9292 Z-15.0000 S1000
G1 F1000 X10.4100 Y49.0107 Z-15.0000 S1000
; Starting inflateGrp: Closed?:true
G1 F300 Z-16.5000
G1 F1000 X10.7573 Y49.2428 Z-16.5000 S1000
G1 F1000 X10.9893 Y49.5899 Z-16.5000 S1000
G1 F1000 X11.0708 Y49.9998 Z-16.5000 S1000
G1 F1000 X10.9893 Y50.4097 Z-16.5000 S1000
G1 F1000 X10.7573 Y50.7568 Z-16.5000 S1000
G1 F1000 X10.4100 Y50.9889 Z-16.5000 S1000
G1 F1000 X10.0002 Y51.0704 Z-16.5000 S1000
G1 F1000 X9.5903 Y50.9889 Z-16.5000 S1000
G1 F1000 X9.2431 Y50.7569 Z-16.5000 S1000
G1 F1000 X9.0111 Y50.4097 Z-16.5000 S1000
G1 F1000 X8.9296 Y49.9998 Z-16.5000 S1000
G1 F1000 X9.0111 Y49.5899 Z-16.5000 S1000
G1 F1000 X9.2431 Y49.2427 Z-16.5000 S1000
G1 F1000 X9.5903 Y49.0107 Z-16.5000 S1000
G1 F1000 X10.0002 Y48.9292 Z-16.5000 S1000
G1 F1000 X10.4100 Y49.0107 Z-16.5000 S1000
; Starting inflateGrp: Closed?:true
G1 F300 Z-18.0000
G1 F1000 X10.7573 Y49.2428 Z-18.0000 S1000
G1 F1000 X10.9893 Y49.5899 Z-18.0000 S1000
G1 F1000 X11.0708 Y49.9998 Z-18.0000 S1000
G1 F1000 X10.9893 Y50.4097 Z-18.0000 S1000
G1 F1000 X10.7573 Y50.7568 Z-18.0000 S1000
G1 F1000 X10.4100 Y50.9889 Z-18.0000 S1000
G1 F1000 X10.0002 Y51.0704 Z-18.0000 S1000
G1 F1000 X9.5903 Y50.9889 Z-18.0000 S1000
G1 F1000 X9.2431 Y50.7569 Z-18.0000 S1000
G1 F1000 X9.0111 Y50.4097 Z-18.0000 S1000
G1 F1000 X8.9296 Y49.9998 Z-18.0000 S1000
G1 F1000 X9.0111 Y49.5899 Z-18.0000 S1000
G1 F1000 X9.2431 Y49.2427 Z-18.0000 S1000
G1 F1000 X9.5903 Y49.0107 Z-18.0000 S1000
G1 F1000 X10.0002 Y48.9292 Z-18.0000 S1000
G1 F1000 X10.4100 Y49.0107 Z-18.0000 S1000
; Starting inflateGrp: Closed?:true
G1 F300 Z-19.2000
G1 F1000 X10.7573 Y49.2428 Z-19.2000 S1000
G1 F1000 X10.9893 Y49.5899 Z-19.2000 S1000
G1 F1000 X11.0708 Y49.9998 Z-19.2000 S1000
G1 F1000 X10.9893 Y50.4097 Z-19.2000 S1000
G1 F1000 X10.7573 Y50.7568 Z-19.2000 S1000
G1 F1000 X10.4100 Y50.9889 Z-19.2000 S1000
G1 F1000 X10.0002 Y51.0704 Z-19.2000 S1000
G1 F1000 X9.5903 Y50.9889 Z-19.2000 S1000
G1 F1000 X9.2431 Y50.7569 Z-19.2000 S1000
G1 F1000 X9.0111 Y50.4097 Z-19.2000 S1000
G1 F1000 X8.9296 Y49.9998 Z-19.2000 S1000
G1 F1000 X9.0111 Y49.5899 Z-19.2000 S1000
G1 F1000 X9.2431 Y49.2427 Z-19.2000 S1000
G1 F1000 X9.5903 Y49.0107 Z-19.2000 S1000
G1 F1000 X10.0002 Y48.9292 Z-19.2000 S1000
G1 F1000 X10.4100 Y49.0107 Z-19.2000 S1000
; Starting inflateGrp: Closed?:true

G0 Z10
G0 X10.4100 Y89.0107

G0 Z0
G1 F300 Z-1.5000
G1 F1000 X10.7573 Y89.2428 Z-1.5000 S1000
G1 F1000 X10.9893 Y89.5899 Z-1.5000 S1000
G1 F1000 X11.0708 Y89.9998 Z-1.5000 S1000
G1 F1000 X10.9893 Y90.4096 Z-1.5000 S1000
G1 F1000 X10.7572 Y90.7568 Z-1.5000 S1000
G1 F1000 X10.4100 Y90.9889 Z-1.5000 S1000
G1 F1000 X10.0002 Y91.0704 Z-1.5000 S1000
G1 F1000 X9.5903 Y90.9889 Z-1.5000 S1000
G1 F1000 X9.2432 Y90.7569 Z-1.5000 S1000
G1 F1000 X9.0111 Y90.4096 Z-1.5000 S1000
G1 F1000 X8.9296 Y89.9998 Z-1.5000 S1000
G1 F1000 X9.0111 Y89.5899 Z-1.5000 S1000
G1 F1000 X9.2431 Y89.2427 Z-1.5000 S1000
G1 F1000 X9.5903 Y89.0107 Z-1.5000 S1000
G1 F1000 X10.0002 Y88.9292 Z-1.5000 S1000
G1 F1000 X10.4100 Y89.0107 Z-1.5000 S1000
; Starting inflateGrp: Closed?:true
G1 F300 Z-3.0000
G1 F1000 X10.7573 Y89.2428 Z-3.0000 S1000
G1 F1000 X10.9893 Y89.5899 Z-3.0000 S1000
G1 F1000 X11.0708 Y89.9998 Z-3.0000 S1000
G1 F1000 X10.9893 Y90.4096 Z-3.0000 S1000
G1 F1000 X10.7572 Y90.7568 Z-3.0000 S1000
G1 F1000 X10.4100 Y90.9889 Z-3.0000 S1000
G1 F1000 X10.0002 Y91.0704 Z-3.0000 S1000
G1 F1000 X9.5903 Y90.9889 Z-3.0000 S1000
G1 F1000 X9.2432 Y90.7569 Z-3.0000 S1000
G1 F1000 X9.0111 Y90.4096 Z-3.0000 S1000
G1 F1000 X8.9296 Y89.9998 Z-3.0000 S1000
G1 F1000 X9.0111 Y89.5899 Z-3.0000 S1000
G1 F1000 X9.2431 Y89.2427 Z-3.0000 S1000
G1 F1000 X9.5903 Y89.0107 Z-3.0000 S1000
G1 F1000 X10.0002 Y88.9292 Z-3.0000 S1000
G1 F1000 X10.4100 Y89.0107 Z-3.0000 S1000
; Starting inflateGrp: Closed?:true
G1 F300 Z-4.5000
G1 F1000 X10.7573 Y89.2428 Z-4.5000 S1000
G1 F1000 X10.9893 Y89.5899 Z-4.5000 S1000
G1 F1000 X11.0708 Y89.9998 Z-4.5000 S1000
G1 F1000 X10.9893 Y90.4096 Z-4.5000 S1000
G1 F1000 X10.7572 Y90.7568 Z-4.5000 S1000
G1 F1000 X10.4100 Y90.9889 Z-4.5000 S1000
G1 F1000 X10.0002 Y91.0704 Z-4.5000 S1000
G1 F1000 X9.5903 Y90.9889 Z-4.5000 S1000
G1 F1000 X9.2432 Y90.7569 Z-4.5000 S1000
G1 F1000 X9.0111 Y90.4096 Z-4.5000 S1000
G1 F1000 X8.9296 Y89.9998 Z-4.5000 S1000
G1 F1000 X9.0111 Y89.5899 Z-4.5000 S1000
G1 F1000 X9.2431 Y89.2427 Z-4.5000 S1000
G1 F1000 X9.5903 Y89.0107 Z-4.5000 S1000
G1 F1000 X10.0002 Y88.9292 Z-4.5000 S1000
G1 F1000 X10.4100 Y89.0107 Z-4.5000 S1000
; Starting inflateGrp: Closed?:true
G1 F300 Z-6.0000
G1 F1000 X10.7573 Y89.2428 Z-6.0000 S1000
G1 F1000 X10.9893 Y89.5899 Z-6.0000 S1000
G1 F1000 X11.0708 Y89.9998 Z-6.0000 S1000
G1 F1000 X10.9893 Y90.4096 Z-6.0000 S1000
G1 F1000 X10.7572 Y90.7568 Z-6.0000 S1000
G1 F1000 X10.4100 Y90.9889 Z-6.0000 S1000
G1 F1000 X10.0002 Y91.0704 Z-6.0000 S1000
G1 F1000 X9.5903 Y90.9889 Z-6.0000 S1000
G1 F1000 X9.2432 Y90.7569 Z-6.0000 S1000
G1 F1000 X9.0111 Y90.4096 Z-6.0000 S1000
G1 F1000 X8.9296 Y89.9998 Z-6.0000 S1000
G1 F1000 X9.0111 Y89.5899 Z-6.0000 S1000
G1 F1000 X9.2431 Y89.2427 Z-6.0000 S1000
G1 F1000 X9.5903 Y89.0107 Z-6.0000 S1000
G1 F1000 X10.0002 Y88.9292 Z-6.0000 S1000
G1 F1000 X10.4100 Y89.0107 Z-6.0000 S1000
; Starting inflateGrp: Closed?:true
G1 F300 Z-7.5000
G1 F1000 X10.7573 Y89.2428 Z-7.5000 S1000
G1 F1000 X10.9893 Y89.5899 Z-7.5000 S1000
G1 F1000 X11.0708 Y89.9998 Z-7.5000 S1000
G1 F1000 X10.9893 Y90.4096 Z-7.5000 S1000
G1 F1000 X10.7572 Y90.7568 Z-7.5000 S1000
G1 F1000 X10.4100 Y90.9889 Z-7.5000 S1000
G1 F1000 X10.0002 Y91.0704 Z-7.5000 S1000
G1 F1000 X9.5903 Y90.9889 Z-7.5000 S1000
G1 F1000 X9.2432 Y90.7569 Z-7.5000 S1000
G1 F1000 X9.0111 Y90.4096 Z-7.5000 S1000
G1 F1000 X8.9296 Y89.9998 Z-7.5000 S1000
G1 F1000 X9.0111 Y89.5899 Z-7.5000 S1000
G1 F1000 X9.2431 Y89.2427 Z-7.5000 S1000
G1 F1000 X9.5903 Y89.0107 Z-7.5000 S1000
G1 F1000 X10.0002 Y88.9292 Z-7.5000 S1000
G1 F1000 X10.4100 Y89.0107 Z-7.5000 S1000
; Starting inflateGrp: Closed?:true
G1 F300 Z-9.0000
G1 F1000 X10.7573 Y89.2428 Z-9.0000 S1000
G1 F1000 X10.9893 Y89.5899 Z-9.0000 S1000
G1 F1000 X11.0708 Y89.9998 Z-9.0000 S1000
G1 F1000 X10.9893 Y90.4096 Z-9.0000 S1000
G1 F1000 X10.7572 Y90.7568 Z-9.0000 S1000
G1 F1000 X10.4100 Y90.9889 Z-9.0000 S1000
G1 F1000 X10.0002 Y91.0704 Z-9.0000 S1000
G1 F1000 X9.5903 Y90.9889 Z-9.0000 S1000
G1 F1000 X9.2432 Y90.7569 Z-9.0000 S1000
G1 F1000 X9.0111 Y90.4096 Z-9.0000 S1000
G1 F1000 X8.9296 Y89.9998 Z-9.0000 S1000
G1 F1000 X9.0111 Y89.5899 Z-9.0000 S1000
G1 F1000 X9.2431 Y89.2427 Z-9.0000 S1000
G1 F1000 X9.5903 Y89.0107 Z-9.0000 S1000
G1 F1000 X10.0002 Y88.9292 Z-9.0000 S1000
G1 F1000 X10.4100 Y89.0107 Z-9.0000 S1000
; Starting inflateGrp: Closed?:true
G1 F300 Z-10.5000
G1 F1000 X10.7573 Y89.2428 Z-10.5000 S1000
G1 F1000 X10.9893 Y89.5899 Z-10.5000 S1000
G1 F1000 X11.0708 Y89.9998 Z-10.5000 S1000
G1 F1000 X10.9893 Y90.4096 Z-10.5000 S1000
G1 F1000 X10.7572 Y90.7568 Z-10.5000 S1000
G1 F1000 X10.4100 Y90.9889 Z-10.5000 S1000
G1 F1000 X10.0002 Y91.0704 Z-10.5000 S1000
G1 F1000 X9.5903 Y90.9889 Z-10.5000 S1000
G1 F1000 X9.2432 Y90.7569 Z-10.5000 S1000
G1 F1000 X9.0111 Y90.4096 Z-10.5000 S1000
G1 F1000 X8.9296 Y89.9998 Z-10.5000 S1000
G1 F1000 X9.0111 Y89.5899 Z-10.5000 S1000
G1 F1000 X9.2431 Y89.2427 Z-10.5000 S1000
G1 F1000 X9.5903 Y89.0107 Z-10.5000 S1000
G1 F1000 X10.0002 Y88.9292 Z-10.5000 S1000
G1 F1000 X10.4100 Y89.0107 Z-10.5000 S1000
; Starting inflateGrp: Closed?:true
G1 F300 Z-12.0000
G1 F1000 X10.7573 Y89.2428 Z-12.0000 S1000
G1 F1000 X10.9893 Y89.5899 Z-12.0000 S1000
G1 F1000 X11.0708 Y89.9998 Z-12.0000 S1000
G1 F1000 X10.9893 Y90.4096 Z-12.0000 S1000
G1 F1000 X10.7572 Y90.7568 Z-12.0000 S1000
G1 F1000 X10.4100 Y90.9889 Z-12.0000 S1000
G1 F1000 X10.0002 Y91.0704 Z-12.0000 S1000
G1 F1000 X9.5903 Y90.9889 Z-12.0000 S1000
G1 F1000 X9.2432 Y90.7569 Z-12.0000 S1000
G1 F1000 X9.0111 Y90.4096 Z-12.0000 S1000
G1 F1000 X8.9296 Y89.9998 Z-12.0000 S1000
G1 F1000 X9.0111 Y89.5899 Z-12.0000 S1000
G1 F1000 X9.2431 Y89.2427 Z-12.0000 S1000
G1 F1000 X9.5903 Y89.0107 Z-12.0000 S1000
G1 F1000 X10.0002 Y88.9292 Z-12.0000 S1000
G1 F1000 X10.4100 Y89.0107 Z-12.0000 S1000
; Starting inflateGrp: Closed?:true
G1 F300 Z-13.5000
G1 F1000 X10.7573 Y89.2428 Z-13.5000 S1000
G1 F1000 X10.9893 Y89.5899 Z-13.5000 S1000
G1 F1000 X11.0708 Y89.9998 Z-13.5000 S1000
G1 F1000 X10.9893 Y90.4096 Z-13.5000 S1000
G1 F1000 X10.7572 Y90.7568 Z-13.5000 S1000
G1 F1000 X10.4100 Y90.9889 Z-13.5000 S1000
G1 F1000 X10.0002 Y91.0704 Z-13.5000 S1000
G1 F1000 X9.5903 Y90.9889 Z-13.5000 S1000
G1 F1000 X9.2432 Y90.7569 Z-13.5000 S1000
G1 F1000 X9.0111 Y90.4096 Z-13.5000 S1000
G1 F1000 X8.9296 Y89.9998 Z-13.5000 S1000
G1 F1000 X9.0111 Y89.5899 Z-13.5000 S1000
G1 F1000 X9.2431 Y89.2427 Z-13.5000 S1000
G1 F1000 X9.5903 Y89.0107 Z-13.5000 S1000
G1 F1000 X10.0002 Y88.9292 Z-13.5000 S1000
G1 F1000 X10.4100 Y89.0107 Z-13.5000 S1000
; Starting inflateGrp: Closed?:true
G1 F300 Z-15.0000
G1 F1000 X10.7573 Y89.2428 Z-15.0000 S1000
G1 F1000 X10.9893 Y89.5899 Z-15.0000 S1000
G1 F1000 X11.0708 Y89.9998 Z-15.0000 S1000
G1 F1000 X10.9893 Y90.4096 Z-15.0000 S1000
G1 F1000 X10.7572 Y90.7568 Z-15.0000 S1000
G1 F1000 X10.4100 Y90.9889 Z-15.0000 S1000
G1 F1000 X10.0002 Y91.0704 Z-15.0000 S1000
G1 F1000 X9.5903 Y90.9889 Z-15.0000 S1000
G1 F1000 X9.2432 Y90.7569 Z-15.0000 S1000
G1 F1000 X9.0111 Y90.4096 Z-15.0000 S1000
G1 F1000 X8.9296 Y89.9998 Z-15.0000 S1000
G1 F1000 X9.0111 Y89.5899 Z-15.0000 S1000
G1 F1000 X9.2431 Y89.2427 Z-15.0000 S1000
G1 F1000 X9.5903 Y89.0107 Z-15.0000 S1000
G1 F1000 X10.0002 Y88.9292 Z-15.0000 S1000
G1 F1000 X10.4100 Y89.0107 Z-15.0000 S1000
; Starting inflateGrp: Closed?:true
G1 F300 Z-16.5000
G1 F1000 X10.7573 Y89.2428 Z-16.5000 S1000
G1 F1000 X10.9893 Y89.5899 Z-16.5000 S1000
G1 F1000 X11.0708 Y89.9998 Z-16.5000 S1000
G1 F1000 X10.9893 Y90.4096 Z-16.5000 S1000
G1 F1000 X10.7572 Y90.7568 Z-16.5000 S1000
G1 F1000 X10.4100 Y90.9889 Z-16.5000 S1000
G1 F1000 X10.0002 Y91.0704 Z-16.5000 S1000
G1 F1000 X9.5903 Y90.9889 Z-16.5000 S1000
G1 F1000 X9.2432 Y90.7569 Z-16.5000 S1000
G1 F1000 X9.0111 Y90.4096 Z-16.5000 S1000
G1 F1000 X8.9296 Y89.9998 Z-16.5000 S1000
G1 F1000 X9.0111 Y89.5899 Z-16.5000 S1000
G1 F1000 X9.2431 Y89.2427 Z-16.5000 S1000
G1 F1000 X9.5903 Y89.0107 Z-16.5000 S1000
G1 F1000 X10.0002 Y88.9292 Z-16.5000 S1000
G1 F1000 X10.4100 Y89.0107 Z-16.5000 S1000
; Starting inflateGrp: Closed?:true
G1 F300 Z-18.0000
G1 F1000 X10.7573 Y89.2428 Z-18.0000 S1000
G1 F1000 X10.9893 Y89.5899 Z-18.0000 S1000
G1 F1000 X11.0708 Y89.9998 Z-18.0000 S1000
G1 F1000 X10.9893 Y90.4096 Z-18.0000 S1000
G1 F1000 X10.7572 Y90.7568 Z-18.0000 S1000
G1 F1000 X10.4100 Y90.9889 Z-18.0000 S1000
G1 F1000 X10.0002 Y91.0704 Z-18.0000 S1000
G1 F1000 X9.5903 Y90.9889 Z-18.0000 S1000
G1 F1000 X9.2432 Y90.7569 Z-18.0000 S1000
G1 F1000 X9.0111 Y90.4096 Z-18.0000 S1000
G1 F1000 X8.9296 Y89.9998 Z-18.0000 S1000
G1 F1000 X9.0111 Y89.5899 Z-18.0000 S1000
G1 F1000 X9.2431 Y89.2427 Z-18.0000 S1000
G1 F1000 X9.5903 Y89.0107 Z-18.0000 S1000
G1 F1000 X10.0002 Y88.9292 Z-18.0000 S1000
G1 F1000 X10.4100 Y89.0107 Z-18.0000 S1000
; Starting inflateGrp: Closed?:true
G1 F300 Z-19.2000
G1 F1000 X10.7573 Y89.2428 Z-19.2000 S1000
G1 F1000 X10.9893 Y89.5899 Z-19.2000 S1000
G1 F1000 X11.0708 Y89.9998 Z-19.2000 S1000
G1 F1000 X10.9893 Y90.4096 Z-19.2000 S1000
G1 F1000 X10.7572 Y90.7568 Z-19.2000 S1000
G1 F1000 X10.4100 Y90.9889 Z-19.2000 S1000
G1 F1000 X10.0002 Y91.0704 Z-19.2000 S1000
G1 F1000 X9.5903 Y90.9889 Z-19.2000 S1000
G1 F1000 X9.2432 Y90.7569 Z-19.2000 S1000
G1 F1000 X9.0111 Y90.4096 Z-19.2000 S1000
G1 F1000 X8.9296 Y89.9998 Z-19.2000 S1000
G1 F1000 X9.0111 Y89.5899 Z-19.2000 S1000
G1 F1000 X9.2431 Y89.2427 Z-19.2000 S1000
G1 F1000 X9.5903 Y89.0107 Z-19.2000 S1000
G1 F1000 X10.0002 Y88.9292 Z-19.2000 S1000
G1 F1000 X10.4100 Y89.0107 Z-19.2000 S1000
; Starting inflateGrp: Closed?:true

G0 Z10
G0 X110.4101 Y9.0107

G0 Z0
G1 F300 Z-1.5000
G1 F1000 X110.7573 Y9.2427 Z-1.5000 S1000
G1 F1000 X110.9893 Y9.5899 Z-1.5000 S1000
G1 F1000 X111.0708 Y9.9998 Z-1.5000 S1000
G1 F1000 X110.9893 Y10.4097 Z-1.5000 S1000
G1 F1000 X110.7573 Y10.7569 Z-1.5000 S1000
G1 F1000 X110.4101 Y10.9889 Z-1.5000 S1000
G1 F1000 X110.0002 Y11.0704 Z-1.5000 S1000
G1 F1000 X109.5903 Y10.9889 Z-1.5000 S1000
G1 F1000 X109.2431 Y10.7569 Z-1.5000 S1000
G1 F1000 X109.0111 Y10.4097 Z-1.5000 S1000
G1 F1000 X108.9296 Y9.9998 Z-1.5000 S1000
G1 F1000 X109.0111 Y9.5899 Z-1.5000 S1000
G1 F1000 X109.2431 Y9.2427 Z-1.5000 S1000
G1 F1000 X109.5903 Y9.0107 Z-1.5000 S1000
G1 F1000 X110.0002 Y8.9292 Z-1.5000 S1000
G1 F1000 X110.4101 Y9.0107 Z-1.5000 S1000
; Starting inflateGrp: Closed?:true
G1 F300 Z-3.0000
G1 F1000 X110.7573 Y9.2427 Z-3.0000 S1000
G1 F1000 X110.9893 Y9.5899 Z-3.0000 S1000
G1 F1000 X111.0708 Y9.9998 Z-3.0000 S1000
G1 F1000 X110.9893 Y10.4097 Z-3.0000 S1000
G1 F1000 X110.7573 Y10.7569 Z-3.0000 S1000
G1 F1000 X110.4101 Y10.9889 Z-3.0000 S1000
G1 F1000 X110.0002 Y11.0704 Z-3.0000 S1000
G1 F1000 X109.5903 Y10.9889 Z-3.0000 S1000
G1 F1000 X109.2431 Y10.7569 Z-3.0000 S1000
G1 F1000 X109.0111 Y10.4097 Z-3.0000 S1000
G1 F1000 X108.9296 Y9.9998 Z-3.0000 S1000
G1 F1000 X109.0111 Y9.5899 Z-3.0000 S1000
G1 F1000 X109.2431 Y9.2427 Z-3.0000 S1000
G1 F1000 X109.5903 Y9.0107 Z-3.0000 S1000
G1 F1000 X110.0002 Y8.9292 Z-3.0000 S1000
G1 F1000 X110.4101 Y9.0107 Z-3.0000 S1000
; Starting inflateGrp: Closed?:true
G1 F300 Z-4.5000
G1 F1000 X110.7573 Y9.2427 Z-4.5000 S1000
G1 F1000 X110.9893 Y9.5899 Z-4.5000 S1000
G1 F1000 X111.0708 Y9.9998 Z-4.5000 S1000
G1 F1000 X110.9893 Y10.4097 Z-4.5000 S1000
G1 F1000 X110.7573 Y10.7569 Z-4.5000 S1000
G1 F1000 X110.4101 Y10.9889 Z-4.5000 S1000
G1 F1000 X110.0002 Y11.0704 Z-4.5000 S1000
G1 F1000 X109.5903 Y10.9889 Z-4.5000 S1000
G1 F1000 X109.2431 Y10.7569 Z-4.5000 S1000
G1 F1000 X109.0111 Y10.4097 Z-4.5000 S1000
G1 F1000 X108.9296 Y9.9998 Z-4.5000 S1000
G1 F1000 X109.0111 Y9.5899 Z-4.5000 S1000
G1 F1000 X109.2431 Y9.2427 Z-4.5000 S1000
G1 F1000 X109.5903 Y9.0107 Z-4.5000 S1000
G1 F1000 X110.0002 Y8.9292 Z-4.5000 S1000
G1 F1000 X110.4101 Y9.0107 Z-4.5000 S1000
; Starting inflateGrp: Closed?:true
G1 F300 Z-6.0000
G1 F1000 X110.7573 Y9.2427 Z-6.0000 S1000
G1 F1000 X110.9893 Y9.5899 Z-6.0000 S1000
G1 F1000 X111.0708 Y9.9998 Z-6.0000 S1000
G1 F1000 X110.9893 Y10.4097 Z-6.0000 S1000
G1 F1000 X110.7573 Y10.7569 Z-6.0000 S1000
G1 F1000 X110.4101 Y10.9889 Z-6.0000 S1000
G1 F1000 X110.0002 Y11.0704 Z-6.0000 S1000
G1 F1000 X109.5903 Y10.9889 Z-6.0000 S1000
G1 F1000 X109.2431 Y10.7569 Z-6.0000 S1000
G1 F1000 X109.0111 Y10.4097 Z-6.0000 S1000
G1 F1000 X108.9296 Y9.9998 Z-6.0000 S1000
G1 F1000 X109.0111 Y9.5899 Z-6.0000 S1000
G1 F1000 X109.2431 Y9.2427 Z-6.0000 S1000
G1 F1000 X109.5903 Y9.0107 Z-6.0000 S1000
G1 F1000 X110.0002 Y8.9292 Z-6.0000 S1000
G1 F1000 X110.4101 Y9.0107 Z-6.0000 S1000
; Starting inflateGrp: Closed?:true
G1 F300 Z-7.5000
G1 F1000 X110.7573 Y9.2427 Z-7.5000 S1000
G1 F1000 X110.9893 Y9.5899 Z-7.5000 S1000
G1 F1000 X111.0708 Y9.9998 Z-7.5000 S1000
G1 F1000 X110.9893 Y10.4097 Z-7.5000 S1000
G1 F1000 X110.7573 Y10.7569 Z-7.5000 S1000
G1 F1000 X110.4101 Y10.9889 Z-7.5000 S1000
G1 F1000 X110.0002 Y11.0704 Z-7.5000 S1000
G1 F1000 X109.5903 Y10.9889 Z-7.5000 S1000
G1 F1000 X109.2431 Y10.7569 Z-7.5000 S1000
G1 F1000 X109.0111 Y10.4097 Z-7.5000 S1000
G1 F1000 X108.9296 Y9.9998 Z-7.5000 S1000
G1 F1000 X109.0111 Y9.5899 Z-7.5000 S1000
G1 F1000 X109.2431 Y9.2427 Z-7.5000 S1000
G1 F1000 X109.5903 Y9.0107 Z-7.5000 S1000
G1 F1000 X110.0002 Y8.9292 Z-7.5000 S1000
G1 F1000 X110.4101 Y9.0107 Z-7.5000 S1000
; Starting inflateGrp: Closed?:true
G1 F300 Z-9.0000
G1 F1000 X110.7573 Y9.2427 Z-9.0000 S1000
G1 F1000 X110.9893 Y9.5899 Z-9.0000 S1000
G1 F1000 X111.0708 Y9.9998 Z-9.0000 S1000
G1 F1000 X110.9893 Y10.4097 Z-9.0000 S1000
G1 F1000 X110.7573 Y10.7569 Z-9.0000 S1000
G1 F1000 X110.4101 Y10.9889 Z-9.0000 S1000
G1 F1000 X110.0002 Y11.0704 Z-9.0000 S1000
G1 F1000 X109.5903 Y10.9889 Z-9.0000 S1000
G1 F1000 X109.2431 Y10.7569 Z-9.0000 S1000
G1 F1000 X109.0111 Y10.4097 Z-9.0000 S1000
G1 F1000 X108.9296 Y9.9998 Z-9.0000 S1000
G1 F1000 X109.0111 Y9.5899 Z-9.0000 S1000
G1 F1000 X109.2431 Y9.2427 Z-9.0000 S1000
G1 F1000 X109.5903 Y9.0107 Z-9.0000 S1000
G1 F1000 X110.0002 Y8.9292 Z-9.0000 S1000
G1 F1000 X110.4101 Y9.0107 Z-9.0000 S1000
; Starting inflateGrp: Closed?:true
G1 F300 Z-10.5000
G1 F1000 X110.7573 Y9.2427 Z-10.5000 S1000
G1 F1000 X110.9893 Y9.5899 Z-10.5000 S1000
G1 F1000 X111.0708 Y9.9998 Z-10.5000 S1000
G1 F1000 X110.9893 Y10.4097 Z-10.5000 S1000
G1 F1000 X110.7573 Y10.7569 Z-10.5000 S1000
G1 F1000 X110.4101 Y10.9889 Z-10.5000 S1000
G1 F1000 X110.0002 Y11.0704 Z-10.5000 S1000
G1 F1000 X109.5903 Y10.9889 Z-10.5000 S1000
G1 F1000 X109.2431 Y10.7569 Z-10.5000 S1000
G1 F1000 X109.0111 Y10.4097 Z-10.5000 S1000
G1 F1000 X108.9296 Y9.9998 Z-10.5000 S1000
G1 F1000 X109.0111 Y9.5899 Z-10.5000 S1000
G1 F1000 X109.2431 Y9.2427 Z-10.5000 S1000
G1 F1000 X109.5903 Y9.0107 Z-10.5000 S1000
G1 F1000 X110.0002 Y8.9292 Z-10.5000 S1000
G1 F1000 X110.4101 Y9.0107 Z-10.5000 S1000
; Starting inflateGrp: Closed?:true
G1 F300 Z-12.0000
G1 F1000 X110.7573 Y9.2427 Z-12.0000 S1000
G1 F1000 X110.9893 Y9.5899 Z-12.0000 S1000
G1 F1000 X111.0708 Y9.9998 Z-12.0000 S1000
G1 F1000 X110.9893 Y10.4097 Z-12.0000 S1000
G1 F1000 X110.7573 Y10.7569 Z-12.0000 S1000
G1 F1000 X110.4101 Y10.9889 Z-12.0000 S1000
G1 F1000 X110.0002 Y11.0704 Z-12.0000 S1000
G1 F1000 X109.5903 Y10.9889 Z-12.0000 S1000
G1 F1000 X109.2431 Y10.7569 Z-12.0000 S1000
G1 F1000 X109.0111 Y10.4097 Z-12.0000 S1000
G1 F1000 X108.9296 Y9.9998 Z-12.0000 S1000
G1 F1000 X109.0111 Y9.5899 Z-12.0000 S1000
G1 F1000 X109.2431 Y9.2427 Z-12.0000 S1000
G1 F1000 X109.5903 Y9.0107 Z-12.0000 S1000
G1 F1000 X110.0002 Y8.9292 Z-12.0000 S1000
G1 F1000 X110.4101 Y9.0107 Z-12.0000 S1000
; Starting inflateGrp: Closed?:true
G1 F300 Z-13.5000
G1 F1000 X110.7573 Y9.2427 Z-13.5000 S1000
G1 F1000 X110.9893 Y9.5899 Z-13.5000 S1000
G1 F1000 X111.0708 Y9.9998 Z-13.5000 S1000
G1 F1000 X110.9893 Y10.4097 Z-13.5000 S1000
G1 F1000 X110.7573 Y10.7569 Z-13.5000 S1000
G1 F1000 X110.4101 Y10.9889 Z-13.5000 S1000
G1 F1000 X110.0002 Y11.0704 Z-13.5000 S1000
G1 F1000 X109.5903 Y10.9889 Z-13.5000 S1000
G1 F1000 X109.2431 Y10.7569 Z-13.5000 S1000
G1 F1000 X109.0111 Y10.4097 Z-13.5000 S1000
G1 F1000 X108.9296 Y9.9998 Z-13.5000 S1000
G1 F1000 X109.0111 Y9.5899 Z-13.5000 S1000
G1 F1000 X109.2431 Y9.2427 Z-13.5000 S1000
G1 F1000 X109.5903 Y9.0107 Z-13.5000 S1000
G1 F1000 X110.0002 Y8.9292 Z-13.5000 S1000
G1 F1000 X110.4101 Y9.0107 Z-13.5000 S1000
; Starting inflateGrp: Closed?:true
G1 F300 Z-15.0000
G1 F1000 X110.7573 Y9.2427 Z-15.0000 S1000
G1 F1000 X110.9893 Y9.5899 Z-15.0000 S1000
G1 F1000 X111.0708 Y9.9998 Z-15.0000 S1000
G1 F1000 X110.9893 Y10.4097 Z-15.0000 S1000
G1 F1000 X110.7573 Y10.7569 Z-15.0000 S1000
G1 F1000 X110.4101 Y10.9889 Z-15.0000 S1000
G1 F1000 X110.0002 Y11.0704 Z-15.0000 S1000
G1 F1000 X109.5903 Y10.9889 Z-15.0000 S1000
G1 F1000 X109.2431 Y10.7569 Z-15.0000 S1000
G1 F1000 X109.0111 Y10.4097 Z-15.0000 S1000
G1 F1000 X108.9296 Y9.9998 Z-15.0000 S1000
G1 F1000 X109.0111 Y9.5899 Z-15.0000 S1000
G1 F1000 X109.2431 Y9.2427 Z-15.0000 S1000
G1 F1000 X109.5903 Y9.0107 Z-15.0000 S1000
G1 F1000 X110.0002 Y8.9292 Z-15.0000 S1000
G1 F1000 X110.4101 Y9.0107 Z-15.0000 S1000
; Starting inflateGrp: Closed?:true
G1 F300 Z-16.5000
G1 F1000 X110.7573 Y9.2427 Z-16.5000 S1000
G1 F1000 X110.9893 Y9.5899 Z-16.5000 S1000
G1 F1000 X111.0708 Y9.9998 Z-16.5000 S1000
G1 F1000 X110.9893 Y10.4097 Z-16.5000 S1000
G1 F1000 X110.7573 Y10.7569 Z-16.5000 S1000
G1 F1000 X110.4101 Y10.9889 Z-16.5000 S1000
G1 F1000 X110.0002 Y11.0704 Z-16.5000 S1000
G1 F1000 X109.5903 Y10.9889 Z-16.5000 S1000
G1 F1000 X109.2431 Y10.7569 Z-16.5000 S1000
G1 F1000 X109.0111 Y10.4097 Z-16.5000 S1000
G1 F1000 X108.9296 Y9.9998 Z-16.5000 S1000
G1 F1000 X109.0111 Y9.5899 Z-16.5000 S1000
G1 F1000 X109.2431 Y9.2427 Z-16.5000 S1000
G1 F1000 X109.5903 Y9.0107 Z-16.5000 S1000
G1 F1000 X110.0002 Y8.9292 Z-16.5000 S1000
G1 F1000 X110.4101 Y9.0107 Z-16.5000 S1000
; Starting inflateGrp: Closed?:true
G1 F300 Z-18.0000
G1 F1000 X110.7573 Y9.2427 Z-18.0000 S1000
G1 F1000 X110.9893 Y9.5899 Z-18.0000 S1000
G1 F1000 X111.0708 Y9.9998 Z-18.0000 S1000
G1 F1000 X110.9893 Y10.4097 Z-18.0000 S1000
G1 F1000 X110.7573 Y10.7569 Z-18.0000 S1000
G1 F1000 X110.4101 Y10.9889 Z-18.0000 S1000
G1 F1000 X110.0002 Y11.0704 Z-18.0000 S1000
G1 F1000 X109.5903 Y10.9889 Z-18.0000 S1000
G1 F1000 X109.2431 Y10.7569 Z-18.0000 S1000
G1 F1000 X109.0111 Y10.4097 Z-18.0000 S1000
G1 F1000 X108.9296 Y9.9998 Z-18.0000 S1000
G1 F1000 X109.0111 Y9.5899 Z-18.0000 S1000
G1 F1000 X109.2431 Y9.2427 Z-18.0000 S1000
G1 F1000 X109.5903 Y9.0107 Z-18.0000 S1000
G1 F1000 X110.0002 Y8.9292 Z-18.0000 S1000
G1 F1000 X110.4101 Y9.0107 Z-18.0000 S1000
; Starting inflateGrp: Closed?:true
G1 F300 Z-19.2000
G1 F1000 X110.7573 Y9.2427 Z-19.2000 S1000
G1 F1000 X110.9893 Y9.5899 Z-19.2000 S1000
G1 F1000 X111.0708 Y9.9998 Z-19.2000 S1000
G1 F1000 X110.9893 Y10.4097 Z-19.2000 S1000
G1 F1000 X110.7573 Y10.7569 Z-19.2000 S1000
G1 F1000 X110.4101 Y10.9889 Z-19.2000 S1000
G1 F1000 X110.0002 Y11.0704 Z-19.2000 S1000
G1 F1000 X109.5903 Y10.9889 Z-19.2000 S1000
G1 F1000 X109.2431 Y10.7569 Z-19.2000 S1000
G1 F1000 X109.0111 Y10.4097 Z-19.2000 S1000
G1 F1000 X108.9296 Y9.9998 Z-19.2000 S1000
G1 F1000 X109.0111 Y9.5899 Z-19.2000 S1000
G1 F1000 X109.2431 Y9.2427 Z-19.2000 S1000
G1 F1000 X109.5903 Y9.0107 Z-19.2000 S1000
G1 F1000 X110.0002 Y8.9292 Z-19.2000 S1000
G1 F1000 X110.4101 Y9.0107 Z-19.2000 S1000
; Starting inflateGrp: Closed?:true

G0 Z10
G0 X30.4101 Y129.0107

G0 Z0
G1 F300 Z-1.5000
G1 F1000 X30.7573 Y129.2427 Z-1.5000 S1000
G1 F1000 X30.9893 Y129.5899 Z-1.5000 S1000
G1 F1000 X31.0708 Y129.9998 Z-1.5000 S1000
G1 F1000 X30.9893 Y130.4097 Z-1.5000 S1000
G1 F1000 X30.7573 Y130.7569 Z-1.5000 S1000
G1 F1000 X30.4101 Y130.9889 Z-1.5000 S1000
G1 F1000 X30.0002 Y131.0704 Z-1.5000 S1000
G1 F1000 X29.5903 Y130.9889 Z-1.5000 S1000
G1 F1000 X29.2431 Y130.7569 Z-1.5000 S1000
G1 F1000 X29.0111 Y130.4097 Z-1.5000 S1000
G1 F1000 X28.9296 Y129.9998 Z-1.5000 S1000
G1 F1000 X29.0111 Y129.5899 Z-1.5000 S1000
G1 F1000 X29.2431 Y129.2427 Z-1.5000 S1000
G1 F1000 X29.5903 Y129.0107 Z-1.5000 S1000
G1 F1000 X30.0002 Y128.9292 Z-1.5000 S1000
G1 F1000 X30.4101 Y129.0107 Z-1.5000 S1000
; Starting inflateGrp: Closed?:true
G1 F300 Z-3.0000
G1 F1000 X30.7573 Y129.2427 Z-3.0000 S1000
G1 F1000 X30.9893 Y129.5899 Z-3.0000 S1000
G1 F1000 X31.0708 Y129.9998 Z-3.0000 S1000
G1 F1000 X30.9893 Y130.4097 Z-3.0000 S1000
G1 F1000 X30.7573 Y130.7569 Z-3.0000 S1000
G1 F1000 X30.4101 Y130.9889 Z-3.0000 S1000
G1 F1000 X30.0002 Y131.0704 Z-3.0000 S1000
G1 F1000 X29.5903 Y130.9889 Z-3.0000 S1000
G1 F1000 X29.2431 Y130.7569 Z-3.0000 S1000
G1 F1000 X29.0111 Y130.4097 Z-3.0000 S1000
G1 F1000 X28.9296 Y129.9998 Z-3.0000 S1000
G1 F1000 X29.0111 Y129.5899 Z-3.0000 S1000
G1 F1000 X29.2431 Y129.2427 Z-3.0000 S1000
G1 F1000 X29.5903 Y129.0107 Z-3.0000 S1000
G1 F1000 X30.0002 Y128.9292 Z-3.0000 S1000
G1 F1000 X30.4101 Y129.0107 Z-3.0000 S1000
; Starting inflateGrp: Closed?:true
G1 F300 Z-4.5000
G1 F1000 X30.7573 Y129.2427 Z-4.5000 S1000
G1 F1000 X30.9893 Y129.5899 Z-4.5000 S1000
G1 F1000 X31.0708 Y129.9998 Z-4.5000 S1000
G1 F1000 X30.9893 Y130.4097 Z-4.5000 S1000
G1 F1000 X30.7573 Y130.7569 Z-4.5000 S1000
G1 F1000 X30.4101 Y130.9889 Z-4.5000 S1000
G1 F1000 X30.0002 Y131.0704 Z-4.5000 S1000
G1 F1000 X29.5903 Y130.9889 Z-4.5000 S1000
G1 F1000 X29.2431 Y130.7569 Z-4.5000 S1000
G1 F1000 X29.0111 Y130.4097 Z-4.5000 S1000
G1 F1000 X28.9296 Y129.9998 Z-4.5000 S1000
G1 F1000 X29.0111 Y129.5899 Z-4.5000 S1000
G1 F1000 X29.2431 Y129.2427 Z-4.5000 S1000
G1 F1000 X29.5903 Y129.0107 Z-4.5000 S1000
G1 F1000 X30.0002 Y128.9292 Z-4.5000 S1000
G1 F1000 X30.4101 Y129.0107 Z-4.5000 S1000
; Starting inflateGrp: Closed?:true
G1 F300 Z-6.0000
G1 F1000 X30.7573 Y129.2427 Z-6.0000 S1000
G1 F1000 X30.9893 Y129.5899 Z-6.0000 S1000
G1 F1000 X31.0708 Y129.9998 Z-6.0000 S1000
G1 F1000 X30.9893 Y130.4097 Z-6.0000 S1000
G1 F1000 X30.7573 Y130.7569 Z-6.0000 S1000
G1 F1000 X30.4101 Y130.9889 Z-6.0000 S1000
G1 F1000 X30.0002 Y131.0704 Z-6.0000 S1000
G1 F1000 X29.5903 Y130.9889 Z-6.0000 S1000
G1 F1000 X29.2431 Y130.7569 Z-6.0000 S1000
G1 F1000 X29.0111 Y130.4097 Z-6.0000 S1000
G1 F1000 X28.9296 Y129.9998 Z-6.0000 S1000
G1 F1000 X29.0111 Y129.5899 Z-6.0000 S1000
G1 F1000 X29.2431 Y129.2427 Z-6.0000 S1000
G1 F1000 X29.5903 Y129.0107 Z-6.0000 S1000
G1 F1000 X30.0002 Y128.9292 Z-6.0000 S1000
G1 F1000 X30.4101 Y129.0107 Z-6.0000 S1000
; Starting inflateGrp: Closed?:true
G1 F300 Z-7.5000
G1 F1000 X30.7573 Y129.2427 Z-7.5000 S1000
G1 F1000 X30.9893 Y129.5899 Z-7.5000 S1000
G1 F1000 X31.0708 Y129.9998 Z-7.5000 S1000
G1 F1000 X30.9893 Y130.4097 Z-7.5000 S1000
G1 F1000 X30.7573 Y130.7569 Z-7.5000 S1000
G1 F1000 X30.4101 Y130.9889 Z-7.5000 S1000
G1 F1000 X30.0002 Y131.0704 Z-7.5000 S1000
G1 F1000 X29.5903 Y130.9889 Z-7.5000 S1000
G1 F1000 X29.2431 Y130.7569 Z-7.5000 S1000
G1 F1000 X29.0111 Y130.4097 Z-7.5000 S1000
G1 F1000 X28.9296 Y129.9998 Z-7.5000 S1000
G1 F1000 X29.0111 Y129.5899 Z-7.5000 S1000
G1 F1000 X29.2431 Y129.2427 Z-7.5000 S1000
G1 F1000 X29.5903 Y129.0107 Z-7.5000 S1000
G1 F1000 X30.0002 Y128.9292 Z-7.5000 S1000
G1 F1000 X30.4101 Y129.0107 Z-7.5000 S1000
; Starting inflateGrp: Closed?:true
G1 F300 Z-9.0000
G1 F1000 X30.7573 Y129.2427 Z-9.0000 S1000
G1 F1000 X30.9893 Y129.5899 Z-9.0000 S1000
G1 F1000 X31.0708 Y129.9998 Z-9.0000 S1000
G1 F1000 X30.9893 Y130.4097 Z-9.0000 S1000
G1 F1000 X30.7573 Y130.7569 Z-9.0000 S1000
G1 F1000 X30.4101 Y130.9889 Z-9.0000 S1000
G1 F1000 X30.0002 Y131.0704 Z-9.0000 S1000
G1 F1000 X29.5903 Y130.9889 Z-9.0000 S1000
G1 F1000 X29.2431 Y130.7569 Z-9.0000 S1000
G1 F1000 X29.0111 Y130.4097 Z-9.0000 S1000
G1 F1000 X28.9296 Y129.9998 Z-9.0000 S1000
G1 F1000 X29.0111 Y129.5899 Z-9.0000 S1000
G1 F1000 X29.2431 Y129.2427 Z-9.0000 S1000
G1 F1000 X29.5903 Y129.0107 Z-9.0000 S1000
G1 F1000 X30.0002 Y128.9292 Z-9.0000 S1000
G1 F1000 X30.4101 Y129.0107 Z-9.0000 S1000
; Starting inflateGrp: Closed?:true
G1 F300 Z-10.5000
G1 F1000 X30.7573 Y129.2427 Z-10.5000 S1000
G1 F1000 X30.9893 Y129.5899 Z-10.5000 S1000
G1 F1000 X31.0708 Y129.9998 Z-10.5000 S1000
G1 F1000 X30.9893 Y130.4097 Z-10.5000 S1000
G1 F1000 X30.7573 Y130.7569 Z-10.5000 S1000
G1 F1000 X30.4101 Y130.9889 Z-10.5000 S1000
G1 F1000 X30.0002 Y131.0704 Z-10.5000 S1000
G1 F1000 X29.5903 Y130.9889 Z-10.5000 S1000
G1 F1000 X29.2431 Y130.7569 Z-10.5000 S1000
G1 F1000 X29.0111 Y130.4097 Z-10.5000 S1000
G1 F1000 X28.9296 Y129.9998 Z-10.5000 S1000
G1 F1000 X29.0111 Y129.5899 Z-10.5000 S1000
G1 F1000 X29.2431 Y129.2427 Z-10.5000 S1000
G1 F1000 X29.5903 Y129.0107 Z-10.5000 S1000
G1 F1000 X30.0002 Y128.9292 Z-10.5000 S1000
G1 F1000 X30.4101 Y129.0107 Z-10.5000 S1000
; Starting inflateGrp: Closed?:true
G1 F300 Z-12.0000
G1 F1000 X30.7573 Y129.2427 Z-12.0000 S1000
G1 F1000 X30.9893 Y129.5899 Z-12.0000 S1000
G1 F1000 X31.0708 Y129.9998 Z-12.0000 S1000
G1 F1000 X30.9893 Y130.4097 Z-12.0000 S1000
G1 F1000 X30.7573 Y130.7569 Z-12.0000 S1000
G1 F1000 X30.4101 Y130.9889 Z-12.0000 S1000
G1 F1000 X30.0002 Y131.0704 Z-12.0000 S1000
G1 F1000 X29.5903 Y130.9889 Z-12.0000 S1000
G1 F1000 X29.2431 Y130.7569 Z-12.0000 S1000
G1 F1000 X29.0111 Y130.4097 Z-12.0000 S1000
G1 F1000 X28.9296 Y129.9998 Z-12.0000 S1000
G1 F1000 X29.0111 Y129.5899 Z-12.0000 S1000
G1 F1000 X29.2431 Y129.2427 Z-12.0000 S1000
G1 F1000 X29.5903 Y129.0107 Z-12.0000 S1000
G1 F1000 X30.0002 Y128.9292 Z-12.0000 S1000
G1 F1000 X30.4101 Y129.0107 Z-12.0000 S1000
; Starting inflateGrp: Closed?:true
G1 F300 Z-13.5000
G1 F1000 X30.7573 Y129.2427 Z-13.5000 S1000
G1 F1000 X30.9893 Y129.5899 Z-13.5000 S1000
G1 F1000 X31.0708 Y129.9998 Z-13.5000 S1000
G1 F1000 X30.9893 Y130.4097 Z-13.5000 S1000
G1 F1000 X30.7573 Y130.7569 Z-13.5000 S1000
G1 F1000 X30.4101 Y130.9889 Z-13.5000 S1000
G1 F1000 X30.0002 Y131.0704 Z-13.5000 S1000
G1 F1000 X29.5903 Y130.9889 Z-13.5000 S1000
G1 F1000 X29.2431 Y130.7569 Z-13.5000 S1000
G1 F1000 X29.0111 Y130.4097 Z-13.5000 S1000
G1 F1000 X28.9296 Y129.9998 Z-13.5000 S1000
G1 F1000 X29.0111 Y129.5899 Z-13.5000 S1000
G1 F1000 X29.2431 Y129.2427 Z-13.5000 S1000
G1 F1000 X29.5903 Y129.0107 Z-13.5000 S1000
G1 F1000 X30.0002 Y128.9292 Z-13.5000 S1000
G1 F1000 X30.4101 Y129.0107 Z-13.5000 S1000
; Starting inflateGrp: Closed?:true
G1 F300 Z-15.0000
G1 F1000 X30.7573 Y129.2427 Z-15.0000 S1000
G1 F1000 X30.9893 Y129.5899 Z-15.0000 S1000
G1 F1000 X31.0708 Y129.9998 Z-15.0000 S1000
G1 F1000 X30.9893 Y130.4097 Z-15.0000 S1000
G1 F1000 X30.7573 Y130.7569 Z-15.0000 S1000
G1 F1000 X30.4101 Y130.9889 Z-15.0000 S1000
G1 F1000 X30.0002 Y131.0704 Z-15.0000 S1000
G1 F1000 X29.5903 Y130.9889 Z-15.0000 S1000
G1 F1000 X29.2431 Y130.7569 Z-15.0000 S1000
G1 F1000 X29.0111 Y130.4097 Z-15.0000 S1000
G1 F1000 X28.9296 Y129.9998 Z-15.0000 S1000
G1 F1000 X29.0111 Y129.5899 Z-15.0000 S1000
G1 F1000 X29.2431 Y129.2427 Z-15.0000 S1000
G1 F1000 X29.5903 Y129.0107 Z-15.0000 S1000
G1 F1000 X30.0002 Y128.9292 Z-15.0000 S1000
G1 F1000 X30.4101 Y129.0107 Z-15.0000 S1000
; Starting inflateGrp: Closed?:true
G1 F300 Z-16.5000
G1 F1000 X30.7573 Y129.2427 Z-16.5000 S1000
G1 F1000 X30.9893 Y129.5899 Z-16.5000 S1000
G1 F1000 X31.0708 Y129.9998 Z-16.5000 S1000
G1 F1000 X30.9893 Y130.4097 Z-16.5000 S1000
G1 F1000 X30.7573 Y130.7569 Z-16.5000 S1000
G1 F1000 X30.4101 Y130.9889 Z-16.5000 S1000
G1 F1000 X30.0002 Y131.0704 Z-16.5000 S1000
G1 F1000 X29.5903 Y130.9889 Z-16.5000 S1000
G1 F1000 X29.2431 Y130.7569 Z-16.5000 S1000
G1 F1000 X29.0111 Y130.4097 Z-16.5000 S1000
G1 F1000 X28.9296 Y129.9998 Z-16.5000 S1000
G1 F1000 X29.0111 Y129.5899 Z-16.5000 S1000
G1 F1000 X29.2431 Y129.2427 Z-16.5000 S1000
G1 F1000 X29.5903 Y129.0107 Z-16.5000 S1000
G1 F1000 X30.0002 Y128.9292 Z-16.5000 S1000
G1 F1000 X30.4101 Y129.0107 Z-16.5000 S1000
; Starting inflateGrp: Closed?:true
G1 F300 Z-18.0000
G1 F1000 X30.7573 Y129.2427 Z-18.0000 S1000
G1 F1000 X30.9893 Y129.5899 Z-18.0000 S1000
G1 F1000 X31.0708 Y129.9998 Z-18.0000 S1000
G1 F1000 X30.9893 Y130.4097 Z-18.0000 S1000
G1 F1000 X30.7573 Y130.7569 Z-18.0000 S1000
G1 F1000 X30.4101 Y130.9889 Z-18.0000 S1000
G1 F1000 X30.0002 Y131.0704 Z-18.0000 S1000
G1 F1000 X29.5903 Y130.9889 Z-18.0000 S1000
G1 F1000 X29.2431 Y130.7569 Z-18.0000 S1000
G1 F1000 X29.0111 Y130.4097 Z-18.0000 S1000
G1 F1000 X28.9296 Y129.9998 Z-18.0000 S1000
G1 F1000 X29.0111 Y129.5899 Z-18.0000 S1000
G1 F1000 X29.2431 Y129.2427 Z-18.0000 S1000
G1 F1000 X29.5903 Y129.0107 Z-18.0000 S1000
G1 F1000 X30.0002 Y128.9292 Z-18.0000 S1000
G1 F1000 X30.4101 Y129.0107 Z-18.0000 S1000
; Starting inflateGrp: Closed?:true
G1 F300 Z-19.2000
G1 F1000 X30.7573 Y129.2427 Z-19.2000 S1000
G1 F1000 X30.9893 Y129.5899 Z-19.2000 S1000
G1 F1000 X31.0708 Y129.9998 Z-19.2000 S1000
G1 F1000 X30.9893 Y130.4097 Z-19.2000 S1000
G1 F1000 X30.7573 Y130.7569 Z-19.2000 S1000
G1 F1000 X30.4101 Y130.9889 Z-19.2000 S1000
G1 F1000 X30.0002 Y131.0704 Z-19.2000 S1000
G1 F1000 X29.5903 Y130.9889 Z-19.2000 S1000
G1 F1000 X29.2431 Y130.7569 Z-19.2000 S1000
G1 F1000 X29.0111 Y130.4097 Z-19.2000 S1000
G1 F1000 X28.9296 Y129.9998 Z-19.2000 S1000
G1 F1000 X29.0111 Y129.5899 Z-19.2000 S1000
G1 F1000 X29.2431 Y129.2427 Z-19.2000 S1000
G1 F1000 X29.5903 Y129.0107 Z-19.2000 S1000
G1 F1000 X30.0002 Y128.9292 Z-19.2000 S1000
G1 F1000 X30.4101 Y129.0107 Z-19.2000 S1000
; Starting inflateGrp: Closed?:true

G0 Z10
G0 X110.4101 Y129.0107

G0 Z0
G1 F300 Z-1.5000
G1 F1000 X110.7573 Y129.2427 Z-1.5000 S1000
G1 F1000 X110.9893 Y129.5899 Z-1.5000 S1000
G1 F1000 X111.0708 Y129.9998 Z-1.5000 S1000
G1 F1000 X110.9893 Y130.4097 Z-1.5000 S1000
G1 F1000 X110.7573 Y130.7569 Z-1.5000 S1000
G1 F1000 X110.4101 Y130.9889 Z-1.5000 S1000
G1 F1000 X110.0002 Y131.0704 Z-1.5000 S1000
G1 F1000 X109.5903 Y130.9889 Z-1.5000 S1000
G1 F1000 X109.2431 Y130.7569 Z-1.5000 S1000
G1 F1000 X109.0111 Y130.4097 Z-1.5000 S1000
G1 F1000 X108.9296 Y129.9998 Z-1.5000 S1000
G1 F1000 X109.0111 Y129.5899 Z-1.5000 S1000
G1 F1000 X109.2431 Y129.2427 Z-1.5000 S1000
G1 F1000 X109.5903 Y129.0107 Z-1.5000 S1000
G1 F1000 X110.0002 Y128.9292 Z-1.5000 S1000
G1 F1000 X110.4101 Y129.0107 Z-1.5000 S1000
; Starting inflateGrp: Closed?:true
G1 F300 Z-3.0000
G1 F1000 X110.7573 Y129.2427 Z-3.0000 S1000
G1 F1000 X110.9893 Y129.5899 Z-3.0000 S1000
G1 F1000 X111.0708 Y129.9998 Z-3.0000 S1000
G1 F1000 X110.9893 Y130.4097 Z-3.0000 S1000
G1 F1000 X110.7573 Y130.7569 Z-3.0000 S1000
G1 F1000 X110.4101 Y130.9889 Z-3.0000 S1000
G1 F1000 X110.0002 Y131.0704 Z-3.0000 S1000
G1 F1000 X109.5903 Y130.9889 Z-3.0000 S1000
G1 F1000 X109.2431 Y130.7569 Z-3.0000 S1000
G1 F1000 X109.0111 Y130.4097 Z-3.0000 S1000
G1 F1000 X108.9296 Y129.9998 Z-3.0000 S1000
G1 F1000 X109.0111 Y129.5899 Z-3.0000 S1000
G1 F1000 X109.2431 Y129.2427 Z-3.0000 S1000
G1 F1000 X109.5903 Y129.0107 Z-3.0000 S1000
G1 F1000 X110.0002 Y128.9292 Z-3.0000 S1000
G1 F1000 X110.4101 Y129.0107 Z-3.0000 S1000
; Starting inflateGrp: Closed?:true
G1 F300 Z-4.5000
G1 F1000 X110.7573 Y129.2427 Z-4.5000 S1000
G1 F1000 X110.9893 Y129.5899 Z-4.5000 S1000
G1 F1000 X111.0708 Y129.9998 Z-4.5000 S1000
G1 F1000 X110.9893 Y130.4097 Z-4.5000 S1000
G1 F1000 X110.7573 Y130.7569 Z-4.5000 S1000
G1 F1000 X110.4101 Y130.9889 Z-4.5000 S1000
G1 F1000 X110.0002 Y131.0704 Z-4.5000 S1000
G1 F1000 X109.5903 Y130.9889 Z-4.5000 S1000
G1 F1000 X109.2431 Y130.7569 Z-4.5000 S1000
G1 F1000 X109.0111 Y130.4097 Z-4.5000 S1000
G1 F1000 X108.9296 Y129.9998 Z-4.5000 S1000
G1 F1000 X109.0111 Y129.5899 Z-4.5000 S1000
G1 F1000 X109.2431 Y129.2427 Z-4.5000 S1000
G1 F1000 X109.5903 Y129.0107 Z-4.5000 S1000
G1 F1000 X110.0002 Y128.9292 Z-4.5000 S1000
G1 F1000 X110.4101 Y129.0107 Z-4.5000 S1000
; Starting inflateGrp: Closed?:true
G1 F300 Z-6.0000
G1 F1000 X110.7573 Y129.2427 Z-6.0000 S1000
G1 F1000 X110.9893 Y129.5899 Z-6.0000 S1000
G1 F1000 X111.0708 Y129.9998 Z-6.0000 S1000
G1 F1000 X110.9893 Y130.4097 Z-6.0000 S1000
G1 F1000 X110.7573 Y130.7569 Z-6.0000 S1000
G1 F1000 X110.4101 Y130.9889 Z-6.0000 S1000
G1 F1000 X110.0002 Y131.0704 Z-6.0000 S1000
G1 F1000 X109.5903 Y130.9889 Z-6.0000 S1000
G1 F1000 X109.2431 Y130.7569 Z-6.0000 S1000
G1 F1000 X109.0111 Y130.4097 Z-6.0000 S1000
G1 F1000 X108.9296 Y129.9998 Z-6.0000 S1000
G1 F1000 X109.0111 Y129.5899 Z-6.0000 S1000
G1 F1000 X109.2431 Y129.2427 Z-6.0000 S1000
G1 F1000 X109.5903 Y129.0107 Z-6.0000 S1000
G1 F1000 X110.0002 Y128.9292 Z-6.0000 S1000
G1 F1000 X110.4101 Y129.0107 Z-6.0000 S1000
; Starting inflateGrp: Closed?:true
G1 F300 Z-7.5000
G1 F1000 X110.7573 Y129.2427 Z-7.5000 S1000
G1 F1000 X110.9893 Y129.5899 Z-7.5000 S1000
G1 F1000 X111.0708 Y129.9998 Z-7.5000 S1000
G1 F1000 X110.9893 Y130.4097 Z-7.5000 S1000
G1 F1000 X110.7573 Y130.7569 Z-7.5000 S1000
G1 F1000 X110.4101 Y130.9889 Z-7.5000 S1000
G1 F1000 X110.0002 Y131.0704 Z-7.5000 S1000
G1 F1000 X109.5903 Y130.9889 Z-7.5000 S1000
G1 F1000 X109.2431 Y130.7569 Z-7.5000 S1000
G1 F1000 X109.0111 Y130.4097 Z-7.5000 S1000
G1 F1000 X108.9296 Y129.9998 Z-7.5000 S1000
G1 F1000 X109.0111 Y129.5899 Z-7.5000 S1000
G1 F1000 X109.2431 Y129.2427 Z-7.5000 S1000
G1 F1000 X109.5903 Y129.0107 Z-7.5000 S1000
G1 F1000 X110.0002 Y128.9292 Z-7.5000 S1000
G1 F1000 X110.4101 Y129.0107 Z-7.5000 S1000
; Starting inflateGrp: Closed?:true
G1 F300 Z-9.0000
G1 F1000 X110.7573 Y129.2427 Z-9.0000 S1000
G1 F1000 X110.9893 Y129.5899 Z-9.0000 S1000
G1 F1000 X111.0708 Y129.9998 Z-9.0000 S1000
G1 F1000 X110.9893 Y130.4097 Z-9.0000 S1000
G1 F1000 X110.7573 Y130.7569 Z-9.0000 S1000
G1 F1000 X110.4101 Y130.9889 Z-9.0000 S1000
G1 F1000 X110.0002 Y131.0704 Z-9.0000 S1000
G1 F1000 X109.5903 Y130.9889 Z-9.0000 S1000
G1 F1000 X109.2431 Y130.7569 Z-9.0000 S1000
G1 F1000 X109.0111 Y130.4097 Z-9.0000 S1000
G1 F1000 X108.9296 Y129.9998 Z-9.0000 S1000
G1 F1000 X109.0111 Y129.5899 Z-9.0000 S1000
G1 F1000 X109.2431 Y129.2427 Z-9.0000 S1000
G1 F1000 X109.5903 Y129.0107 Z-9.0000 S1000
G1 F1000 X110.0002 Y128.9292 Z-9.0000 S1000
G1 F1000 X110.4101 Y129.0107 Z-9.0000 S1000
; Starting inflateGrp: Closed?:true
G1 F300 Z-10.5000
G1 F1000 X110.7573 Y129.2427 Z-10.5000 S1000
G1 F1000 X110.9893 Y129.5899 Z-10.5000 S1000
G1 F1000 X111.0708 Y129.9998 Z-10.5000 S1000
G1 F1000 X110.9893 Y130.4097 Z-10.5000 S1000
G1 F1000 X110.7573 Y130.7569 Z-10.5000 S1000
G1 F1000 X110.4101 Y130.9889 Z-10.5000 S1000
G1 F1000 X110.0002 Y131.0704 Z-10.5000 S1000
G1 F1000 X109.5903 Y130.9889 Z-10.5000 S1000
G1 F1000 X109.2431 Y130.7569 Z-10.5000 S1000
G1 F1000 X109.0111 Y130.4097 Z-10.5000 S1000
G1 F1000 X108.9296 Y129.9998 Z-10.5000 S1000
G1 F1000 X109.0111 Y129.5899 Z-10.5000 S1000
G1 F1000 X109.2431 Y129.2427 Z-10.5000 S1000
G1 F1000 X109.5903 Y129.0107 Z-10.5000 S1000
G1 F1000 X110.0002 Y128.9292 Z-10.5000 S1000
G1 F1000 X110.4101 Y129.0107 Z-10.5000 S1000
; Starting inflateGrp: Closed?:true
G1 F300 Z-12.0000
G1 F1000 X110.7573 Y129.2427 Z-12.0000 S1000
G1 F1000 X110.9893 Y129.5899 Z-12.0000 S1000
G1 F1000 X111.0708 Y129.9998 Z-12.0000 S1000
G1 F1000 X110.9893 Y130.4097 Z-12.0000 S1000
G1 F1000 X110.7573 Y130.7569 Z-12.0000 S1000
G1 F1000 X110.4101 Y130.9889 Z-12.0000 S1000
G1 F1000 X110.0002 Y131.0704 Z-12.0000 S1000
G1 F1000 X109.5903 Y130.9889 Z-12.0000 S1000
G1 F1000 X109.2431 Y130.7569 Z-12.0000 S1000
G1 F1000 X109.0111 Y130.4097 Z-12.0000 S1000
G1 F1000 X108.9296 Y129.9998 Z-12.0000 S1000
G1 F1000 X109.0111 Y129.5899 Z-12.0000 S1000
G1 F1000 X109.2431 Y129.2427 Z-12.0000 S1000
G1 F1000 X109.5903 Y129.0107 Z-12.0000 S1000
G1 F1000 X110.0002 Y128.9292 Z-12.0000 S1000
G1 F1000 X110.4101 Y129.0107 Z-12.0000 S1000
; Starting inflateGrp: Closed?:true
G1 F300 Z-13.5000
G1 F1000 X110.7573 Y129.2427 Z-13.5000 S1000
G1 F1000 X110.9893 Y129.5899 Z-13.5000 S1000
G1 F1000 X111.0708 Y129.9998 Z-13.5000 S1000
G1 F1000 X110.9893 Y130.4097 Z-13.5000 S1000
G1 F1000 X110.7573 Y130.7569 Z-13.5000 S1000
G1 F1000 X110.4101 Y130.9889 Z-13.5000 S1000
G1 F1000 X110.0002 Y131.0704 Z-13.5000 S1000
G1 F1000 X109.5903 Y130.9889 Z-13.5000 S1000
G1 F1000 X109.2431 Y130.7569 Z-13.5000 S1000
G1 F1000 X109.0111 Y130.4097 Z-13.5000 S1000
G1 F1000 X108.9296 Y129.9998 Z-13.5000 S1000
G1 F1000 X109.0111 Y129.5899 Z-13.5000 S1000
G1 F1000 X109.2431 Y129.2427 Z-13.5000 S1000
G1 F1000 X109.5903 Y129.0107 Z-13.5000 S1000
G1 F1000 X110.0002 Y128.9292 Z-13.5000 S1000
G1 F1000 X110.4101 Y129.0107 Z-13.5000 S1000
; Starting inflateGrp: Closed?:true
G1 F300 Z-15.0000
G1 F1000 X110.7573 Y129.2427 Z-15.0000 S1000
G1 F1000 X110.9893 Y129.5899 Z-15.0000 S1000
G1 F1000 X111.0708 Y129.9998 Z-15.0000 S1000
G1 F1000 X110.9893 Y130.4097 Z-15.0000 S1000
G1 F1000 X110.7573 Y130.7569 Z-15.0000 S1000
G1 F1000 X110.4101 Y130.9889 Z-15.0000 S1000
G1 F1000 X110.0002 Y131.0704 Z-15.0000 S1000
G1 F1000 X109.5903 Y130.9889 Z-15.0000 S1000
G1 F1000 X109.2431 Y130.7569 Z-15.0000 S1000
G1 F1000 X109.0111 Y130.4097 Z-15.0000 S1000
G1 F1000 X108.9296 Y129.9998 Z-15.0000 S1000
G1 F1000 X109.0111 Y129.5899 Z-15.0000 S1000
G1 F1000 X109.2431 Y129.2427 Z-15.0000 S1000
G1 F1000 X109.5903 Y129.0107 Z-15.0000 S1000
G1 F1000 X110.0002 Y128.9292 Z-15.0000 S1000
G1 F1000 X110.4101 Y129.0107 Z-15.0000 S1000
; Starting inflateGrp: Closed?:true
G1 F300 Z-16.5000
G1 F1000 X110.7573 Y129.2427 Z-16.5000 S1000
G1 F1000 X110.9893 Y129.5899 Z-16.5000 S1000
G1 F1000 X111.0708 Y129.9998 Z-16.5000 S1000
G1 F1000 X110.9893 Y130.4097 Z-16.5000 S1000
G1 F1000 X110.7573 Y130.7569 Z-16.5000 S1000
G1 F1000 X110.4101 Y130.9889 Z-16.5000 S1000
G1 F1000 X110.0002 Y131.0704 Z-16.5000 S1000
G1 F1000 X109.5903 Y130.9889 Z-16.5000 S1000
G1 F1000 X109.2431 Y130.7569 Z-16.5000 S1000
G1 F1000 X109.0111 Y130.4097 Z-16.5000 S1000
G1 F1000 X108.9296 Y129.9998 Z-16.5000 S1000
G1 F1000 X109.0111 Y129.5899 Z-16.5000 S1000
G1 F1000 X109.2431 Y129.2427 Z-16.5000 S1000
G1 F1000 X109.5903 Y129.0107 Z-16.5000 S1000
G1 F1000 X110.0002 Y128.9292 Z-16.5000 S1000
G1 F1000 X110.4101 Y129.0107 Z-16.5000 S1000
; Starting inflateGrp: Closed?:true
G1 F300 Z-18.0000
G1 F1000 X110.7573 Y129.2427 Z-18.0000 S1000
G1 F1000 X110.9893 Y129.5899 Z-18.0000 S1000
G1 F1000 X111.0708 Y129.9998 Z-18.0000 S1000
G1 F1000 X110.9893 Y130.4097 Z-18.0000 S1000
G1 F1000 X110.7573 Y130.7569 Z-18.0000 S1000
G1 F1000 X110.4101 Y130.9889 Z-18.0000 S1000
G1 F1000 X110.0002 Y131.0704 Z-18.0000 S1000
G1 F1000 X109.5903 Y130.9889 Z-18.0000 S1000
G1 F1000 X109.2431 Y130.7569 Z-18.0000 S1000
G1 F1000 X109.0111 Y130.4097 Z-18.0000 S1000
G1 F1000 X108.9296 Y129.9998 Z-18.0000 S1000
G1 F1000 X109.0111 Y129.5899 Z-18.0000 S1000
G1 F1000 X109.2431 Y129.2427 Z-18.0000 S1000
G1 F1000 X109.5903 Y129.0107 Z-18.0000 S1000
G1 F1000 X110.0002 Y128.9292 Z-18.0000 S1000
G1 F1000 X110.4101 Y129.0107 Z-18.0000 S1000
; Starting inflateGrp: Closed?:true
G1 F300 Z-19.2000
G1 F1000 X110.7573 Y129.2427 Z-19.2000 S1000
G1 F1000 X110.9893 Y129.5899 Z-19.2000 S1000
G1 F1000 X111.0708 Y129.9998 Z-19.2000 S1000
G1 F1000 X110.9893 Y130.4097 Z-19.2000 S1000
G1 F1000 X110.7573 Y130.7569 Z-19.2000 S1000
G1 F1000 X110.4101 Y130.9889 Z-19.2000 S1000
G1 F1000 X110.0002 Y131.0704 Z-19.2000 S1000
G1 F1000 X109.5903 Y130.9889 Z-19.2000 S1000
G1 F1000 X109.2431 Y130.7569 Z-19.2000 S1000
G1 F1000 X109.0111 Y130.4097 Z-19.2000 S1000
G1 F1000 X108.9296 Y129.9998 Z-19.2000 S1000
G1 F1000 X109.0111 Y129.5899 Z-19.2000 S1000
G1 F1000 X109.2431 Y129.2427 Z-19.2000 S1000
G1 F1000 X109.5903 Y129.0107 Z-19.2000 S1000
G1 F1000 X110.0002 Y128.9292 Z-19.2000 S1000
G1 F1000 X110.4101 Y129.0107 Z-19.2000 S1000
; retracting back to z-safe
G0 Z10

M5 S0; Spindle Off
