; GCODE Generated by cam.openbuilds.com on 2020-09-02 
G21 ; mm-mode
G54; Work Coordinates
G21; mm-mode
G90; Absolute Positioning
M3 S1000; Spindle On

; Operation 0: CNC: Vector (path outside)
; Tool Diameter: 6
; Starting inflateGrp: Closed?:true

G0 Z10
G0 F1000 X511.0000 Y-3.0000

G0 Z0
G1 F300 Z-4.0000
G1 F1000 X0.0000 Y-3.0000 Z-4.0000 S1000
G1 F1000 X-0.5500 Y-2.9491 Z-4.0000 S1000
G1 F1000 X-1.2108 Y-2.7448 Z-4.0000 S1000
G1 F1000 X-1.8072 Y-2.3946 Z-4.0000 S1000
G1 F1000 X-2.3076 Y-1.9170 Z-4.0000 S1000
G1 F1000 X-2.6853 Y-1.3376 Z-4.0000 S1000
G1 F1000 X-2.9203 Y-0.6871 Z-4.0000 S1000
G1 F1000 X-3.0000 Y0.0000 Z-4.0000 S1000
G1 F1000 X-3.0000 Y20.0000 Z-4.0000 S1000
G1 F1000 X-2.9491 Y20.5500 Z-4.0000 S1000
G1 F1000 X-2.7448 Y21.2108 Z-4.0000 S1000
G1 F1000 X-2.3946 Y21.8072 Z-4.0000 S1000
G1 F1000 X-1.9170 Y22.3076 Z-4.0000 S1000
G1 F1000 X-1.3376 Y22.6853 Z-4.0000 S1000
G1 F1000 X-0.6871 Y22.9203 Z-4.0000 S1000
G1 F1000 X0.0000 Y23.0000 Z-4.0000 S1000
G1 F1000 X511.0000 Y23.0000 Z-4.0000 S1000
G1 F1000 X511.5500 Y22.9491 Z-4.0000 S1000
G1 F1000 X512.2108 Y22.7448 Z-4.0000 S1000
G1 F1000 X512.8072 Y22.3946 Z-4.0000 S1000
G1 F1000 X513.3076 Y21.9170 Z-4.0000 S1000
G1 F1000 X513.6853 Y21.3376 Z-4.0000 S1000
G1 F1000 X513.9203 Y20.6871 Z-4.0000 S1000
G1 F1000 X514.0000 Y20.0000 Z-4.0000 S1000
G1 F1000 X514.0000 Y0.0000 Z-4.0000 S1000
G1 F1000 X513.9491 Y-0.5500 Z-4.0000 S1000
G1 F1000 X513.7448 Y-1.2108 Z-4.0000 S1000
G1 F1000 X513.3946 Y-1.8072 Z-4.0000 S1000
G1 F1000 X512.9170 Y-2.3076 Z-4.0000 S1000
G1 F1000 X512.3376 Y-2.6853 Z-4.0000 S1000
G1 F1000 X511.6871 Y-2.9203 Z-4.0000 S1000
G1 F1000 X511.0000 Y-3.0000 Z-4.0000 S1000
; Starting inflateGrp: Closed?:true
G1 F300 Z-8.0000
G1 F1000 X0.0000 Y-3.0000 Z-8.0000 S1000
G1 F1000 X-0.5500 Y-2.9491 Z-8.0000 S1000
G1 F1000 X-1.2108 Y-2.7448 Z-8.0000 S1000
G1 F1000 X-1.8072 Y-2.3946 Z-8.0000 S1000
G1 F1000 X-2.3076 Y-1.9170 Z-8.0000 S1000
G1 F1000 X-2.6853 Y-1.3376 Z-8.0000 S1000
G1 F1000 X-2.9203 Y-0.6871 Z-8.0000 S1000
G1 F1000 X-3.0000 Y0.0000 Z-8.0000 S1000
G1 F1000 X-3.0000 Y20.0000 Z-8.0000 S1000
G1 F1000 X-2.9491 Y20.5500 Z-8.0000 S1000
G1 F1000 X-2.7448 Y21.2108 Z-8.0000 S1000
G1 F1000 X-2.3946 Y21.8072 Z-8.0000 S1000
G1 F1000 X-1.9170 Y22.3076 Z-8.0000 S1000
G1 F1000 X-1.3376 Y22.6853 Z-8.0000 S1000
G1 F1000 X-0.6871 Y22.9203 Z-8.0000 S1000
G1 F1000 X0.0000 Y23.0000 Z-8.0000 S1000
G1 F1000 X511.0000 Y23.0000 Z-8.0000 S1000
G1 F1000 X511.5500 Y22.9491 Z-8.0000 S1000
G1 F1000 X512.2108 Y22.7448 Z-8.0000 S1000
G1 F1000 X512.8072 Y22.3946 Z-8.0000 S1000
G1 F1000 X513.3076 Y21.9170 Z-8.0000 S1000
G1 F1000 X513.6853 Y21.3376 Z-8.0000 S1000
G1 F1000 X513.9203 Y20.6871 Z-8.0000 S1000
G1 F1000 X514.0000 Y20.0000 Z-8.0000 S1000
G1 F1000 X514.0000 Y0.0000 Z-8.0000 S1000
G1 F1000 X513.9491 Y-0.5500 Z-8.0000 S1000
G1 F1000 X513.7448 Y-1.2108 Z-8.0000 S1000
G1 F1000 X513.3946 Y-1.8072 Z-8.0000 S1000
G1 F1000 X512.9170 Y-2.3076 Z-8.0000 S1000
G1 F1000 X512.3376 Y-2.6853 Z-8.0000 S1000
G1 F1000 X511.6871 Y-2.9203 Z-8.0000 S1000
G1 F1000 X511.0000 Y-3.0000 Z-8.0000 S1000
; Starting inflateGrp: Closed?:true
G1 F300 Z-12.0000
G1 F1000 X0.0000 Y-3.0000 Z-12.0000 S1000
G1 F1000 X-0.5500 Y-2.9491 Z-12.0000 S1000
G1 F1000 X-1.2108 Y-2.7448 Z-12.0000 S1000
G1 F1000 X-1.8072 Y-2.3946 Z-12.0000 S1000
G1 F1000 X-2.3076 Y-1.9170 Z-12.0000 S1000
G1 F1000 X-2.6853 Y-1.3376 Z-12.0000 S1000
G1 F1000 X-2.9203 Y-0.6871 Z-12.0000 S1000
G1 F1000 X-3.0000 Y0.0000 Z-12.0000 S1000
G1 F1000 X-3.0000 Y20.0000 Z-12.0000 S1000
G1 F1000 X-2.9491 Y20.5500 Z-12.0000 S1000
G1 F1000 X-2.7448 Y21.2108 Z-12.0000 S1000
G1 F1000 X-2.3946 Y21.8072 Z-12.0000 S1000
G1 F1000 X-1.9170 Y22.3076 Z-12.0000 S1000
G1 F1000 X-1.3376 Y22.6853 Z-12.0000 S1000
G1 F1000 X-0.6871 Y22.9203 Z-12.0000 S1000
G1 F1000 X0.0000 Y23.0000 Z-12.0000 S1000
G1 F1000 X511.0000 Y23.0000 Z-12.0000 S1000
G1 F1000 X511.5500 Y22.9491 Z-12.0000 S1000
G1 F1000 X512.2108 Y22.7448 Z-12.0000 S1000
G1 F1000 X512.8072 Y22.3946 Z-12.0000 S1000
G1 F1000 X513.3076 Y21.9170 Z-12.0000 S1000
G1 F1000 X513.6853 Y21.3376 Z-12.0000 S1000
G1 F1000 X513.9203 Y20.6871 Z-12.0000 S1000
G1 F1000 X514.0000 Y20.0000 Z-12.0000 S1000
G1 F1000 X514.0000 Y0.0000 Z-12.0000 S1000
G1 F1000 X513.9491 Y-0.5500 Z-12.0000 S1000
G1 F1000 X513.7448 Y-1.2108 Z-12.0000 S1000
G1 F1000 X513.3946 Y-1.8072 Z-12.0000 S1000
G1 F1000 X512.9170 Y-2.3076 Z-12.0000 S1000
G1 F1000 X512.3376 Y-2.6853 Z-12.0000 S1000
G1 F1000 X511.6871 Y-2.9203 Z-12.0000 S1000
G1 F1000 X511.0000 Y-3.0000 Z-12.0000 S1000
; Starting inflateGrp: Closed?:true
G1 F300 Z-16.0000
G1 F1000 X0.0000 Y-3.0000 Z-16.0000 S1000
G1 F1000 X-0.5500 Y-2.9491 Z-16.0000 S1000
G1 F1000 X-1.2108 Y-2.7448 Z-16.0000 S1000
G1 F1000 X-1.8072 Y-2.3946 Z-16.0000 S1000
G1 F1000 X-2.3076 Y-1.9170 Z-16.0000 S1000
G1 F1000 X-2.6853 Y-1.3376 Z-16.0000 S1000
G1 F1000 X-2.9203 Y-0.6871 Z-16.0000 S1000
G1 F1000 X-3.0000 Y0.0000 Z-16.0000 S1000
G1 F1000 X-3.0000 Y20.0000 Z-16.0000 S1000
G1 F1000 X-2.9491 Y20.5500 Z-16.0000 S1000
G1 F1000 X-2.7448 Y21.2108 Z-16.0000 S1000
G1 F1000 X-2.3946 Y21.8072 Z-16.0000 S1000
G1 F1000 X-1.9170 Y22.3076 Z-16.0000 S1000
G1 F1000 X-1.3376 Y22.6853 Z-16.0000 S1000
G1 F1000 X-0.6871 Y22.9203 Z-16.0000 S1000
G1 F1000 X0.0000 Y23.0000 Z-16.0000 S1000
G1 F1000 X511.0000 Y23.0000 Z-16.0000 S1000
G1 F1000 X511.5500 Y22.9491 Z-16.0000 S1000
G1 F1000 X512.2108 Y22.7448 Z-16.0000 S1000
G1 F1000 X512.8072 Y22.3946 Z-16.0000 S1000
G1 F1000 X513.3076 Y21.9170 Z-16.0000 S1000
G1 F1000 X513.6853 Y21.3376 Z-16.0000 S1000
G1 F1000 X513.9203 Y20.6871 Z-16.0000 S1000
G1 F1000 X514.0000 Y20.0000 Z-16.0000 S1000
G1 F1000 X514.0000 Y0.0000 Z-16.0000 S1000
G1 F1000 X513.9491 Y-0.5500 Z-16.0000 S1000
G1 F1000 X513.7448 Y-1.2108 Z-16.0000 S1000
G1 F1000 X513.3946 Y-1.8072 Z-16.0000 S1000
G1 F1000 X512.9170 Y-2.3076 Z-16.0000 S1000
G1 F1000 X512.3376 Y-2.6853 Z-16.0000 S1000
G1 F1000 X511.6871 Y-2.9203 Z-16.0000 S1000
G1 F1000 X511.0000 Y-3.0000 Z-16.0000 S1000
; Starting inflateGrp: Closed?:true
G1 F300 Z-19.2000
G1 F1000 X0.0000 Y-3.0000 Z-19.2000 S1000
G1 F1000 X-0.5500 Y-2.9491 Z-19.2000 S1000
G1 F1000 X-1.2108 Y-2.7448 Z-19.2000 S1000
G1 F1000 X-1.8072 Y-2.3946 Z-19.2000 S1000
G1 F1000 X-2.3076 Y-1.9170 Z-19.2000 S1000
G1 F1000 X-2.6853 Y-1.3376 Z-19.2000 S1000
G1 F1000 X-2.9203 Y-0.6871 Z-19.2000 S1000
G1 F1000 X-3.0000 Y0.0000 Z-19.2000 S1000
G1 F1000 X-3.0000 Y20.0000 Z-19.2000 S1000
G1 F1000 X-2.9491 Y20.5500 Z-19.2000 S1000
G1 F1000 X-2.7448 Y21.2108 Z-19.2000 S1000
G1 F1000 X-2.3946 Y21.8072 Z-19.2000 S1000
G1 F1000 X-1.9170 Y22.3076 Z-19.2000 S1000
G1 F1000 X-1.3376 Y22.6853 Z-19.2000 S1000
G1 F1000 X-0.6871 Y22.9203 Z-19.2000 S1000
G1 F1000 X0.0000 Y23.0000 Z-19.2000 S1000
G1 F1000 X511.0000 Y23.0000 Z-19.2000 S1000
G1 F1000 X511.5500 Y22.9491 Z-19.2000 S1000
G1 F1000 X512.2108 Y22.7448 Z-19.2000 S1000
G1 F1000 X512.8072 Y22.3946 Z-19.2000 S1000
G1 F1000 X513.3076 Y21.9170 Z-19.2000 S1000
G1 F1000 X513.6853 Y21.3376 Z-19.2000 S1000
G1 F1000 X513.9203 Y20.6871 Z-19.2000 S1000
G1 F1000 X514.0000 Y20.0000 Z-19.2000 S1000
G1 F1000 X514.0000 Y0.0000 Z-19.2000 S1000
G1 F1000 X513.9491 Y-0.5500 Z-19.2000 S1000
G1 F1000 X513.7448 Y-1.2108 Z-19.2000 S1000
G1 F1000 X513.3946 Y-1.8072 Z-19.2000 S1000
G1 F1000 X512.9170 Y-2.3076 Z-19.2000 S1000
G1 F1000 X512.3376 Y-2.6853 Z-19.2000 S1000
G1 F1000 X511.6871 Y-2.9203 Z-19.2000 S1000
G1 F1000 X511.0000 Y-3.0000 Z-19.2000 S1000
; retracting back to z-safe
G0 Z10

M5 S0; Spindle Off
