; GCODE Generated by cam.openbuilds.com on 2020-09-04 
G21 ; mm-mode
G54; Work Coordinates
G21; mm-mode
G90; Absolute Positioning
M3 S1000; Spindle On

; Operation 0: CNC: Vector (path inside)
; Tool Diameter: 5
; Starting inflateGrp: Closed?:true

G0 Z10
G0 F1000 X235.0196 Y175.9529

G0 Z0
G1 F300 Z-2.1000
G1 F1000 X235.0361 Y175.9639 Z-2.1000 S1000
G1 F1000 X235.0471 Y175.9804 Z-2.1000 S1000
G1 F1000 X235.0510 Y176.0000 Z-2.1000 S1000
G1 F1000 X235.0471 Y176.0196 Z-2.1000 S1000
G1 F1000 X235.0361 Y176.0361 Z-2.1000 S1000
G1 F1000 X235.0196 Y176.0471 Z-2.1000 S1000
G1 F1000 X235.0000 Y176.0510 Z-2.1000 S1000
G1 F1000 X234.9804 Y176.0471 Z-2.1000 S1000
G1 F1000 X234.9639 Y176.0361 Z-2.1000 S1000
G1 F1000 X234.9529 Y176.0196 Z-2.1000 S1000
G1 F1000 X234.9490 Y176.0000 Z-2.1000 S1000
G1 F1000 X234.9529 Y175.9804 Z-2.1000 S1000
G1 F1000 X234.9639 Y175.9639 Z-2.1000 S1000
G1 F1000 X234.9804 Y175.9529 Z-2.1000 S1000
G1 F1000 X235.0000 Y175.9490 Z-2.1000 S1000
G1 F1000 X235.0196 Y175.9529 Z-2.1000 S1000
; Starting inflateGrp: Closed?:true
G1 F300 Z-4.2000
G1 F1000 X235.0361 Y175.9639 Z-4.2000 S1000
G1 F1000 X235.0471 Y175.9804 Z-4.2000 S1000
G1 F1000 X235.0510 Y176.0000 Z-4.2000 S1000
G1 F1000 X235.0471 Y176.0196 Z-4.2000 S1000
G1 F1000 X235.0361 Y176.0361 Z-4.2000 S1000
G1 F1000 X235.0196 Y176.0471 Z-4.2000 S1000
G1 F1000 X235.0000 Y176.0510 Z-4.2000 S1000
G1 F1000 X234.9804 Y176.0471 Z-4.2000 S1000
G1 F1000 X234.9639 Y176.0361 Z-4.2000 S1000
G1 F1000 X234.9529 Y176.0196 Z-4.2000 S1000
G1 F1000 X234.9490 Y176.0000 Z-4.2000 S1000
G1 F1000 X234.9529 Y175.9804 Z-4.2000 S1000
G1 F1000 X234.9639 Y175.9639 Z-4.2000 S1000
G1 F1000 X234.9804 Y175.9529 Z-4.2000 S1000
G1 F1000 X235.0000 Y175.9490 Z-4.2000 S1000
G1 F1000 X235.0196 Y175.9529 Z-4.2000 S1000
; Starting inflateGrp: Closed?:true
G1 F300 Z-6.3000
G1 F1000 X235.0361 Y175.9639 Z-6.3000 S1000
G1 F1000 X235.0471 Y175.9804 Z-6.3000 S1000
G1 F1000 X235.0510 Y176.0000 Z-6.3000 S1000
G1 F1000 X235.0471 Y176.0196 Z-6.3000 S1000
G1 F1000 X235.0361 Y176.0361 Z-6.3000 S1000
G1 F1000 X235.0196 Y176.0471 Z-6.3000 S1000
G1 F1000 X235.0000 Y176.0510 Z-6.3000 S1000
G1 F1000 X234.9804 Y176.0471 Z-6.3000 S1000
G1 F1000 X234.9639 Y176.0361 Z-6.3000 S1000
G1 F1000 X234.9529 Y176.0196 Z-6.3000 S1000
G1 F1000 X234.9490 Y176.0000 Z-6.3000 S1000
G1 F1000 X234.9529 Y175.9804 Z-6.3000 S1000
G1 F1000 X234.9639 Y175.9639 Z-6.3000 S1000
G1 F1000 X234.9804 Y175.9529 Z-6.3000 S1000
G1 F1000 X235.0000 Y175.9490 Z-6.3000 S1000
G1 F1000 X235.0196 Y175.9529 Z-6.3000 S1000
; Starting inflateGrp: Closed?:true
G1 F300 Z-8.2000
G1 F1000 X235.0361 Y175.9639 Z-8.2000 S1000
G1 F1000 X235.0471 Y175.9804 Z-8.2000 S1000
G1 F1000 X235.0510 Y176.0000 Z-8.2000 S1000
G1 F1000 X235.0471 Y176.0196 Z-8.2000 S1000
G1 F1000 X235.0361 Y176.0361 Z-8.2000 S1000
G1 F1000 X235.0196 Y176.0471 Z-8.2000 S1000
G1 F1000 X235.0000 Y176.0510 Z-8.2000 S1000
G1 F1000 X234.9804 Y176.0471 Z-8.2000 S1000
G1 F1000 X234.9639 Y176.0361 Z-8.2000 S1000
G1 F1000 X234.9529 Y176.0196 Z-8.2000 S1000
G1 F1000 X234.9490 Y176.0000 Z-8.2000 S1000
G1 F1000 X234.9529 Y175.9804 Z-8.2000 S1000
G1 F1000 X234.9639 Y175.9639 Z-8.2000 S1000
G1 F1000 X234.9804 Y175.9529 Z-8.2000 S1000
G1 F1000 X235.0000 Y175.9490 Z-8.2000 S1000
G1 F1000 X235.0196 Y175.9529 Z-8.2000 S1000
; Starting inflateGrp: Closed?:true

G0 Z10
G0 X460.0196 Y245.9529

G0 Z0
G1 F300 Z-2.1000
G1 F1000 X460.0361 Y245.9639 Z-2.1000 S1000
G1 F1000 X460.0471 Y245.9804 Z-2.1000 S1000
G1 F1000 X460.0510 Y246.0000 Z-2.1000 S1000
G1 F1000 X460.0471 Y246.0196 Z-2.1000 S1000
G1 F1000 X460.0361 Y246.0361 Z-2.1000 S1000
G1 F1000 X460.0196 Y246.0471 Z-2.1000 S1000
G1 F1000 X460.0000 Y246.0510 Z-2.1000 S1000
G1 F1000 X459.9804 Y246.0471 Z-2.1000 S1000
G1 F1000 X459.9639 Y246.0361 Z-2.1000 S1000
G1 F1000 X459.9529 Y246.0196 Z-2.1000 S1000
G1 F1000 X459.9490 Y246.0000 Z-2.1000 S1000
G1 F1000 X459.9529 Y245.9804 Z-2.1000 S1000
G1 F1000 X459.9639 Y245.9639 Z-2.1000 S1000
G1 F1000 X459.9804 Y245.9529 Z-2.1000 S1000
G1 F1000 X460.0000 Y245.9490 Z-2.1000 S1000
G1 F1000 X460.0196 Y245.9529 Z-2.1000 S1000
; Starting inflateGrp: Closed?:true
G1 F300 Z-4.2000
G1 F1000 X460.0361 Y245.9639 Z-4.2000 S1000
G1 F1000 X460.0471 Y245.9804 Z-4.2000 S1000
G1 F1000 X460.0510 Y246.0000 Z-4.2000 S1000
G1 F1000 X460.0471 Y246.0196 Z-4.2000 S1000
G1 F1000 X460.0361 Y246.0361 Z-4.2000 S1000
G1 F1000 X460.0196 Y246.0471 Z-4.2000 S1000
G1 F1000 X460.0000 Y246.0510 Z-4.2000 S1000
G1 F1000 X459.9804 Y246.0471 Z-4.2000 S1000
G1 F1000 X459.9639 Y246.0361 Z-4.2000 S1000
G1 F1000 X459.9529 Y246.0196 Z-4.2000 S1000
G1 F1000 X459.9490 Y246.0000 Z-4.2000 S1000
G1 F1000 X459.9529 Y245.9804 Z-4.2000 S1000
G1 F1000 X459.9639 Y245.9639 Z-4.2000 S1000
G1 F1000 X459.9804 Y245.9529 Z-4.2000 S1000
G1 F1000 X460.0000 Y245.9490 Z-4.2000 S1000
G1 F1000 X460.0196 Y245.9529 Z-4.2000 S1000
; Starting inflateGrp: Closed?:true
G1 F300 Z-6.3000
G1 F1000 X460.0361 Y245.9639 Z-6.3000 S1000
G1 F1000 X460.0471 Y245.9804 Z-6.3000 S1000
G1 F1000 X460.0510 Y246.0000 Z-6.3000 S1000
G1 F1000 X460.0471 Y246.0196 Z-6.3000 S1000
G1 F1000 X460.0361 Y246.0361 Z-6.3000 S1000
G1 F1000 X460.0196 Y246.0471 Z-6.3000 S1000
G1 F1000 X460.0000 Y246.0510 Z-6.3000 S1000
G1 F1000 X459.9804 Y246.0471 Z-6.3000 S1000
G1 F1000 X459.9639 Y246.0361 Z-6.3000 S1000
G1 F1000 X459.9529 Y246.0196 Z-6.3000 S1000
G1 F1000 X459.9490 Y246.0000 Z-6.3000 S1000
G1 F1000 X459.9529 Y245.9804 Z-6.3000 S1000
G1 F1000 X459.9639 Y245.9639 Z-6.3000 S1000
G1 F1000 X459.9804 Y245.9529 Z-6.3000 S1000
G1 F1000 X460.0000 Y245.9490 Z-6.3000 S1000
G1 F1000 X460.0196 Y245.9529 Z-6.3000 S1000
; Starting inflateGrp: Closed?:true
G1 F300 Z-8.2000
G1 F1000 X460.0361 Y245.9639 Z-8.2000 S1000
G1 F1000 X460.0471 Y245.9804 Z-8.2000 S1000
G1 F1000 X460.0510 Y246.0000 Z-8.2000 S1000
G1 F1000 X460.0471 Y246.0196 Z-8.2000 S1000
G1 F1000 X460.0361 Y246.0361 Z-8.2000 S1000
G1 F1000 X460.0196 Y246.0471 Z-8.2000 S1000
G1 F1000 X460.0000 Y246.0510 Z-8.2000 S1000
G1 F1000 X459.9804 Y246.0471 Z-8.2000 S1000
G1 F1000 X459.9639 Y246.0361 Z-8.2000 S1000
G1 F1000 X459.9529 Y246.0196 Z-8.2000 S1000
G1 F1000 X459.9490 Y246.0000 Z-8.2000 S1000
G1 F1000 X459.9529 Y245.9804 Z-8.2000 S1000
G1 F1000 X459.9639 Y245.9639 Z-8.2000 S1000
G1 F1000 X459.9804 Y245.9529 Z-8.2000 S1000
G1 F1000 X460.0000 Y245.9490 Z-8.2000 S1000
G1 F1000 X460.0196 Y245.9529 Z-8.2000 S1000
; Starting inflateGrp: Closed?:true

G0 Z10
G0 X10.0196 Y29.9529

G0 Z0
G1 F300 Z-2.1000
G1 F1000 X10.0361 Y29.9639 Z-2.1000 S1000
G1 F1000 X10.0471 Y29.9804 Z-2.1000 S1000
G1 F1000 X10.0510 Y30.0000 Z-2.1000 S1000
G1 F1000 X10.0471 Y30.0196 Z-2.1000 S1000
G1 F1000 X10.0361 Y30.0361 Z-2.1000 S1000
G1 F1000 X10.0196 Y30.0471 Z-2.1000 S1000
G1 F1000 X10.0000 Y30.0510 Z-2.1000 S1000
G1 F1000 X9.9804 Y30.0471 Z-2.1000 S1000
G1 F1000 X9.9639 Y30.0361 Z-2.1000 S1000
G1 F1000 X9.9529 Y30.0196 Z-2.1000 S1000
G1 F1000 X9.9490 Y30.0000 Z-2.1000 S1000
G1 F1000 X9.9529 Y29.9804 Z-2.1000 S1000
G1 F1000 X9.9639 Y29.9639 Z-2.1000 S1000
G1 F1000 X9.9804 Y29.9529 Z-2.1000 S1000
G1 F1000 X10.0000 Y29.9490 Z-2.1000 S1000
G1 F1000 X10.0196 Y29.9529 Z-2.1000 S1000
; Starting inflateGrp: Closed?:true
G1 F300 Z-4.2000
G1 F1000 X10.0361 Y29.9639 Z-4.2000 S1000
G1 F1000 X10.0471 Y29.9804 Z-4.2000 S1000
G1 F1000 X10.0510 Y30.0000 Z-4.2000 S1000
G1 F1000 X10.0471 Y30.0196 Z-4.2000 S1000
G1 F1000 X10.0361 Y30.0361 Z-4.2000 S1000
G1 F1000 X10.0196 Y30.0471 Z-4.2000 S1000
G1 F1000 X10.0000 Y30.0510 Z-4.2000 S1000
G1 F1000 X9.9804 Y30.0471 Z-4.2000 S1000
G1 F1000 X9.9639 Y30.0361 Z-4.2000 S1000
G1 F1000 X9.9529 Y30.0196 Z-4.2000 S1000
G1 F1000 X9.9490 Y30.0000 Z-4.2000 S1000
G1 F1000 X9.9529 Y29.9804 Z-4.2000 S1000
G1 F1000 X9.9639 Y29.9639 Z-4.2000 S1000
G1 F1000 X9.9804 Y29.9529 Z-4.2000 S1000
G1 F1000 X10.0000 Y29.9490 Z-4.2000 S1000
G1 F1000 X10.0196 Y29.9529 Z-4.2000 S1000
; Starting inflateGrp: Closed?:true
G1 F300 Z-6.3000
G1 F1000 X10.0361 Y29.9639 Z-6.3000 S1000
G1 F1000 X10.0471 Y29.9804 Z-6.3000 S1000
G1 F1000 X10.0510 Y30.0000 Z-6.3000 S1000
G1 F1000 X10.0471 Y30.0196 Z-6.3000 S1000
G1 F1000 X10.0361 Y30.0361 Z-6.3000 S1000
G1 F1000 X10.0196 Y30.0471 Z-6.3000 S1000
G1 F1000 X10.0000 Y30.0510 Z-6.3000 S1000
G1 F1000 X9.9804 Y30.0471 Z-6.3000 S1000
G1 F1000 X9.9639 Y30.0361 Z-6.3000 S1000
G1 F1000 X9.9529 Y30.0196 Z-6.3000 S1000
G1 F1000 X9.9490 Y30.0000 Z-6.3000 S1000
G1 F1000 X9.9529 Y29.9804 Z-6.3000 S1000
G1 F1000 X9.9639 Y29.9639 Z-6.3000 S1000
G1 F1000 X9.9804 Y29.9529 Z-6.3000 S1000
G1 F1000 X10.0000 Y29.9490 Z-6.3000 S1000
G1 F1000 X10.0196 Y29.9529 Z-6.3000 S1000
; Starting inflateGrp: Closed?:true
G1 F300 Z-8.2000
G1 F1000 X10.0361 Y29.9639 Z-8.2000 S1000
G1 F1000 X10.0471 Y29.9804 Z-8.2000 S1000
G1 F1000 X10.0510 Y30.0000 Z-8.2000 S1000
G1 F1000 X10.0471 Y30.0196 Z-8.2000 S1000
G1 F1000 X10.0361 Y30.0361 Z-8.2000 S1000
G1 F1000 X10.0196 Y30.0471 Z-8.2000 S1000
G1 F1000 X10.0000 Y30.0510 Z-8.2000 S1000
G1 F1000 X9.9804 Y30.0471 Z-8.2000 S1000
G1 F1000 X9.9639 Y30.0361 Z-8.2000 S1000
G1 F1000 X9.9529 Y30.0196 Z-8.2000 S1000
G1 F1000 X9.9490 Y30.0000 Z-8.2000 S1000
G1 F1000 X9.9529 Y29.9804 Z-8.2000 S1000
G1 F1000 X9.9639 Y29.9639 Z-8.2000 S1000
G1 F1000 X9.9804 Y29.9529 Z-8.2000 S1000
G1 F1000 X10.0000 Y29.9490 Z-8.2000 S1000
G1 F1000 X10.0196 Y29.9529 Z-8.2000 S1000
; Starting inflateGrp: Closed?:true

G0 Z10
G0 X10.0196 Y245.9529

G0 Z0
G1 F300 Z-2.1000
G1 F1000 X10.0361 Y245.9639 Z-2.1000 S1000
G1 F1000 X10.0471 Y245.9804 Z-2.1000 S1000
G1 F1000 X10.0510 Y246.0000 Z-2.1000 S1000
G1 F1000 X10.0471 Y246.0196 Z-2.1000 S1000
G1 F1000 X10.0361 Y246.0361 Z-2.1000 S1000
G1 F1000 X10.0196 Y246.0471 Z-2.1000 S1000
G1 F1000 X10.0000 Y246.0510 Z-2.1000 S1000
G1 F1000 X9.9804 Y246.0471 Z-2.1000 S1000
G1 F1000 X9.9639 Y246.0361 Z-2.1000 S1000
G1 F1000 X9.9529 Y246.0196 Z-2.1000 S1000
G1 F1000 X9.9490 Y246.0000 Z-2.1000 S1000
G1 F1000 X9.9529 Y245.9804 Z-2.1000 S1000
G1 F1000 X9.9639 Y245.9639 Z-2.1000 S1000
G1 F1000 X9.9804 Y245.9529 Z-2.1000 S1000
G1 F1000 X10.0000 Y245.9490 Z-2.1000 S1000
G1 F1000 X10.0196 Y245.9529 Z-2.1000 S1000
; Starting inflateGrp: Closed?:true
G1 F300 Z-4.2000
G1 F1000 X10.0361 Y245.9639 Z-4.2000 S1000
G1 F1000 X10.0471 Y245.9804 Z-4.2000 S1000
G1 F1000 X10.0510 Y246.0000 Z-4.2000 S1000
G1 F1000 X10.0471 Y246.0196 Z-4.2000 S1000
G1 F1000 X10.0361 Y246.0361 Z-4.2000 S1000
G1 F1000 X10.0196 Y246.0471 Z-4.2000 S1000
G1 F1000 X10.0000 Y246.0510 Z-4.2000 S1000
G1 F1000 X9.9804 Y246.0471 Z-4.2000 S1000
G1 F1000 X9.9639 Y246.0361 Z-4.2000 S1000
G1 F1000 X9.9529 Y246.0196 Z-4.2000 S1000
G1 F1000 X9.9490 Y246.0000 Z-4.2000 S1000
G1 F1000 X9.9529 Y245.9804 Z-4.2000 S1000
G1 F1000 X9.9639 Y245.9639 Z-4.2000 S1000
G1 F1000 X9.9804 Y245.9529 Z-4.2000 S1000
G1 F1000 X10.0000 Y245.9490 Z-4.2000 S1000
G1 F1000 X10.0196 Y245.9529 Z-4.2000 S1000
; Starting inflateGrp: Closed?:true
G1 F300 Z-6.3000
G1 F1000 X10.0361 Y245.9639 Z-6.3000 S1000
G1 F1000 X10.0471 Y245.9804 Z-6.3000 S1000
G1 F1000 X10.0510 Y246.0000 Z-6.3000 S1000
G1 F1000 X10.0471 Y246.0196 Z-6.3000 S1000
G1 F1000 X10.0361 Y246.0361 Z-6.3000 S1000
G1 F1000 X10.0196 Y246.0471 Z-6.3000 S1000
G1 F1000 X10.0000 Y246.0510 Z-6.3000 S1000
G1 F1000 X9.9804 Y246.0471 Z-6.3000 S1000
G1 F1000 X9.9639 Y246.0361 Z-6.3000 S1000
G1 F1000 X9.9529 Y246.0196 Z-6.3000 S1000
G1 F1000 X9.9490 Y246.0000 Z-6.3000 S1000
G1 F1000 X9.9529 Y245.9804 Z-6.3000 S1000
G1 F1000 X9.9639 Y245.9639 Z-6.3000 S1000
G1 F1000 X9.9804 Y245.9529 Z-6.3000 S1000
G1 F1000 X10.0000 Y245.9490 Z-6.3000 S1000
G1 F1000 X10.0196 Y245.9529 Z-6.3000 S1000
; Starting inflateGrp: Closed?:true
G1 F300 Z-8.2000
G1 F1000 X10.0361 Y245.9639 Z-8.2000 S1000
G1 F1000 X10.0471 Y245.9804 Z-8.2000 S1000
G1 F1000 X10.0510 Y246.0000 Z-8.2000 S1000
G1 F1000 X10.0471 Y246.0196 Z-8.2000 S1000
G1 F1000 X10.0361 Y246.0361 Z-8.2000 S1000
G1 F1000 X10.0196 Y246.0471 Z-8.2000 S1000
G1 F1000 X10.0000 Y246.0510 Z-8.2000 S1000
G1 F1000 X9.9804 Y246.0471 Z-8.2000 S1000
G1 F1000 X9.9639 Y246.0361 Z-8.2000 S1000
G1 F1000 X9.9529 Y246.0196 Z-8.2000 S1000
G1 F1000 X9.9490 Y246.0000 Z-8.2000 S1000
G1 F1000 X9.9529 Y245.9804 Z-8.2000 S1000
G1 F1000 X9.9639 Y245.9639 Z-8.2000 S1000
G1 F1000 X9.9804 Y245.9529 Z-8.2000 S1000
G1 F1000 X10.0000 Y245.9490 Z-8.2000 S1000
G1 F1000 X10.0196 Y245.9529 Z-8.2000 S1000
; Starting inflateGrp: Closed?:true

G0 Z10
G0 X460.0196 Y29.9529

G0 Z0
G1 F300 Z-2.1000
G1 F1000 X460.0361 Y29.9639 Z-2.1000 S1000
G1 F1000 X460.0471 Y29.9804 Z-2.1000 S1000
G1 F1000 X460.0510 Y30.0000 Z-2.1000 S1000
G1 F1000 X460.0471 Y30.0196 Z-2.1000 S1000
G1 F1000 X460.0361 Y30.0361 Z-2.1000 S1000
G1 F1000 X460.0196 Y30.0471 Z-2.1000 S1000
G1 F1000 X460.0000 Y30.0510 Z-2.1000 S1000
G1 F1000 X459.9804 Y30.0471 Z-2.1000 S1000
G1 F1000 X459.9639 Y30.0361 Z-2.1000 S1000
G1 F1000 X459.9529 Y30.0196 Z-2.1000 S1000
G1 F1000 X459.9490 Y30.0000 Z-2.1000 S1000
G1 F1000 X459.9529 Y29.9804 Z-2.1000 S1000
G1 F1000 X459.9639 Y29.9639 Z-2.1000 S1000
G1 F1000 X459.9804 Y29.9529 Z-2.1000 S1000
G1 F1000 X460.0000 Y29.9490 Z-2.1000 S1000
G1 F1000 X460.0196 Y29.9529 Z-2.1000 S1000
; Starting inflateGrp: Closed?:true
G1 F300 Z-4.2000
G1 F1000 X460.0361 Y29.9639 Z-4.2000 S1000
G1 F1000 X460.0471 Y29.9804 Z-4.2000 S1000
G1 F1000 X460.0510 Y30.0000 Z-4.2000 S1000
G1 F1000 X460.0471 Y30.0196 Z-4.2000 S1000
G1 F1000 X460.0361 Y30.0361 Z-4.2000 S1000
G1 F1000 X460.0196 Y30.0471 Z-4.2000 S1000
G1 F1000 X460.0000 Y30.0510 Z-4.2000 S1000
G1 F1000 X459.9804 Y30.0471 Z-4.2000 S1000
G1 F1000 X459.9639 Y30.0361 Z-4.2000 S1000
G1 F1000 X459.9529 Y30.0196 Z-4.2000 S1000
G1 F1000 X459.9490 Y30.0000 Z-4.2000 S1000
G1 F1000 X459.9529 Y29.9804 Z-4.2000 S1000
G1 F1000 X459.9639 Y29.9639 Z-4.2000 S1000
G1 F1000 X459.9804 Y29.9529 Z-4.2000 S1000
G1 F1000 X460.0000 Y29.9490 Z-4.2000 S1000
G1 F1000 X460.0196 Y29.9529 Z-4.2000 S1000
; Starting inflateGrp: Closed?:true
G1 F300 Z-6.3000
G1 F1000 X460.0361 Y29.9639 Z-6.3000 S1000
G1 F1000 X460.0471 Y29.9804 Z-6.3000 S1000
G1 F1000 X460.0510 Y30.0000 Z-6.3000 S1000
G1 F1000 X460.0471 Y30.0196 Z-6.3000 S1000
G1 F1000 X460.0361 Y30.0361 Z-6.3000 S1000
G1 F1000 X460.0196 Y30.0471 Z-6.3000 S1000
G1 F1000 X460.0000 Y30.0510 Z-6.3000 S1000
G1 F1000 X459.9804 Y30.0471 Z-6.3000 S1000
G1 F1000 X459.9639 Y30.0361 Z-6.3000 S1000
G1 F1000 X459.9529 Y30.0196 Z-6.3000 S1000
G1 F1000 X459.9490 Y30.0000 Z-6.3000 S1000
G1 F1000 X459.9529 Y29.9804 Z-6.3000 S1000
G1 F1000 X459.9639 Y29.9639 Z-6.3000 S1000
G1 F1000 X459.9804 Y29.9529 Z-6.3000 S1000
G1 F1000 X460.0000 Y29.9490 Z-6.3000 S1000
G1 F1000 X460.0196 Y29.9529 Z-6.3000 S1000
; Starting inflateGrp: Closed?:true
G1 F300 Z-8.2000
G1 F1000 X460.0361 Y29.9639 Z-8.2000 S1000
G1 F1000 X460.0471 Y29.9804 Z-8.2000 S1000
G1 F1000 X460.0510 Y30.0000 Z-8.2000 S1000
G1 F1000 X460.0471 Y30.0196 Z-8.2000 S1000
G1 F1000 X460.0361 Y30.0361 Z-8.2000 S1000
G1 F1000 X460.0196 Y30.0471 Z-8.2000 S1000
G1 F1000 X460.0000 Y30.0510 Z-8.2000 S1000
G1 F1000 X459.9804 Y30.0471 Z-8.2000 S1000
G1 F1000 X459.9639 Y30.0361 Z-8.2000 S1000
G1 F1000 X459.9529 Y30.0196 Z-8.2000 S1000
G1 F1000 X459.9490 Y30.0000 Z-8.2000 S1000
G1 F1000 X459.9529 Y29.9804 Z-8.2000 S1000
G1 F1000 X459.9639 Y29.9639 Z-8.2000 S1000
G1 F1000 X459.9804 Y29.9529 Z-8.2000 S1000
G1 F1000 X460.0000 Y29.9490 Z-8.2000 S1000
G1 F1000 X460.0196 Y29.9529 Z-8.2000 S1000
; retracting back to z-safe
G0 Z10
; Operation 1: CNC: Pocket
; Tool Diameter: 5
; Starting inflatedGroup: Closed?:true

G0 Z10
G0 F1000 X298.0000 Y174.0000

G0 Z0
G1 F300 Z-1.0000
G1 F1000 X273.0000 Y174.0000 Z-1.0000 S1000
G1 F1000 X273.0000 Y173.0000 Z-1.0000 S1000
G1 F1000 X298.0000 Y173.0000 Z-1.0000 S1000
G1 F1000 X298.0000 Y174.0000 Z-1.0000 S1000
; Starting inflatedGroup: Closed?:true

G0 Z10
G0 X197.0000 Y174.0000

G0 Z0
G1 F300 Z-1.0000
G1 F1000 X172.0000 Y174.0000 Z-1.0000 S1000
G1 F1000 X172.0000 Y173.0000 Z-1.0000 S1000
G1 F1000 X197.0000 Y173.0000 Z-1.0000 S1000
G1 F1000 X197.0000 Y174.0000 Z-1.0000 S1000
; Starting inflatedGroup: Closed?:true

G0 Z10
G0 X298.0000 Y174.0000

G0 Z0
G1 F300 Z-3.0000
G1 F1000 X273.0000 Y174.0000 Z-3.0000 S1000
G1 F1000 X273.0000 Y173.0000 Z-3.0000 S1000
G1 F1000 X298.0000 Y173.0000 Z-3.0000 S1000
G1 F1000 X298.0000 Y174.0000 Z-3.0000 S1000
; Starting inflatedGroup: Closed?:true

G0 Z10
G0 X197.0000 Y174.0000

G0 Z0
G1 F300 Z-3.0000
G1 F1000 X172.0000 Y174.0000 Z-3.0000 S1000
G1 F1000 X172.0000 Y173.0000 Z-3.0000 S1000
G1 F1000 X197.0000 Y173.0000 Z-3.0000 S1000
G1 F1000 X197.0000 Y174.0000 Z-3.0000 S1000
; Starting inflatedGroup: Closed?:true

G0 Z10
G0 X298.0000 Y174.0000

G0 Z0
G1 F300 Z-5.0000
G1 F1000 X273.0000 Y174.0000 Z-5.0000 S1000
G1 F1000 X273.0000 Y173.0000 Z-5.0000 S1000
G1 F1000 X298.0000 Y173.0000 Z-5.0000 S1000
G1 F1000 X298.0000 Y174.0000 Z-5.0000 S1000
; Starting inflatedGroup: Closed?:true

G0 Z10
G0 X197.0000 Y174.0000

G0 Z0
G1 F300 Z-5.0000
G1 F1000 X172.0000 Y174.0000 Z-5.0000 S1000
G1 F1000 X172.0000 Y173.0000 Z-5.0000 S1000
G1 F1000 X197.0000 Y173.0000 Z-5.0000 S1000
G1 F1000 X197.0000 Y174.0000 Z-5.0000 S1000
; Starting inflatedGroup: Closed?:true

G0 Z10
G0 X298.0000 Y174.0000

G0 Z0
G1 F300 Z-7.0000
G1 F1000 X273.0000 Y174.0000 Z-7.0000 S1000
G1 F1000 X273.0000 Y173.0000 Z-7.0000 S1000
G1 F1000 X298.0000 Y173.0000 Z-7.0000 S1000
G1 F1000 X298.0000 Y174.0000 Z-7.0000 S1000
; Starting inflatedGroup: Closed?:true

G0 Z10
G0 X197.0000 Y174.0000

G0 Z0
G1 F300 Z-7.0000
G1 F1000 X172.0000 Y174.0000 Z-7.0000 S1000
G1 F1000 X172.0000 Y173.0000 Z-7.0000 S1000
G1 F1000 X197.0000 Y173.0000 Z-7.0000 S1000
G1 F1000 X197.0000 Y174.0000 Z-7.0000 S1000
; Starting inflatedGroup: Closed?:true

G0 Z10
G0 X300.0000 Y176.0000

G0 Z0
G1 F300 Z-1.0000
G1 F1000 X271.0000 Y176.0000 Z-1.0000 S1000
G1 F1000 X271.0000 Y171.0000 Z-1.0000 S1000
G1 F1000 X300.0000 Y171.0000 Z-1.0000 S1000
G1 F1000 X300.0000 Y176.0000 Z-1.0000 S1000
; Starting inflatedGroup: Closed?:true

G0 Z10
G0 X199.0000 Y176.0000

G0 Z0
G1 F300 Z-1.0000
G1 F1000 X170.0000 Y176.0000 Z-1.0000 S1000
G1 F1000 X170.0000 Y171.0000 Z-1.0000 S1000
G1 F1000 X199.0000 Y171.0000 Z-1.0000 S1000
G1 F1000 X199.0000 Y176.0000 Z-1.0000 S1000
; Starting inflatedGroup: Closed?:true

G0 Z10
G0 X300.0000 Y176.0000

G0 Z0
G1 F300 Z-3.0000
G1 F1000 X271.0000 Y176.0000 Z-3.0000 S1000
G1 F1000 X271.0000 Y171.0000 Z-3.0000 S1000
G1 F1000 X300.0000 Y171.0000 Z-3.0000 S1000
G1 F1000 X300.0000 Y176.0000 Z-3.0000 S1000
; Starting inflatedGroup: Closed?:true

G0 Z10
G0 X199.0000 Y176.0000

G0 Z0
G1 F300 Z-3.0000
G1 F1000 X170.0000 Y176.0000 Z-3.0000 S1000
G1 F1000 X170.0000 Y171.0000 Z-3.0000 S1000
G1 F1000 X199.0000 Y171.0000 Z-3.0000 S1000
G1 F1000 X199.0000 Y176.0000 Z-3.0000 S1000
; Starting inflatedGroup: Closed?:true

G0 Z10
G0 X300.0000 Y176.0000

G0 Z0
G1 F300 Z-5.0000
G1 F1000 X271.0000 Y176.0000 Z-5.0000 S1000
G1 F1000 X271.0000 Y171.0000 Z-5.0000 S1000
G1 F1000 X300.0000 Y171.0000 Z-5.0000 S1000
G1 F1000 X300.0000 Y176.0000 Z-5.0000 S1000
; Starting inflatedGroup: Closed?:true

G0 Z10
G0 X199.0000 Y176.0000

G0 Z0
G1 F300 Z-5.0000
G1 F1000 X170.0000 Y176.0000 Z-5.0000 S1000
G1 F1000 X170.0000 Y171.0000 Z-5.0000 S1000
G1 F1000 X199.0000 Y171.0000 Z-5.0000 S1000
G1 F1000 X199.0000 Y176.0000 Z-5.0000 S1000
; Starting inflatedGroup: Closed?:true

G0 Z10
G0 X300.0000 Y176.0000

G0 Z0
G1 F300 Z-7.0000
G1 F1000 X271.0000 Y176.0000 Z-7.0000 S1000
G1 F1000 X271.0000 Y171.0000 Z-7.0000 S1000
G1 F1000 X300.0000 Y171.0000 Z-7.0000 S1000
G1 F1000 X300.0000 Y176.0000 Z-7.0000 S1000
; Starting inflatedGroup: Closed?:true

G0 Z10
G0 X199.0000 Y176.0000

G0 Z0
G1 F300 Z-7.0000
G1 F1000 X170.0000 Y176.0000 Z-7.0000 S1000
G1 F1000 X170.0000 Y171.0000 Z-7.0000 S1000
G1 F1000 X199.0000 Y171.0000 Z-7.0000 S1000
G1 F1000 X199.0000 Y176.0000 Z-7.0000 S1000
; Starting inflatedGroup: Closed?:true

G0 Z10
G0 X302.0000 Y178.0000

G0 Z0
G1 F300 Z-1.0000
G1 F1000 X269.0000 Y178.0000 Z-1.0000 S1000
G1 F1000 X269.0000 Y169.0000 Z-1.0000 S1000
G1 F1000 X302.0000 Y169.0000 Z-1.0000 S1000
G1 F1000 X302.0000 Y178.0000 Z-1.0000 S1000
; Starting inflatedGroup: Closed?:true

G0 Z10
G0 X201.0000 Y178.0000

G0 Z0
G1 F300 Z-1.0000
G1 F1000 X168.0000 Y178.0000 Z-1.0000 S1000
G1 F1000 X168.0000 Y169.0000 Z-1.0000 S1000
G1 F1000 X201.0000 Y169.0000 Z-1.0000 S1000
G1 F1000 X201.0000 Y178.0000 Z-1.0000 S1000
; Starting inflatedGroup: Closed?:true

G0 Z10
G0 X302.0000 Y178.0000

G0 Z0
G1 F300 Z-3.0000
G1 F1000 X269.0000 Y178.0000 Z-3.0000 S1000
G1 F1000 X269.0000 Y169.0000 Z-3.0000 S1000
G1 F1000 X302.0000 Y169.0000 Z-3.0000 S1000
G1 F1000 X302.0000 Y178.0000 Z-3.0000 S1000
; Starting inflatedGroup: Closed?:true

G0 Z10
G0 X201.0000 Y178.0000

G0 Z0
G1 F300 Z-3.0000
G1 F1000 X168.0000 Y178.0000 Z-3.0000 S1000
G1 F1000 X168.0000 Y169.0000 Z-3.0000 S1000
G1 F1000 X201.0000 Y169.0000 Z-3.0000 S1000
G1 F1000 X201.0000 Y178.0000 Z-3.0000 S1000
; Starting inflatedGroup: Closed?:true

G0 Z10
G0 X302.0000 Y178.0000

G0 Z0
G1 F300 Z-5.0000
G1 F1000 X269.0000 Y178.0000 Z-5.0000 S1000
G1 F1000 X269.0000 Y169.0000 Z-5.0000 S1000
G1 F1000 X302.0000 Y169.0000 Z-5.0000 S1000
G1 F1000 X302.0000 Y178.0000 Z-5.0000 S1000
; Starting inflatedGroup: Closed?:true

G0 Z10
G0 X201.0000 Y178.0000

G0 Z0
G1 F300 Z-5.0000
G1 F1000 X168.0000 Y178.0000 Z-5.0000 S1000
G1 F1000 X168.0000 Y169.0000 Z-5.0000 S1000
G1 F1000 X201.0000 Y169.0000 Z-5.0000 S1000
G1 F1000 X201.0000 Y178.0000 Z-5.0000 S1000
; Starting inflatedGroup: Closed?:true

G0 Z10
G0 X302.0000 Y178.0000

G0 Z0
G1 F300 Z-7.0000
G1 F1000 X269.0000 Y178.0000 Z-7.0000 S1000
G1 F1000 X269.0000 Y169.0000 Z-7.0000 S1000
G1 F1000 X302.0000 Y169.0000 Z-7.0000 S1000
G1 F1000 X302.0000 Y178.0000 Z-7.0000 S1000
; Starting inflatedGroup: Closed?:true

G0 Z10
G0 X201.0000 Y178.0000

G0 Z0
G1 F300 Z-7.0000
G1 F1000 X168.0000 Y178.0000 Z-7.0000 S1000
G1 F1000 X168.0000 Y169.0000 Z-7.0000 S1000
G1 F1000 X201.0000 Y169.0000 Z-7.0000 S1000
G1 F1000 X201.0000 Y178.0000 Z-7.0000 S1000
; Starting inflatedGroup: Closed?:true

G0 Z10
G0 X303.5000 Y179.5000

G0 Z0
G1 F300 Z-1.0000
G1 F1000 X267.5000 Y179.5000 Z-1.0000 S1000
G1 F1000 X267.5000 Y167.5000 Z-1.0000 S1000
G1 F1000 X303.5000 Y167.5000 Z-1.0000 S1000
G1 F1000 X303.5000 Y179.5000 Z-1.0000 S1000
; Starting inflatedGroup: Closed?:true

G0 Z10
G0 X202.5000 Y179.5000

G0 Z0
G1 F300 Z-1.0000
G1 F1000 X166.5000 Y179.5000 Z-1.0000 S1000
G1 F1000 X166.5000 Y167.5000 Z-1.0000 S1000
G1 F1000 X202.5000 Y167.5000 Z-1.0000 S1000
G1 F1000 X202.5000 Y179.5000 Z-1.0000 S1000
; Starting inflatedGroup: Closed?:true

G0 Z10
G0 X303.5000 Y179.5000

G0 Z0
G1 F300 Z-3.0000
G1 F1000 X267.5000 Y179.5000 Z-3.0000 S1000
G1 F1000 X267.5000 Y167.5000 Z-3.0000 S1000
G1 F1000 X303.5000 Y167.5000 Z-3.0000 S1000
G1 F1000 X303.5000 Y179.5000 Z-3.0000 S1000
; Starting inflatedGroup: Closed?:true

G0 Z10
G0 X202.5000 Y179.5000

G0 Z0
G1 F300 Z-3.0000
G1 F1000 X166.5000 Y179.5000 Z-3.0000 S1000
G1 F1000 X166.5000 Y167.5000 Z-3.0000 S1000
G1 F1000 X202.5000 Y167.5000 Z-3.0000 S1000
G1 F1000 X202.5000 Y179.5000 Z-3.0000 S1000
; Starting inflatedGroup: Closed?:true

G0 Z10
G0 X303.5000 Y179.5000

G0 Z0
G1 F300 Z-5.0000
G1 F1000 X267.5000 Y179.5000 Z-5.0000 S1000
G1 F1000 X267.5000 Y167.5000 Z-5.0000 S1000
G1 F1000 X303.5000 Y167.5000 Z-5.0000 S1000
G1 F1000 X303.5000 Y179.5000 Z-5.0000 S1000
; Starting inflatedGroup: Closed?:true

G0 Z10
G0 X202.5000 Y179.5000

G0 Z0
G1 F300 Z-5.0000
G1 F1000 X166.5000 Y179.5000 Z-5.0000 S1000
G1 F1000 X166.5000 Y167.5000 Z-5.0000 S1000
G1 F1000 X202.5000 Y167.5000 Z-5.0000 S1000
G1 F1000 X202.5000 Y179.5000 Z-5.0000 S1000
; Starting inflatedGroup: Closed?:true

G0 Z10
G0 X303.5000 Y179.5000

G0 Z0
G1 F300 Z-7.0000
G1 F1000 X267.5000 Y179.5000 Z-7.0000 S1000
G1 F1000 X267.5000 Y167.5000 Z-7.0000 S1000
G1 F1000 X303.5000 Y167.5000 Z-7.0000 S1000
G1 F1000 X303.5000 Y179.5000 Z-7.0000 S1000
; Starting inflatedGroup: Closed?:true

G0 Z10
G0 X202.5000 Y179.5000

G0 Z0
G1 F300 Z-7.0000
G1 F1000 X166.5000 Y179.5000 Z-7.0000 S1000
G1 F1000 X166.5000 Y167.5000 Z-7.0000 S1000
G1 F1000 X202.5000 Y167.5000 Z-7.0000 S1000
G1 F1000 X202.5000 Y179.5000 Z-7.0000 S1000
; retracting back to z-safe
G0 Z10
; Operation 2: CNC: Vector (path inside)
; Tool Diameter: 5
; Starting inflateGrp: Closed?:true

G0 Z10
G0 F1000 X205.0154 Y164.9985

G0 Z0
G1 F300 Z-2.0000
G1 F1000 X205.0319 Y165.0095 Z-2.0000 S1000
G1 F1000 X205.0429 Y165.0260 Z-2.0000 S1000
G1 F1000 X205.0468 Y165.0456 Z-2.0000 S1000
G1 F1000 X205.0429 Y165.0652 Z-2.0000 S1000
G1 F1000 X205.0319 Y165.0817 Z-2.0000 S1000
G1 F1000 X205.0154 Y165.0927 Z-2.0000 S1000
G1 F1000 X204.9959 Y165.0966 Z-2.0000 S1000
G1 F1000 X204.9763 Y165.0927 Z-2.0000 S1000
G1 F1000 X204.9598 Y165.0817 Z-2.0000 S1000
G1 F1000 X204.9488 Y165.0652 Z-2.0000 S1000
G1 F1000 X204.9449 Y165.0456 Z-2.0000 S1000
G1 F1000 X204.9488 Y165.0260 Z-2.0000 S1000
G1 F1000 X204.9598 Y165.0095 Z-2.0000 S1000
G1 F1000 X204.9763 Y164.9985 Z-2.0000 S1000
G1 F1000 X204.9959 Y164.9946 Z-2.0000 S1000
G1 F1000 X205.0154 Y164.9985 Z-2.0000 S1000
; Starting inflateGrp: Closed?:true
G1 F300 Z-4.0000
G1 F1000 X205.0319 Y165.0095 Z-4.0000 S1000
G1 F1000 X205.0429 Y165.0260 Z-4.0000 S1000
G1 F1000 X205.0468 Y165.0456 Z-4.0000 S1000
G1 F1000 X205.0429 Y165.0652 Z-4.0000 S1000
G1 F1000 X205.0319 Y165.0817 Z-4.0000 S1000
G1 F1000 X205.0154 Y165.0927 Z-4.0000 S1000
G1 F1000 X204.9959 Y165.0966 Z-4.0000 S1000
G1 F1000 X204.9763 Y165.0927 Z-4.0000 S1000
G1 F1000 X204.9598 Y165.0817 Z-4.0000 S1000
G1 F1000 X204.9488 Y165.0652 Z-4.0000 S1000
G1 F1000 X204.9449 Y165.0456 Z-4.0000 S1000
G1 F1000 X204.9488 Y165.0260 Z-4.0000 S1000
G1 F1000 X204.9598 Y165.0095 Z-4.0000 S1000
G1 F1000 X204.9763 Y164.9985 Z-4.0000 S1000
G1 F1000 X204.9959 Y164.9946 Z-4.0000 S1000
G1 F1000 X205.0154 Y164.9985 Z-4.0000 S1000
; Starting inflateGrp: Closed?:true
G1 F300 Z-6.0000
G1 F1000 X205.0319 Y165.0095 Z-6.0000 S1000
G1 F1000 X205.0429 Y165.0260 Z-6.0000 S1000
G1 F1000 X205.0468 Y165.0456 Z-6.0000 S1000
G1 F1000 X205.0429 Y165.0652 Z-6.0000 S1000
G1 F1000 X205.0319 Y165.0817 Z-6.0000 S1000
G1 F1000 X205.0154 Y165.0927 Z-6.0000 S1000
G1 F1000 X204.9959 Y165.0966 Z-6.0000 S1000
G1 F1000 X204.9763 Y165.0927 Z-6.0000 S1000
G1 F1000 X204.9598 Y165.0817 Z-6.0000 S1000
G1 F1000 X204.9488 Y165.0652 Z-6.0000 S1000
G1 F1000 X204.9449 Y165.0456 Z-6.0000 S1000
G1 F1000 X204.9488 Y165.0260 Z-6.0000 S1000
G1 F1000 X204.9598 Y165.0095 Z-6.0000 S1000
G1 F1000 X204.9763 Y164.9985 Z-6.0000 S1000
G1 F1000 X204.9959 Y164.9946 Z-6.0000 S1000
G1 F1000 X205.0154 Y164.9985 Z-6.0000 S1000
; Starting inflateGrp: Closed?:true
G1 F300 Z-7.0000
G1 F1000 X205.0319 Y165.0095 Z-7.0000 S1000
G1 F1000 X205.0429 Y165.0260 Z-7.0000 S1000
G1 F1000 X205.0468 Y165.0456 Z-7.0000 S1000
G1 F1000 X205.0429 Y165.0652 Z-7.0000 S1000
G1 F1000 X205.0319 Y165.0817 Z-7.0000 S1000
G1 F1000 X205.0154 Y165.0927 Z-7.0000 S1000
G1 F1000 X204.9959 Y165.0966 Z-7.0000 S1000
G1 F1000 X204.9763 Y165.0927 Z-7.0000 S1000
G1 F1000 X204.9598 Y165.0817 Z-7.0000 S1000
G1 F1000 X204.9488 Y165.0652 Z-7.0000 S1000
G1 F1000 X204.9449 Y165.0456 Z-7.0000 S1000
G1 F1000 X204.9488 Y165.0260 Z-7.0000 S1000
G1 F1000 X204.9598 Y165.0095 Z-7.0000 S1000
G1 F1000 X204.9763 Y164.9985 Z-7.0000 S1000
G1 F1000 X204.9959 Y164.9946 Z-7.0000 S1000
G1 F1000 X205.0154 Y164.9985 Z-7.0000 S1000
; Starting inflateGrp: Closed?:true

G0 Z10
G0 X265.0400 Y165.0319

G0 Z0
G1 F300 Z-2.0000
G1 F1000 X265.0565 Y165.0429 Z-2.0000 S1000
G1 F1000 X265.0677 Y165.0596 Z-2.0000 S1000
G1 F1000 X265.0715 Y165.0790 Z-2.0000 S1000
G1 F1000 X265.0677 Y165.0984 Z-2.0000 S1000
G1 F1000 X265.0565 Y165.1151 Z-2.0000 S1000
G1 F1000 X265.0400 Y165.1261 Z-2.0000 S1000
G1 F1000 X265.0205 Y165.1300 Z-2.0000 S1000
G1 F1000 X265.0009 Y165.1261 Z-2.0000 S1000
G1 F1000 X264.9844 Y165.1151 Z-2.0000 S1000
G1 F1000 X264.9734 Y165.0986 Z-2.0000 S1000
G1 F1000 X264.9695 Y165.0790 Z-2.0000 S1000
G1 F1000 X264.9734 Y165.0594 Z-2.0000 S1000
G1 F1000 X264.9844 Y165.0429 Z-2.0000 S1000
G1 F1000 X265.0009 Y165.0319 Z-2.0000 S1000
G1 F1000 X265.0205 Y165.0280 Z-2.0000 S1000
G1 F1000 X265.0400 Y165.0319 Z-2.0000 S1000
; Starting inflateGrp: Closed?:true
G1 F300 Z-4.0000
G1 F1000 X265.0565 Y165.0429 Z-4.0000 S1000
G1 F1000 X265.0677 Y165.0596 Z-4.0000 S1000
G1 F1000 X265.0715 Y165.0790 Z-4.0000 S1000
G1 F1000 X265.0677 Y165.0984 Z-4.0000 S1000
G1 F1000 X265.0565 Y165.1151 Z-4.0000 S1000
G1 F1000 X265.0400 Y165.1261 Z-4.0000 S1000
G1 F1000 X265.0205 Y165.1300 Z-4.0000 S1000
G1 F1000 X265.0009 Y165.1261 Z-4.0000 S1000
G1 F1000 X264.9844 Y165.1151 Z-4.0000 S1000
G1 F1000 X264.9734 Y165.0986 Z-4.0000 S1000
G1 F1000 X264.9695 Y165.0790 Z-4.0000 S1000
G1 F1000 X264.9734 Y165.0594 Z-4.0000 S1000
G1 F1000 X264.9844 Y165.0429 Z-4.0000 S1000
G1 F1000 X265.0009 Y165.0319 Z-4.0000 S1000
G1 F1000 X265.0205 Y165.0280 Z-4.0000 S1000
G1 F1000 X265.0400 Y165.0319 Z-4.0000 S1000
; Starting inflateGrp: Closed?:true
G1 F300 Z-6.0000
G1 F1000 X265.0565 Y165.0429 Z-6.0000 S1000
G1 F1000 X265.0677 Y165.0596 Z-6.0000 S1000
G1 F1000 X265.0715 Y165.0790 Z-6.0000 S1000
G1 F1000 X265.0677 Y165.0984 Z-6.0000 S1000
G1 F1000 X265.0565 Y165.1151 Z-6.0000 S1000
G1 F1000 X265.0400 Y165.1261 Z-6.0000 S1000
G1 F1000 X265.0205 Y165.1300 Z-6.0000 S1000
G1 F1000 X265.0009 Y165.1261 Z-6.0000 S1000
G1 F1000 X264.9844 Y165.1151 Z-6.0000 S1000
G1 F1000 X264.9734 Y165.0986 Z-6.0000 S1000
G1 F1000 X264.9695 Y165.0790 Z-6.0000 S1000
G1 F1000 X264.9734 Y165.0594 Z-6.0000 S1000
G1 F1000 X264.9844 Y165.0429 Z-6.0000 S1000
G1 F1000 X265.0009 Y165.0319 Z-6.0000 S1000
G1 F1000 X265.0205 Y165.0280 Z-6.0000 S1000
G1 F1000 X265.0400 Y165.0319 Z-6.0000 S1000
; Starting inflateGrp: Closed?:true
G1 F300 Z-7.0000
G1 F1000 X265.0565 Y165.0429 Z-7.0000 S1000
G1 F1000 X265.0677 Y165.0596 Z-7.0000 S1000
G1 F1000 X265.0715 Y165.0790 Z-7.0000 S1000
G1 F1000 X265.0677 Y165.0984 Z-7.0000 S1000
G1 F1000 X265.0565 Y165.1151 Z-7.0000 S1000
G1 F1000 X265.0400 Y165.1261 Z-7.0000 S1000
G1 F1000 X265.0205 Y165.1300 Z-7.0000 S1000
G1 F1000 X265.0009 Y165.1261 Z-7.0000 S1000
G1 F1000 X264.9844 Y165.1151 Z-7.0000 S1000
G1 F1000 X264.9734 Y165.0986 Z-7.0000 S1000
G1 F1000 X264.9695 Y165.0790 Z-7.0000 S1000
G1 F1000 X264.9734 Y165.0594 Z-7.0000 S1000
G1 F1000 X264.9844 Y165.0429 Z-7.0000 S1000
G1 F1000 X265.0009 Y165.0319 Z-7.0000 S1000
G1 F1000 X265.0205 Y165.0280 Z-7.0000 S1000
G1 F1000 X265.0400 Y165.0319 Z-7.0000 S1000
; Starting inflateGrp: Closed?:true

G0 Z10
G0 X164.0563 Y165.0319

G0 Z0
G1 F300 Z-2.0000
G1 F1000 X164.0728 Y165.0429 Z-2.0000 S1000
G1 F1000 X164.0839 Y165.0596 Z-2.0000 S1000
G1 F1000 X164.0878 Y165.0790 Z-2.0000 S1000
G1 F1000 X164.0839 Y165.0984 Z-2.0000 S1000
G1 F1000 X164.0728 Y165.1151 Z-2.0000 S1000
G1 F1000 X164.0563 Y165.1261 Z-2.0000 S1000
G1 F1000 X164.0368 Y165.1300 Z-2.0000 S1000
G1 F1000 X164.0172 Y165.1261 Z-2.0000 S1000
G1 F1000 X164.0007 Y165.1151 Z-2.0000 S1000
G1 F1000 X163.9897 Y165.0986 Z-2.0000 S1000
G1 F1000 X163.9858 Y165.0790 Z-2.0000 S1000
G1 F1000 X163.9897 Y165.0594 Z-2.0000 S1000
G1 F1000 X164.0007 Y165.0429 Z-2.0000 S1000
G1 F1000 X164.0172 Y165.0319 Z-2.0000 S1000
G1 F1000 X164.0368 Y165.0280 Z-2.0000 S1000
G1 F1000 X164.0563 Y165.0319 Z-2.0000 S1000
; Starting inflateGrp: Closed?:true
G1 F300 Z-4.0000
G1 F1000 X164.0728 Y165.0429 Z-4.0000 S1000
G1 F1000 X164.0839 Y165.0596 Z-4.0000 S1000
G1 F1000 X164.0878 Y165.0790 Z-4.0000 S1000
G1 F1000 X164.0839 Y165.0984 Z-4.0000 S1000
G1 F1000 X164.0728 Y165.1151 Z-4.0000 S1000
G1 F1000 X164.0563 Y165.1261 Z-4.0000 S1000
G1 F1000 X164.0368 Y165.1300 Z-4.0000 S1000
G1 F1000 X164.0172 Y165.1261 Z-4.0000 S1000
G1 F1000 X164.0007 Y165.1151 Z-4.0000 S1000
G1 F1000 X163.9897 Y165.0986 Z-4.0000 S1000
G1 F1000 X163.9858 Y165.0790 Z-4.0000 S1000
G1 F1000 X163.9897 Y165.0594 Z-4.0000 S1000
G1 F1000 X164.0007 Y165.0429 Z-4.0000 S1000
G1 F1000 X164.0172 Y165.0319 Z-4.0000 S1000
G1 F1000 X164.0368 Y165.0280 Z-4.0000 S1000
G1 F1000 X164.0563 Y165.0319 Z-4.0000 S1000
; Starting inflateGrp: Closed?:true
G1 F300 Z-6.0000
G1 F1000 X164.0728 Y165.0429 Z-6.0000 S1000
G1 F1000 X164.0839 Y165.0596 Z-6.0000 S1000
G1 F1000 X164.0878 Y165.0790 Z-6.0000 S1000
G1 F1000 X164.0839 Y165.0984 Z-6.0000 S1000
G1 F1000 X164.0728 Y165.1151 Z-6.0000 S1000
G1 F1000 X164.0563 Y165.1261 Z-6.0000 S1000
G1 F1000 X164.0368 Y165.1300 Z-6.0000 S1000
G1 F1000 X164.0172 Y165.1261 Z-6.0000 S1000
G1 F1000 X164.0007 Y165.1151 Z-6.0000 S1000
G1 F1000 X163.9897 Y165.0986 Z-6.0000 S1000
G1 F1000 X163.9858 Y165.0790 Z-6.0000 S1000
G1 F1000 X163.9897 Y165.0594 Z-6.0000 S1000
G1 F1000 X164.0007 Y165.0429 Z-6.0000 S1000
G1 F1000 X164.0172 Y165.0319 Z-6.0000 S1000
G1 F1000 X164.0368 Y165.0280 Z-6.0000 S1000
G1 F1000 X164.0563 Y165.0319 Z-6.0000 S1000
; Starting inflateGrp: Closed?:true
G1 F300 Z-7.0000
G1 F1000 X164.0728 Y165.0429 Z-7.0000 S1000
G1 F1000 X164.0839 Y165.0596 Z-7.0000 S1000
G1 F1000 X164.0878 Y165.0790 Z-7.0000 S1000
G1 F1000 X164.0839 Y165.0984 Z-7.0000 S1000
G1 F1000 X164.0728 Y165.1151 Z-7.0000 S1000
G1 F1000 X164.0563 Y165.1261 Z-7.0000 S1000
G1 F1000 X164.0368 Y165.1300 Z-7.0000 S1000
G1 F1000 X164.0172 Y165.1261 Z-7.0000 S1000
G1 F1000 X164.0007 Y165.1151 Z-7.0000 S1000
G1 F1000 X163.9897 Y165.0986 Z-7.0000 S1000
G1 F1000 X163.9858 Y165.0790 Z-7.0000 S1000
G1 F1000 X163.9897 Y165.0594 Z-7.0000 S1000
G1 F1000 X164.0007 Y165.0429 Z-7.0000 S1000
G1 F1000 X164.0172 Y165.0319 Z-7.0000 S1000
G1 F1000 X164.0368 Y165.0280 Z-7.0000 S1000
G1 F1000 X164.0563 Y165.0319 Z-7.0000 S1000
; Starting inflateGrp: Closed?:true

G0 Z10
G0 X305.9991 Y164.9985

G0 Z0
G1 F300 Z-2.0000
G1 F1000 X306.0156 Y165.0095 Z-2.0000 S1000
G1 F1000 X306.0266 Y165.0260 Z-2.0000 S1000
G1 F1000 X306.0305 Y165.0456 Z-2.0000 S1000
G1 F1000 X306.0266 Y165.0652 Z-2.0000 S1000
G1 F1000 X306.0156 Y165.0817 Z-2.0000 S1000
G1 F1000 X305.9991 Y165.0927 Z-2.0000 S1000
G1 F1000 X305.9795 Y165.0966 Z-2.0000 S1000
G1 F1000 X305.9600 Y165.0927 Z-2.0000 S1000
G1 F1000 X305.9435 Y165.0817 Z-2.0000 S1000
G1 F1000 X305.9323 Y165.0650 Z-2.0000 S1000
G1 F1000 X305.9285 Y165.0456 Z-2.0000 S1000
G1 F1000 X305.9323 Y165.0262 Z-2.0000 S1000
G1 F1000 X305.9435 Y165.0095 Z-2.0000 S1000
G1 F1000 X305.9600 Y164.9985 Z-2.0000 S1000
G1 F1000 X305.9795 Y164.9946 Z-2.0000 S1000
G1 F1000 X305.9991 Y164.9985 Z-2.0000 S1000
; Starting inflateGrp: Closed?:true
G1 F300 Z-4.0000
G1 F1000 X306.0156 Y165.0095 Z-4.0000 S1000
G1 F1000 X306.0266 Y165.0260 Z-4.0000 S1000
G1 F1000 X306.0305 Y165.0456 Z-4.0000 S1000
G1 F1000 X306.0266 Y165.0652 Z-4.0000 S1000
G1 F1000 X306.0156 Y165.0817 Z-4.0000 S1000
G1 F1000 X305.9991 Y165.0927 Z-4.0000 S1000
G1 F1000 X305.9795 Y165.0966 Z-4.0000 S1000
G1 F1000 X305.9600 Y165.0927 Z-4.0000 S1000
G1 F1000 X305.9435 Y165.0817 Z-4.0000 S1000
G1 F1000 X305.9323 Y165.0650 Z-4.0000 S1000
G1 F1000 X305.9285 Y165.0456 Z-4.0000 S1000
G1 F1000 X305.9323 Y165.0262 Z-4.0000 S1000
G1 F1000 X305.9435 Y165.0095 Z-4.0000 S1000
G1 F1000 X305.9600 Y164.9985 Z-4.0000 S1000
G1 F1000 X305.9795 Y164.9946 Z-4.0000 S1000
G1 F1000 X305.9991 Y164.9985 Z-4.0000 S1000
; Starting inflateGrp: Closed?:true
G1 F300 Z-6.0000
G1 F1000 X306.0156 Y165.0095 Z-6.0000 S1000
G1 F1000 X306.0266 Y165.0260 Z-6.0000 S1000
G1 F1000 X306.0305 Y165.0456 Z-6.0000 S1000
G1 F1000 X306.0266 Y165.0652 Z-6.0000 S1000
G1 F1000 X306.0156 Y165.0817 Z-6.0000 S1000
G1 F1000 X305.9991 Y165.0927 Z-6.0000 S1000
G1 F1000 X305.9795 Y165.0966 Z-6.0000 S1000
G1 F1000 X305.9600 Y165.0927 Z-6.0000 S1000
G1 F1000 X305.9435 Y165.0817 Z-6.0000 S1000
G1 F1000 X305.9323 Y165.0650 Z-6.0000 S1000
G1 F1000 X305.9285 Y165.0456 Z-6.0000 S1000
G1 F1000 X305.9323 Y165.0262 Z-6.0000 S1000
G1 F1000 X305.9435 Y165.0095 Z-6.0000 S1000
G1 F1000 X305.9600 Y164.9985 Z-6.0000 S1000
G1 F1000 X305.9795 Y164.9946 Z-6.0000 S1000
G1 F1000 X305.9991 Y164.9985 Z-6.0000 S1000
; Starting inflateGrp: Closed?:true
G1 F300 Z-7.0000
G1 F1000 X306.0156 Y165.0095 Z-7.0000 S1000
G1 F1000 X306.0266 Y165.0260 Z-7.0000 S1000
G1 F1000 X306.0305 Y165.0456 Z-7.0000 S1000
G1 F1000 X306.0266 Y165.0652 Z-7.0000 S1000
G1 F1000 X306.0156 Y165.0817 Z-7.0000 S1000
G1 F1000 X305.9991 Y165.0927 Z-7.0000 S1000
G1 F1000 X305.9795 Y165.0966 Z-7.0000 S1000
G1 F1000 X305.9600 Y165.0927 Z-7.0000 S1000
G1 F1000 X305.9435 Y165.0817 Z-7.0000 S1000
G1 F1000 X305.9323 Y165.0650 Z-7.0000 S1000
G1 F1000 X305.9285 Y165.0456 Z-7.0000 S1000
G1 F1000 X305.9323 Y165.0262 Z-7.0000 S1000
G1 F1000 X305.9435 Y165.0095 Z-7.0000 S1000
G1 F1000 X305.9600 Y164.9985 Z-7.0000 S1000
G1 F1000 X305.9795 Y164.9946 Z-7.0000 S1000
G1 F1000 X305.9991 Y164.9985 Z-7.0000 S1000
; retracting back to z-safe
G0 Z10
; Operation 3: CNC: Vector (path outside)
; Tool Diameter: 5
; Starting inflateGrp: Closed?:true

G0 Z10
G0 F1000 X470.0002 Y-2.4999

G0 Z0
G1 F300 Z-2.1000
G1 F1000 X0.0000 Y-2.4999 Z-2.1000 S1000
G1 F1000 X-0.7508 Y-2.3845 Z-2.1000 S1000
G1 F1000 X-1.3241 Y-2.1204 Z-2.1000 S1000
G1 F1000 X-1.8130 Y-1.7212 Z-2.1000 S1000
G1 F1000 X-2.1864 Y-1.2123 Z-2.1000 S1000
G1 F1000 X-2.4203 Y-0.6260 Z-2.1000 S1000
G1 F1000 X-2.5000 Y0.0001 Z-2.1000 S1000
G1 F1000 X-2.5000 Y256.0000 Z-2.1000 S1000
G1 F1000 X-2.3846 Y256.7508 Z-2.1000 S1000
G1 F1000 X-2.1205 Y257.3241 Z-2.1000 S1000
G1 F1000 X-1.7213 Y257.8130 Z-2.1000 S1000
G1 F1000 X-1.2124 Y258.1864 Z-2.1000 S1000
G1 F1000 X-0.6261 Y258.4203 Z-2.1000 S1000
G1 F1000 X0.0000 Y258.5000 Z-2.1000 S1000
G1 F1000 X163.9998 Y258.5000 Z-2.1000 S1000
G1 F1000 X164.7506 Y258.3846 Z-2.1000 S1000
G1 F1000 X165.3239 Y258.1205 Z-2.1000 S1000
G1 F1000 X165.8128 Y257.7213 Z-2.1000 S1000
G1 F1000 X166.1862 Y257.2124 Z-2.1000 S1000
G1 F1000 X166.4201 Y256.6261 Z-2.1000 S1000
G1 F1000 X166.4998 Y256.0000 Z-2.1000 S1000
G1 F1000 X166.4998 Y184.2999 Z-2.1000 S1000
G1 F1000 X202.4999 Y184.2999 Z-2.1000 S1000
G1 F1000 X202.4999 Y186.0001 Z-2.1000 S1000
G1 F1000 X202.6153 Y186.7509 Z-2.1000 S1000
G1 F1000 X202.8794 Y187.3242 Z-2.1000 S1000
G1 F1000 X203.2786 Y187.8131 Z-2.1000 S1000
G1 F1000 X203.7875 Y188.1865 Z-2.1000 S1000
G1 F1000 X204.3738 Y188.4204 Z-2.1000 S1000
G1 F1000 X204.9999 Y188.5001 Z-2.1000 S1000
G1 F1000 X264.9998 Y188.5001 Z-2.1000 S1000
G1 F1000 X265.7506 Y188.3847 Z-2.1000 S1000
G1 F1000 X266.3239 Y188.1206 Z-2.1000 S1000
G1 F1000 X266.8128 Y187.7214 Z-2.1000 S1000
G1 F1000 X267.1862 Y187.2125 Z-2.1000 S1000
G1 F1000 X267.4201 Y186.6262 Z-2.1000 S1000
G1 F1000 X267.4998 Y186.0001 Z-2.1000 S1000
G1 F1000 X267.4998 Y184.2999 Z-2.1000 S1000
G1 F1000 X303.4999 Y184.2999 Z-2.1000 S1000
G1 F1000 X303.4999 Y256.0000 Z-2.1000 S1000
G1 F1000 X303.6153 Y256.7508 Z-2.1000 S1000
G1 F1000 X303.8794 Y257.3241 Z-2.1000 S1000
G1 F1000 X304.2786 Y257.8130 Z-2.1000 S1000
G1 F1000 X304.7875 Y258.1864 Z-2.1000 S1000
G1 F1000 X305.3738 Y258.4203 Z-2.1000 S1000
G1 F1000 X305.9999 Y258.5000 Z-2.1000 S1000
G1 F1000 X470.0002 Y258.5000 Z-2.1000 S1000
G1 F1000 X470.7510 Y258.3846 Z-2.1000 S1000
G1 F1000 X471.3243 Y258.1205 Z-2.1000 S1000
G1 F1000 X471.8132 Y257.7213 Z-2.1000 S1000
G1 F1000 X472.1866 Y257.2124 Z-2.1000 S1000
G1 F1000 X472.4205 Y256.6261 Z-2.1000 S1000
G1 F1000 X472.5002 Y256.0000 Z-2.1000 S1000
G1 F1000 X472.5002 Y0.0001 Z-2.1000 S1000
G1 F1000 X472.3848 Y-0.7507 Z-2.1000 S1000
G1 F1000 X472.1207 Y-1.3240 Z-2.1000 S1000
G1 F1000 X471.7215 Y-1.8129 Z-2.1000 S1000
G1 F1000 X471.2126 Y-2.1863 Z-2.1000 S1000
G1 F1000 X470.6263 Y-2.4202 Z-2.1000 S1000
G1 F1000 X470.0002 Y-2.4999 Z-2.1000 S1000
; Starting inflateGrp: Closed?:true
G1 F300 Z-4.2000
G1 F1000 X358.0002 Y-2.4999 Z-4.2000 S1000
G1 F1000 X358.0002 Y-2.4999 Z-4.2000 S1000
G1 F1000 X347.0002 Y-2.4999 Z-4.2000 S1000
G1 F1000 X347.0002 Y-2.4999 Z-4.2000 S1000
G1 F1000 X235.0001 Y-2.4999 Z-4.2000 S1000
G1 F1000 X123.0001 Y-2.4999 Z-4.2000 S1000
G1 F1000 X123.0001 Y-2.4999 Z-4.2000 S1000
G1 F1000 X112.0001 Y-2.4999 Z-4.2000 S1000
G1 F1000 X112.0001 Y-2.4999 Z-4.2000 S1000
G1 F1000 X0.0000 Y-2.4999 Z-4.2000 S1000
G1 F1000 X0.0000 Y-2.4999 Z-4.2000 S1000
G1 F1000 X-0.7508 Y-2.3845 Z-4.2000 S1000
G1 F1000 X-1.3241 Y-2.1204 Z-4.2000 S1000
G1 F1000 X-1.8130 Y-1.7212 Z-4.2000 S1000
G1 F1000 X-2.1864 Y-1.2123 Z-4.2000 S1000
G1 F1000 X-2.4203 Y-0.6260 Z-4.2000 S1000
G1 F1000 X-2.5000 Y0.0001 Z-4.2000 S1000
G1 F1000 X-2.5000 Y122.5001 Z-4.2000 S1000
G1 F1000 X-2.5000 Y122.5001 Z-4.2000 S1000
G1 F1000 X-2.5000 Y133.5000 Z-4.2000 S1000
G1 F1000 X-2.5000 Y133.5000 Z-4.2000 S1000
G1 F1000 X-2.5000 Y256.0000 Z-4.2000 S1000
G1 F1000 X-2.5000 Y256.0000 Z-4.2000 S1000
G1 F1000 X-2.3846 Y256.7508 Z-4.2000 S1000
G1 F1000 X-2.1205 Y257.3241 Z-4.2000 S1000
G1 F1000 X-1.7213 Y257.8130 Z-4.2000 S1000
G1 F1000 X-1.2124 Y258.1864 Z-4.2000 S1000
G1 F1000 X-0.6261 Y258.4203 Z-4.2000 S1000
G1 F1000 X0.0000 Y258.5000 Z-4.2000 S1000
G1 F1000 X163.9998 Y258.5000 Z-4.2000 S1000
G1 F1000 X164.7506 Y258.3846 Z-4.2000 S1000
G1 F1000 X165.3239 Y258.1205 Z-4.2000 S1000
G1 F1000 X165.8128 Y257.7213 Z-4.2000 S1000
G1 F1000 X166.1862 Y257.2124 Z-4.2000 S1000
G1 F1000 X166.4201 Y256.6261 Z-4.2000 S1000
G1 F1000 X166.4998 Y256.0000 Z-4.2000 S1000
G1 F1000 X166.4998 Y184.2999 Z-4.2000 S1000
G1 F1000 X202.4999 Y184.2999 Z-4.2000 S1000
G1 F1000 X202.4999 Y186.0001 Z-4.2000 S1000
G1 F1000 X202.6153 Y186.7509 Z-4.2000 S1000
G1 F1000 X202.8794 Y187.3242 Z-4.2000 S1000
G1 F1000 X203.2786 Y187.8131 Z-4.2000 S1000
G1 F1000 X203.7875 Y188.1865 Z-4.2000 S1000
G1 F1000 X204.3738 Y188.4204 Z-4.2000 S1000
G1 F1000 X204.9999 Y188.5001 Z-4.2000 S1000
G1 F1000 X264.9998 Y188.5001 Z-4.2000 S1000
G1 F1000 X265.7506 Y188.3847 Z-4.2000 S1000
G1 F1000 X266.3239 Y188.1206 Z-4.2000 S1000
G1 F1000 X266.8128 Y187.7214 Z-4.2000 S1000
G1 F1000 X267.1862 Y187.2125 Z-4.2000 S1000
G1 F1000 X267.4201 Y186.6262 Z-4.2000 S1000
G1 F1000 X267.4998 Y186.0001 Z-4.2000 S1000
G1 F1000 X267.4998 Y184.2999 Z-4.2000 S1000
G1 F1000 X303.4999 Y184.2999 Z-4.2000 S1000
G1 F1000 X303.4999 Y256.0000 Z-4.2000 S1000
G1 F1000 X303.6153 Y256.7508 Z-4.2000 S1000
G1 F1000 X303.8794 Y257.3241 Z-4.2000 S1000
G1 F1000 X304.2786 Y257.8130 Z-4.2000 S1000
G1 F1000 X304.7875 Y258.1864 Z-4.2000 S1000
G1 F1000 X305.3738 Y258.4203 Z-4.2000 S1000
G1 F1000 X305.9999 Y258.5000 Z-4.2000 S1000
G1 F1000 X470.0002 Y258.5000 Z-4.2000 S1000
G1 F1000 X470.7510 Y258.3846 Z-4.2000 S1000
G1 F1000 X471.3243 Y258.1205 Z-4.2000 S1000
G1 F1000 X471.8132 Y257.7213 Z-4.2000 S1000
G1 F1000 X472.1866 Y257.2124 Z-4.2000 S1000
G1 F1000 X472.4205 Y256.6261 Z-4.2000 S1000
G1 F1000 X472.5002 Y256.0000 Z-4.2000 S1000
G1 F1000 X472.5002 Y133.5000 Z-4.2000 S1000
G1 F1000 X472.5002 Y133.5000 Z-4.2000 S1000
G1 F1000 X472.5002 Y122.5000 Z-4.2000 S1000
G1 F1000 X472.5002 Y122.5000 Z-4.2000 S1000
G1 F1000 X472.5002 Y0.0001 Z-4.2000 S1000
G1 F1000 X472.5002 Y0.0001 Z-4.2000 S1000
G1 F1000 X472.3848 Y-0.7507 Z-4.2000 S1000
G1 F1000 X472.1207 Y-1.3240 Z-4.2000 S1000
G1 F1000 X471.7215 Y-1.8129 Z-4.2000 S1000
G1 F1000 X471.2126 Y-2.1863 Z-4.2000 S1000
G1 F1000 X470.6263 Y-2.4202 Z-4.2000 S1000
G1 F1000 X470.0002 Y-2.4999 Z-4.2000 S1000
; Starting inflateGrp: Closed?:true
G1 F300 Z-6.3000
G1 F1000 X358.0002 Y-2.4999 Z-6.3000 S1000
G1 F1000 X358.0002 Y-2.4999 Z-4.2000 S1000
G1 F1000 X347.0002 Y-2.4999 Z-4.2000 S1000
G1 F1000 X347.0002 Y-2.4999 Z-6.3000 S1000
G1 F1000 X235.0001 Y-2.4999 Z-6.3000 S1000
G1 F1000 X123.0001 Y-2.4999 Z-6.3000 S1000
G1 F1000 X123.0001 Y-2.4999 Z-4.2000 S1000
G1 F1000 X112.0001 Y-2.4999 Z-4.2000 S1000
G1 F1000 X112.0001 Y-2.4999 Z-6.3000 S1000
G1 F1000 X0.0000 Y-2.4999 Z-6.3000 S1000
G1 F1000 X0.0000 Y-2.4999 Z-6.3000 S1000
G1 F1000 X-0.7508 Y-2.3845 Z-6.3000 S1000
G1 F1000 X-1.3241 Y-2.1204 Z-6.3000 S1000
G1 F1000 X-1.8130 Y-1.7212 Z-6.3000 S1000
G1 F1000 X-2.1864 Y-1.2123 Z-6.3000 S1000
G1 F1000 X-2.4203 Y-0.6260 Z-6.3000 S1000
G1 F1000 X-2.5000 Y0.0001 Z-6.3000 S1000
G1 F1000 X-2.5000 Y122.5001 Z-6.3000 S1000
G1 F1000 X-2.5000 Y122.5001 Z-4.2000 S1000
G1 F1000 X-2.5000 Y133.5000 Z-4.2000 S1000
G1 F1000 X-2.5000 Y133.5000 Z-6.3000 S1000
G1 F1000 X-2.5000 Y256.0000 Z-6.3000 S1000
G1 F1000 X-2.5000 Y256.0000 Z-6.3000 S1000
G1 F1000 X-2.3846 Y256.7508 Z-6.3000 S1000
G1 F1000 X-2.1205 Y257.3241 Z-6.3000 S1000
G1 F1000 X-1.7213 Y257.8130 Z-6.3000 S1000
G1 F1000 X-1.2124 Y258.1864 Z-6.3000 S1000
G1 F1000 X-0.6261 Y258.4203 Z-6.3000 S1000
G1 F1000 X0.0000 Y258.5000 Z-6.3000 S1000
G1 F1000 X163.9998 Y258.5000 Z-6.3000 S1000
G1 F1000 X164.7506 Y258.3846 Z-6.3000 S1000
G1 F1000 X165.3239 Y258.1205 Z-6.3000 S1000
G1 F1000 X165.8128 Y257.7213 Z-6.3000 S1000
G1 F1000 X166.1862 Y257.2124 Z-6.3000 S1000
G1 F1000 X166.4201 Y256.6261 Z-6.3000 S1000
G1 F1000 X166.4998 Y256.0000 Z-6.3000 S1000
G1 F1000 X166.4998 Y184.2999 Z-6.3000 S1000
G1 F1000 X202.4999 Y184.2999 Z-6.3000 S1000
G1 F1000 X202.4999 Y186.0001 Z-6.3000 S1000
G1 F1000 X202.6153 Y186.7509 Z-6.3000 S1000
G1 F1000 X202.8794 Y187.3242 Z-6.3000 S1000
G1 F1000 X203.2786 Y187.8131 Z-6.3000 S1000
G1 F1000 X203.7875 Y188.1865 Z-6.3000 S1000
G1 F1000 X204.3738 Y188.4204 Z-6.3000 S1000
G1 F1000 X204.9999 Y188.5001 Z-6.3000 S1000
G1 F1000 X264.9998 Y188.5001 Z-6.3000 S1000
G1 F1000 X265.7506 Y188.3847 Z-6.3000 S1000
G1 F1000 X266.3239 Y188.1206 Z-6.3000 S1000
G1 F1000 X266.8128 Y187.7214 Z-6.3000 S1000
G1 F1000 X267.1862 Y187.2125 Z-6.3000 S1000
G1 F1000 X267.4201 Y186.6262 Z-6.3000 S1000
G1 F1000 X267.4998 Y186.0001 Z-6.3000 S1000
G1 F1000 X267.4998 Y184.2999 Z-6.3000 S1000
G1 F1000 X303.4999 Y184.2999 Z-6.3000 S1000
G1 F1000 X303.4999 Y256.0000 Z-6.3000 S1000
G1 F1000 X303.6153 Y256.7508 Z-6.3000 S1000
G1 F1000 X303.8794 Y257.3241 Z-6.3000 S1000
G1 F1000 X304.2786 Y257.8130 Z-6.3000 S1000
G1 F1000 X304.7875 Y258.1864 Z-6.3000 S1000
G1 F1000 X305.3738 Y258.4203 Z-6.3000 S1000
G1 F1000 X305.9999 Y258.5000 Z-6.3000 S1000
G1 F1000 X470.0002 Y258.5000 Z-6.3000 S1000
G1 F1000 X470.7510 Y258.3846 Z-6.3000 S1000
G1 F1000 X471.3243 Y258.1205 Z-6.3000 S1000
G1 F1000 X471.8132 Y257.7213 Z-6.3000 S1000
G1 F1000 X472.1866 Y257.2124 Z-6.3000 S1000
G1 F1000 X472.4205 Y256.6261 Z-6.3000 S1000
G1 F1000 X472.5002 Y256.0000 Z-6.3000 S1000
G1 F1000 X472.5002 Y133.5000 Z-6.3000 S1000
G1 F1000 X472.5002 Y133.5000 Z-4.2000 S1000
G1 F1000 X472.5002 Y122.5000 Z-4.2000 S1000
G1 F1000 X472.5002 Y122.5000 Z-6.3000 S1000
G1 F1000 X472.5002 Y0.0001 Z-6.3000 S1000
G1 F1000 X472.5002 Y0.0001 Z-6.3000 S1000
G1 F1000 X472.3848 Y-0.7507 Z-6.3000 S1000
G1 F1000 X472.1207 Y-1.3240 Z-6.3000 S1000
G1 F1000 X471.7215 Y-1.8129 Z-6.3000 S1000
G1 F1000 X471.2126 Y-2.1863 Z-6.3000 S1000
G1 F1000 X470.6263 Y-2.4202 Z-6.3000 S1000
G1 F1000 X470.0002 Y-2.4999 Z-6.3000 S1000
; Starting inflateGrp: Closed?:true
G1 F300 Z-8.2000
G1 F1000 X358.0002 Y-2.4999 Z-8.2000 S1000
G1 F1000 X358.0002 Y-2.4999 Z-4.2000 S1000
G1 F1000 X347.0002 Y-2.4999 Z-4.2000 S1000
G1 F1000 X347.0002 Y-2.4999 Z-8.2000 S1000
G1 F1000 X235.0001 Y-2.4999 Z-8.2000 S1000
G1 F1000 X123.0001 Y-2.4999 Z-8.2000 S1000
G1 F1000 X123.0001 Y-2.4999 Z-4.2000 S1000
G1 F1000 X112.0001 Y-2.4999 Z-4.2000 S1000
G1 F1000 X112.0001 Y-2.4999 Z-8.2000 S1000
G1 F1000 X0.0000 Y-2.4999 Z-8.2000 S1000
G1 F1000 X0.0000 Y-2.4999 Z-8.2000 S1000
G1 F1000 X-0.7508 Y-2.3845 Z-8.2000 S1000
G1 F1000 X-1.3241 Y-2.1204 Z-8.2000 S1000
G1 F1000 X-1.8130 Y-1.7212 Z-8.2000 S1000
G1 F1000 X-2.1864 Y-1.2123 Z-8.2000 S1000
G1 F1000 X-2.4203 Y-0.6260 Z-8.2000 S1000
G1 F1000 X-2.5000 Y0.0001 Z-8.2000 S1000
G1 F1000 X-2.5000 Y122.5001 Z-8.2000 S1000
G1 F1000 X-2.5000 Y122.5001 Z-4.2000 S1000
G1 F1000 X-2.5000 Y133.5000 Z-4.2000 S1000
G1 F1000 X-2.5000 Y133.5000 Z-8.2000 S1000
G1 F1000 X-2.5000 Y256.0000 Z-8.2000 S1000
G1 F1000 X-2.5000 Y256.0000 Z-8.2000 S1000
G1 F1000 X-2.3846 Y256.7508 Z-8.2000 S1000
G1 F1000 X-2.1205 Y257.3241 Z-8.2000 S1000
G1 F1000 X-1.7213 Y257.8130 Z-8.2000 S1000
G1 F1000 X-1.2124 Y258.1864 Z-8.2000 S1000
G1 F1000 X-0.6261 Y258.4203 Z-8.2000 S1000
G1 F1000 X0.0000 Y258.5000 Z-8.2000 S1000
G1 F1000 X163.9998 Y258.5000 Z-8.2000 S1000
G1 F1000 X164.7506 Y258.3846 Z-8.2000 S1000
G1 F1000 X165.3239 Y258.1205 Z-8.2000 S1000
G1 F1000 X165.8128 Y257.7213 Z-8.2000 S1000
G1 F1000 X166.1862 Y257.2124 Z-8.2000 S1000
G1 F1000 X166.4201 Y256.6261 Z-8.2000 S1000
G1 F1000 X166.4998 Y256.0000 Z-8.2000 S1000
G1 F1000 X166.4998 Y184.2999 Z-8.2000 S1000
G1 F1000 X202.4999 Y184.2999 Z-8.2000 S1000
G1 F1000 X202.4999 Y186.0001 Z-8.2000 S1000
G1 F1000 X202.6153 Y186.7509 Z-8.2000 S1000
G1 F1000 X202.8794 Y187.3242 Z-8.2000 S1000
G1 F1000 X203.2786 Y187.8131 Z-8.2000 S1000
G1 F1000 X203.7875 Y188.1865 Z-8.2000 S1000
G1 F1000 X204.3738 Y188.4204 Z-8.2000 S1000
G1 F1000 X204.9999 Y188.5001 Z-8.2000 S1000
G1 F1000 X264.9998 Y188.5001 Z-8.2000 S1000
G1 F1000 X265.7506 Y188.3847 Z-8.2000 S1000
G1 F1000 X266.3239 Y188.1206 Z-8.2000 S1000
G1 F1000 X266.8128 Y187.7214 Z-8.2000 S1000
G1 F1000 X267.1862 Y187.2125 Z-8.2000 S1000
G1 F1000 X267.4201 Y186.6262 Z-8.2000 S1000
G1 F1000 X267.4998 Y186.0001 Z-8.2000 S1000
G1 F1000 X267.4998 Y184.2999 Z-8.2000 S1000
G1 F1000 X303.4999 Y184.2999 Z-8.2000 S1000
G1 F1000 X303.4999 Y256.0000 Z-8.2000 S1000
G1 F1000 X303.6153 Y256.7508 Z-8.2000 S1000
G1 F1000 X303.8794 Y257.3241 Z-8.2000 S1000
G1 F1000 X304.2786 Y257.8130 Z-8.2000 S1000
G1 F1000 X304.7875 Y258.1864 Z-8.2000 S1000
G1 F1000 X305.3738 Y258.4203 Z-8.2000 S1000
G1 F1000 X305.9999 Y258.5000 Z-8.2000 S1000
G1 F1000 X470.0002 Y258.5000 Z-8.2000 S1000
G1 F1000 X470.7510 Y258.3846 Z-8.2000 S1000
G1 F1000 X471.3243 Y258.1205 Z-8.2000 S1000
G1 F1000 X471.8132 Y257.7213 Z-8.2000 S1000
G1 F1000 X472.1866 Y257.2124 Z-8.2000 S1000
G1 F1000 X472.4205 Y256.6261 Z-8.2000 S1000
G1 F1000 X472.5002 Y256.0000 Z-8.2000 S1000
G1 F1000 X472.5002 Y133.5000 Z-8.2000 S1000
G1 F1000 X472.5002 Y133.5000 Z-4.2000 S1000
G1 F1000 X472.5002 Y122.5000 Z-4.2000 S1000
G1 F1000 X472.5002 Y122.5000 Z-8.2000 S1000
G1 F1000 X472.5002 Y0.0001 Z-8.2000 S1000
G1 F1000 X472.5002 Y0.0001 Z-8.2000 S1000
G1 F1000 X472.3848 Y-0.7507 Z-8.2000 S1000
G1 F1000 X472.1207 Y-1.3240 Z-8.2000 S1000
G1 F1000 X471.7215 Y-1.8129 Z-8.2000 S1000
G1 F1000 X471.2126 Y-2.1863 Z-8.2000 S1000
G1 F1000 X470.6263 Y-2.4202 Z-8.2000 S1000
G1 F1000 X470.0002 Y-2.4999 Z-8.2000 S1000
; retracting back to z-safe
G0 Z10

M5 S0; Spindle Off
