%!PS-Adobe-3.0 EPSF-3.0
%%Creator: cairo 1.18.0 (https://cairographics.org)
%%CreationDate: Thu May  9 13:49:33 2024
%%Pages: 1
%%DocumentData: Clean7Bit
%%LanguageLevel: 2
%%BoundingBox: 0 0 150 150
%%EndComments
%%BeginProlog
50 dict begin
/q { gsave } bind def
/Q { grestore } bind def
/cm { 6 array astore concat } bind def
/w { setlinewidth } bind def
/J { setlinecap } bind def
/j { setlinejoin } bind def
/M { setmiterlimit } bind def
/d { setdash } bind def
/m { moveto } bind def
/l { lineto } bind def
/c { curveto } bind def
/h { closepath } bind def
/re { exch dup neg 3 1 roll 5 3 roll moveto 0 rlineto
      0 exch rlineto 0 rlineto closepath } bind def
/S { stroke } bind def
/f { fill } bind def
/f* { eofill } bind def
/n { newpath } bind def
/W { clip } bind def
/W* { eoclip } bind def
/BT { } bind def
/ET { } bind def
/BDC { mark 3 1 roll /BDC pdfmark } bind def
/EMC { mark /EMC pdfmark } bind def
/cairo_store_point { /cairo_point_y exch def /cairo_point_x exch def } def
/Tj { show currentpoint cairo_store_point } bind def
/TJ {
  {
    dup
    type /stringtype eq
    { show } { -0.001 mul 0 cairo_font_matrix dtransform rmoveto } ifelse
  } forall
  currentpoint cairo_store_point
} bind def
/cairo_selectfont { cairo_font_matrix aload pop pop pop 0 0 6 array astore
    cairo_font exch selectfont cairo_point_x cairo_point_y moveto } bind def
/Tf { pop /cairo_font exch def /cairo_font_matrix where
      { pop cairo_selectfont } if } bind def
/Td { matrix translate cairo_font_matrix matrix concatmatrix dup
      /cairo_font_matrix exch def dup 4 get exch 5 get cairo_store_point
      /cairo_font where { pop cairo_selectfont } if } bind def
/Tm { 2 copy 8 2 roll 6 array astore /cairo_font_matrix exch def
      cairo_store_point /cairo_font where { pop cairo_selectfont } if } bind def
/g { setgray } bind def
/rg { setrgbcolor } bind def
/d1 { setcachedevice } bind def
/cairo_data_source {
  CairoDataIndex CairoData length lt
    { CairoData CairoDataIndex get /CairoDataIndex CairoDataIndex 1 add def }
    { () } ifelse
} def
/cairo_flush_ascii85_file { cairo_ascii85_file status { cairo_ascii85_file flushfile } if } def
/cairo_image { image cairo_flush_ascii85_file } def
/cairo_imagemask { imagemask cairo_flush_ascii85_file } def
%%EndProlog
%%BeginSetup
%%EndSetup
%%Page: 1 1
%%BeginPageSetup
%%PageBoundingBox: 0 0 150 150
%%EndPageSetup
q 0 0 150 150 rectclip
1 0 0 -1 0 150 cm q
0 g
8.426 0 m 6.121 0 4.137 0.828 2.484 2.484 c 0.828 4.137 0 6.121 0 8.426
 c 0 120.383 l 0 121.184 0.301 121.887 0.902 122.488 c 1.504 123.09 2.207
 123.391 3.008 123.391 c 72.23 123.391 l 73.434 123.391 74.312 122.891 74.863
 121.887 c 75.414 120.883 75.414 119.879 74.863 118.879 c 74.312 117.875
 73.434 117.371 72.23 117.371 c 6.02 117.371 l 6.02 27.086 l 126.402 27.086
 l 126.402 75.238 l 126.402 76.441 126.902 77.32 127.906 77.871 c 128.91
 78.422 129.91 78.422 130.914 77.871 c 131.918 77.32 132.422 76.441 132.422
 75.238 c 132.422 8.426 l 132.422 6.121 131.594 4.137 129.938 2.484 c 128.281
 0.828 126.301 0 123.992 0 c h
8.426 6.02 m 123.992 6.02 l 124.695 6.02 125.273 6.246 125.723 6.695 c 
126.176 7.148 126.402 7.723 126.402 8.426 c 126.402 21.066 l 6.02 21.066
 l 6.02 8.426 l 6.02 7.723 6.246 7.148 6.695 6.695 c 7.148 6.246 7.723 6.02
 8.426 6.02 c h
21.066 45.145 m 21.066 51.164 l 33.105 51.164 l 33.105 45.145 l h
42.133 45.145 m 42.133 51.164 l 111.352 51.164 l 111.352 45.145 l h
21.066 60.191 m 21.066 66.211 l 33.105 66.211 l 33.105 60.191 l h
42.133 60.191 m 42.133 66.211 l 111.352 66.211 l 111.352 60.191 l h
21.066 75.238 m 21.066 81.258 l 33.105 81.258 l 33.105 75.238 l h
42.133 75.238 m 42.133 81.258 l 84.266 81.258 l 84.266 75.238 l h
108.344 78.25 m 102.926 78.25 97.91 79.602 93.297 82.312 c 88.68 85.02 
85.02 88.68 82.312 93.297 c 79.602 97.91 78.25 102.926 78.25 108.344 c 78.25
 113.762 79.602 118.777 82.312 123.391 c 85.02 128.008 88.68 131.668 93.297
 134.375 c 97.91 137.086 102.926 138.438 108.344 138.438 c 111.855 138.438
 115.242 137.863 118.5 136.707 c 121.762 135.555 124.695 133.875 127.305
 131.668 c 145.359 149.574 l 149.574 145.359 l 131.668 127.305 l 133.875
 124.695 135.555 121.762 136.707 118.5 c 137.863 115.242 138.438 111.855
 138.438 108.344 c 138.438 102.926 137.086 97.91 134.375 93.297 c 131.668
 88.68 128.008 85.02 123.391 82.312 c 118.777 79.602 113.762 78.25 108.344
 78.25 c h
108.344 84.266 m 112.758 84.266 116.797 85.344 120.457 87.504 c 124.117
 89.66 127.027 92.57 129.184 96.23 c 131.34 99.891 132.422 103.93 132.422
 108.344 c 132.422 112.758 131.34 116.797 129.184 120.457 c 127.027 124.117
 124.117 127.027 120.457 129.184 c 116.797 131.34 112.758 132.422 108.344
 132.422 c 103.93 132.422 99.891 131.34 96.23 129.184 c 92.57 127.027 89.66
 124.117 87.504 120.457 c 85.344 116.797 84.266 112.758 84.266 108.344 c
 84.266 103.93 85.344 99.891 87.504 96.23 c 89.66 92.57 92.57 89.66 96.23
 87.504 c 99.891 85.344 103.93 84.266 108.344 84.266 c h
21.066 90.285 m 21.066 96.305 l 33.105 96.305 l 33.105 90.285 l h
42.133 90.285 m 42.133 96.305 l 72.23 96.305 l 72.23 90.285 l h
42.133 90.285 m f
Q Q
showpage
%%Trailer
end
%%EOF
