%!PS-Adobe-3.0 EPSF-3.0
%%Creator: cairo 1.18.0 (https://cairographics.org)
%%CreationDate: Thu May  9 12:23:33 2024
%%Pages: 1
%%DocumentData: Clean7Bit
%%LanguageLevel: 2
%%BoundingBox: 0 0 139 151
%%EndComments
%%BeginProlog
50 dict begin
/q { gsave } bind def
/Q { grestore } bind def
/cm { 6 array astore concat } bind def
/w { setlinewidth } bind def
/J { setlinecap } bind def
/j { setlinejoin } bind def
/M { setmiterlimit } bind def
/d { setdash } bind def
/m { moveto } bind def
/l { lineto } bind def
/c { curveto } bind def
/h { closepath } bind def
/re { exch dup neg 3 1 roll 5 3 roll moveto 0 rlineto
      0 exch rlineto 0 rlineto closepath } bind def
/S { stroke } bind def
/f { fill } bind def
/f* { eofill } bind def
/n { newpath } bind def
/W { clip } bind def
/W* { eoclip } bind def
/BT { } bind def
/ET { } bind def
/BDC { mark 3 1 roll /BDC pdfmark } bind def
/EMC { mark /EMC pdfmark } bind def
/cairo_store_point { /cairo_point_y exch def /cairo_point_x exch def } def
/Tj { show currentpoint cairo_store_point } bind def
/TJ {
  {
    dup
    type /stringtype eq
    { show } { -0.001 mul 0 cairo_font_matrix dtransform rmoveto } ifelse
  } forall
  currentpoint cairo_store_point
} bind def
/cairo_selectfont { cairo_font_matrix aload pop pop pop 0 0 6 array astore
    cairo_font exch selectfont cairo_point_x cairo_point_y moveto } bind def
/Tf { pop /cairo_font exch def /cairo_font_matrix where
      { pop cairo_selectfont } if } bind def
/Td { matrix translate cairo_font_matrix matrix concatmatrix dup
      /cairo_font_matrix exch def dup 4 get exch 5 get cairo_store_point
      /cairo_font where { pop cairo_selectfont } if } bind def
/Tm { 2 copy 8 2 roll 6 array astore /cairo_font_matrix exch def
      cairo_store_point /cairo_font where { pop cairo_selectfont } if } bind def
/g { setgray } bind def
/rg { setrgbcolor } bind def
/d1 { setcachedevice } bind def
/cairo_data_source {
  CairoDataIndex CairoData length lt
    { CairoData CairoDataIndex get /CairoDataIndex CairoDataIndex 1 add def }
    { () } ifelse
} def
/cairo_flush_ascii85_file { cairo_ascii85_file status { cairo_ascii85_file flushfile } if } def
/cairo_image { image cairo_flush_ascii85_file } def
/cairo_imagemask { imagemask cairo_flush_ascii85_file } def
%%EndProlog
%%BeginSetup
%%EndSetup
%%Page: 1 1
%%BeginPageSetup
%%PageBoundingBox: 0 0 139 151
%%EndPageSetup
q 0 0 139 151 rectclip
1 0 0 -1 0 151 cm q
0 g
63.199 0 m 54.773 0 46.824 0.703 39.352 2.105 c 31.875 3.512 25.203 5.543
 19.336 8.199 c 13.469 10.859 8.879 13.945 5.566 17.457 c 1.855 21.367 0
 25.582 0 30.094 c 0 117.371 l 0 122.891 2.809 127.957 8.426 132.57 c 14.043
 137.184 21.57 140.797 31 143.406 c 40.828 146.113 51.562 147.469 63.199
 147.469 c 76.441 147.469 88.379 145.762 99.016 142.352 c 95.254 137.234
 l 85.621 140.043 74.938 141.449 63.199 141.449 c 52.266 141.449 42.234 
140.246 33.105 137.836 c 24.777 135.531 18.184 132.52 13.316 128.809 c 8.453
 125.098 6.02 121.285 6.02 117.371 c 6.02 103.227 l 11.137 108.445 18.711
 112.559 28.742 115.566 c 39.074 118.777 50.559 120.383 63.199 120.383 c
 69.422 120.383 75.488 119.98 81.41 119.18 c 77.195 113.609 l 72.48 114.113
 67.816 114.363 63.199 114.363 c 52.266 114.363 42.234 113.16 33.105 110.75
 c 24.777 108.445 18.184 105.434 13.316 101.723 c 8.453 98.012 6.02 94.199
 6.02 90.285 c 6.02 73.281 l 9.328 76.594 13.844 79.551 19.562 82.16 c 25.281
 84.77 31.875 86.773 39.352 88.18 c 46.824 89.586 54.773 90.285 63.199 90.285
 c 71.629 90.285 79.578 89.586 87.051 88.18 c 94.523 86.773 101.121 84.77
 106.84 82.16 c 112.559 79.551 117.07 76.594 120.383 73.281 c 120.383 81.258
 l 126.402 81.258 l 126.402 30.094 l 126.402 25.582 124.547 21.367 120.832
 17.457 c 117.523 13.945 112.934 10.859 107.066 8.199 c 101.195 5.543 94.523
 3.512 87.051 2.105 c 79.578 0.703 71.629 0 63.199 0 c h
63.199 6.02 m 71.125 6.02 78.75 6.723 86.074 8.125 c 93.094 9.43 99.215
 11.262 104.43 13.617 c 109.648 15.977 113.66 18.66 116.469 21.668 c 119.078
 24.379 120.383 27.188 120.383 30.094 c 120.383 33.004 119.078 35.812 116.469
 38.523 c 113.66 41.531 109.648 44.215 104.43 46.574 c 99.215 48.93 93.094
 50.762 86.074 52.066 c 78.75 53.469 71.125 54.172 63.199 54.172 c 55.273
 54.172 47.652 53.469 40.328 52.066 c 33.305 50.762 27.188 48.93 21.969 
46.574 c 16.754 44.215 12.742 41.531 9.93 38.523 c 7.324 35.812 6.02 33.004
 6.02 30.094 c 6.02 27.188 7.324 24.379 9.93 21.668 c 12.742 18.66 16.754
 15.977 21.969 13.617 c 27.188 11.262 33.305 9.43 40.328 8.125 c 47.652 
6.723 55.273 6.02 63.199 6.02 c h
6.02 43.188 m 9.328 46.496 13.844 49.457 19.562 52.066 c 25.281 54.672 
31.875 56.68 39.352 58.086 c 46.824 59.488 54.773 60.191 63.199 60.191 c
 71.629 60.191 79.578 59.488 87.051 58.086 c 94.523 56.68 101.121 54.672
 106.84 52.066 c 112.559 49.457 117.07 46.496 120.383 43.188 c 120.383 60.191
 l 120.383 63.102 119.078 65.91 116.469 68.617 c 113.66 71.629 109.648 74.312
 104.43 76.668 c 99.215 79.027 93.094 80.855 86.074 82.16 c 78.75 83.566
 71.125 84.266 63.199 84.266 c 55.273 84.266 47.652 83.566 40.328 82.16 
c 33.305 80.855 27.188 79.027 21.969 76.668 c 16.754 74.312 12.742 71.629
 9.93 68.617 c 7.324 65.91 6.02 63.102 6.02 60.191 c h
102.324 87.277 m 102.324 117.371 l 87.426 117.371 l 112.859 150.477 l 138.738
 117.371 l 123.391 117.371 l 123.391 87.277 l h
108.344 93.297 m 117.371 93.297 l 117.371 123.391 l 126.551 123.391 l 112.859
 140.547 l 99.617 123.391 l 108.344 123.391 l h
108.344 93.297 m f
Q Q
showpage
%%Trailer
end
%%EOF
