%!PS-Adobe-3.0 EPSF-3.0
%%Creator: cairo 1.18.0 (https://cairographics.org)
%%CreationDate: Thu May  9 12:23:05 2024
%%Pages: 1
%%DocumentData: Clean7Bit
%%LanguageLevel: 3
%%BoundingBox: 0 1 36 37
%%EndComments
%%BeginProlog
50 dict begin
/q { gsave } bind def
/Q { grestore } bind def
/cm { 6 array astore concat } bind def
/w { setlinewidth } bind def
/J { setlinecap } bind def
/j { setlinejoin } bind def
/M { setmiterlimit } bind def
/d { setdash } bind def
/m { moveto } bind def
/l { lineto } bind def
/c { curveto } bind def
/h { closepath } bind def
/re { exch dup neg 3 1 roll 5 3 roll moveto 0 rlineto
      0 exch rlineto 0 rlineto closepath } bind def
/S { stroke } bind def
/f { fill } bind def
/f* { eofill } bind def
/n { newpath } bind def
/W { clip } bind def
/W* { eoclip } bind def
/BT { } bind def
/ET { } bind def
/BDC { mark 3 1 roll /BDC pdfmark } bind def
/EMC { mark /EMC pdfmark } bind def
/cairo_store_point { /cairo_point_y exch def /cairo_point_x exch def } def
/Tj { show currentpoint cairo_store_point } bind def
/TJ {
  {
    dup
    type /stringtype eq
    { show } { -0.001 mul 0 cairo_font_matrix dtransform rmoveto } ifelse
  } forall
  currentpoint cairo_store_point
} bind def
/cairo_selectfont { cairo_font_matrix aload pop pop pop 0 0 6 array astore
    cairo_font exch selectfont cairo_point_x cairo_point_y moveto } bind def
/Tf { pop /cairo_font exch def /cairo_font_matrix where
      { pop cairo_selectfont } if } bind def
/Td { matrix translate cairo_font_matrix matrix concatmatrix dup
      /cairo_font_matrix exch def dup 4 get exch 5 get cairo_store_point
      /cairo_font where { pop cairo_selectfont } if } bind def
/Tm { 2 copy 8 2 roll 6 array astore /cairo_font_matrix exch def
      cairo_store_point /cairo_font where { pop cairo_selectfont } if } bind def
/g { setgray } bind def
/rg { setrgbcolor } bind def
/d1 { setcachedevice } bind def
/cairo_data_source {
  CairoDataIndex CairoData length lt
    { CairoData CairoDataIndex get /CairoDataIndex CairoDataIndex 1 add def }
    { () } ifelse
} def
/cairo_flush_ascii85_file { cairo_ascii85_file status { cairo_ascii85_file flushfile } if } def
/cairo_image { image cairo_flush_ascii85_file } def
/cairo_imagemask { imagemask cairo_flush_ascii85_file } def
%%EndProlog
%%BeginSetup
%%EndSetup
%%Page: 1 1
%%BeginPageSetup
%%PageBoundingBox: 0 1 36 37
%%EndPageSetup
q 0 1 36 36 rectclip
1 0 0 -1 0 37 cm q
1 g
27 17.996 m 27 22.965 22.969 26.996 18 26.996 c 13.031 26.996 9 22.965 
9 17.996 c 9 13.027 13.031 8.996 18 8.996 c 22.969 8.996 27 13.027 27 17.996
 c h
27 17.996 m f
q
18 9 m 33.586 9 l 30.371 3.43 24.43 0 18 0 c 11.566 0 5.625 3.434 2.414
 9.004 c 10.207 22.5 l 10.215 22.5 l 8.598 19.715 8.594 16.281 10.203 13.496
 c 11.809 10.711 14.785 8.996 18 9 c h
18 9 m W n
[0.75 0 0 0.75 0 0] concat
/CairoFunction
   << /FunctionType 2
      /Domain [ 0 1 ]
      /C0 [ 0.85098 0.188235 0.145098 ]
      /C1 [ 0.917647 0.262745 0.207843 ]
      /N 1
   >>
def
   << /ShadingType 2
      /ColorSpace /DeviceRGB
      /Coords [ 3.2173 15 44.7812 15 ]
      /Extend [ true true ]
      /Function CairoFunction
   >>
shfill
Q
0.101961 0.45098 0.909804 rg
25.125 18 m 25.125 21.934 21.934 25.125 18 25.125 c 14.066 25.125 10.875
 21.934 10.875 18 c 10.875 14.066 14.066 10.875 18 10.875 c 21.934 10.875
 25.125 14.066 25.125 18 c h
25.125 18 m f
q
25.793 22.504 m 18 36 l 24.43 36 30.375 32.57 33.59 27 c 36.805 21.434 
36.801 14.57 33.586 9.004 c 18 9.004 l 17.996 9.008 l 21.215 9.004 24.188
 10.715 25.797 13.5 c 27.406 16.285 27.406 19.719 25.793 22.504 c h
25.793 22.504 m W n
[0.75 0 0 0.75 0 0] concat
/CairoFunction
   << /FunctionType 2
      /Domain [ 0 1 ]
      /C0 [ 0.988235 0.788235 0.203922 ]
      /C1 [ 0.984314 0.737255 0.0156863 ]
      /N 1
   >>
def
   << /ShadingType 2
      /ColorSpace /DeviceRGB
      /Coords [ 20.721901 47.6791 41.503899 11.6837 ]
      /Extend [ true true ]
      /Function CairoFunction
   >>
shfill
Q
q
10.207 22.504 m 2.414 9.004 l -0.801 14.574 -0.805 21.434 2.414 27.004 
c 5.629 32.57 11.57 36 18 36 c 25.793 22.504 l 25.789 22.496 l 24.188 25.285
 21.215 27.004 18 27.008 c 14.781 27.008 11.812 25.289 10.207 22.504 c h
10.207 22.504 m W n
[0.75 0 0 0.75 0 0] concat
/CairoFunction
   << /FunctionType 2
      /Domain [ 0 1 ]
      /C0 [ 0.117647 0.556863 0.243137 ]
      /C1 [ 0.203922 0.658824 0.32549 ]
      /N 1
   >>
def
   << /ShadingType 2
      /ColorSpace /DeviceRGB
      /Coords [ 26.598101 46.501499 5.8161 10.506 ]
      /Extend [ true true ]
      /Function CairoFunction
   >>
shfill
Q
Q Q
showpage
%%Trailer
end
%%EOF
