%!PS-Adobe-3.0 EPSF-3.0
%%Creator: cairo 1.18.0 (https://cairographics.org)
%%CreationDate: Wed May  8 09:26:58 2024
%%Pages: 1
%%DocumentData: Clean7Bit
%%LanguageLevel: 2
%%BoundingBox: 0 1 375 151
%%EndComments
%%BeginProlog
50 dict begin
/q { gsave } bind def
/Q { grestore } bind def
/cm { 6 array astore concat } bind def
/w { setlinewidth } bind def
/J { setlinecap } bind def
/j { setlinejoin } bind def
/M { setmiterlimit } bind def
/d { setdash } bind def
/m { moveto } bind def
/l { lineto } bind def
/c { curveto } bind def
/h { closepath } bind def
/re { exch dup neg 3 1 roll 5 3 roll moveto 0 rlineto
      0 exch rlineto 0 rlineto closepath } bind def
/S { stroke } bind def
/f { fill } bind def
/f* { eofill } bind def
/n { newpath } bind def
/W { clip } bind def
/W* { eoclip } bind def
/BT { } bind def
/ET { } bind def
/BDC { mark 3 1 roll /BDC pdfmark } bind def
/EMC { mark /EMC pdfmark } bind def
/cairo_store_point { /cairo_point_y exch def /cairo_point_x exch def } def
/Tj { show currentpoint cairo_store_point } bind def
/TJ {
  {
    dup
    type /stringtype eq
    { show } { -0.001 mul 0 cairo_font_matrix dtransform rmoveto } ifelse
  } forall
  currentpoint cairo_store_point
} bind def
/cairo_selectfont { cairo_font_matrix aload pop pop pop 0 0 6 array astore
    cairo_font exch selectfont cairo_point_x cairo_point_y moveto } bind def
/Tf { pop /cairo_font exch def /cairo_font_matrix where
      { pop cairo_selectfont } if } bind def
/Td { matrix translate cairo_font_matrix matrix concatmatrix dup
      /cairo_font_matrix exch def dup 4 get exch 5 get cairo_store_point
      /cairo_font where { pop cairo_selectfont } if } bind def
/Tm { 2 copy 8 2 roll 6 array astore /cairo_font_matrix exch def
      cairo_store_point /cairo_font where { pop cairo_selectfont } if } bind def
/g { setgray } bind def
/rg { setrgbcolor } bind def
/d1 { setcachedevice } bind def
/cairo_data_source {
  CairoDataIndex CairoData length lt
    { CairoData CairoDataIndex get /CairoDataIndex CairoDataIndex 1 add def }
    { () } ifelse
} def
/cairo_flush_ascii85_file { cairo_ascii85_file status { cairo_ascii85_file flushfile } if } def
/cairo_image { image cairo_flush_ascii85_file } def
/cairo_imagemask { imagemask cairo_flush_ascii85_file } def
%%EndProlog
%%BeginSetup
%%EndSetup
%%Page: 1 1
%%BeginPageSetup
%%PageBoundingBox: 0 1 375 151
%%EndPageSetup
q 0 1 375 150 rectclip
1 0 0 -1 0 151 cm q
0.0235294 0.45098 0.52549 rg
0 0 375 150 re f
1 g
97.137 65.934 m 87.969 50.055 l 87.383 49.043 86.09 48.695 85.074 49.277
 c 84.062 49.863 83.715 51.16 84.301 52.172 c 92.246 65.934 l 82.422 65.934
 l 74.242 51.77 l 86.473 30.465 l 106.949 65.934 l h
86.465 105.648 m 81.559 97.148 l 97.137 70.168 l 106.949 70.168 l h
46.172 99.211 m 77.891 99.266 l 82.801 107.766 l 39.387 107.766 l 17.68
 70.168 l 27.492 70.168 l 43.371 97.578 l 43.555 97.859 l 44.359 98.949 
44.781 99.066 46.172 99.211 c h
42.211 70.168 m 50.527 84.578 l 45.629 93.113 l 32.383 70.168 l h
45.516 43.188 m 50.43 51.699 l 42.211 65.934 l 32.383 65.934 l h
70.617 49.582 m 54.098 49.582 l 49.184 41.07 l 75.5 41.07 l h
66.113 65.934 m 71.805 56.016 l 77.531 65.934 l h
74.199 84.406 m 82.422 70.168 l 92.246 70.168 l 79.113 92.914 l h
65.98 70.168 m 77.531 70.168 l 71.758 80.168 l h
54.297 86.523 m 56.727 82.289 l 62.391 72.418 l 75.445 95.031 l 49.41 95.031
 l h
58.797 70.168 m 52.965 80.332 l 47.098 70.168 l h
56.543 53.816 m 68.188 53.816 l 62.379 63.93 l h
58.648 65.934 m 47.098 65.934 l 52.871 55.934 l h
41.832 28.34 m 82.809 28.34 l 77.934 36.836 l 46.738 36.836 l h
112.715 67.801 m 112.715 67.777 112.711 67.758 112.707 67.734 c 112.699
 67.668 112.688 67.605 112.672 67.543 c 112.664 67.523 112.66 67.5 112.656
 67.48 c 112.633 67.406 112.609 67.332 112.578 67.258 c 112.578 67.254 112.574
 67.246 112.574 67.242 c 112.539 67.16 112.5 67.086 112.457 67.012 c 112.453
 67.004 112.453 66.996 112.449 66.992 c 88.297 25.16 l 88.297 25.156 88.289
 25.148 88.289 25.145 c 88.242 25.07 88.199 24.996 88.145 24.93 c 88.141
 24.926 88.141 24.922 88.137 24.922 c 88.09 24.859 88.035 24.797 87.977 
24.742 c 87.961 24.727 87.945 24.711 87.93 24.695 c 87.883 24.652 87.836
 24.609 87.785 24.57 c 87.77 24.555 87.754 24.539 87.734 24.527 c 87.668
 24.48 87.605 24.434 87.531 24.395 c 87.531 24.391 87.527 24.387 87.523 
24.387 c 87.52 24.383 l 87.445 24.34 87.371 24.309 87.297 24.273 c 87.277
 24.266 87.258 24.258 87.238 24.25 c 87.176 24.227 87.113 24.207 87.051 
24.188 c 87.027 24.18 87.012 24.176 86.988 24.172 c 86.914 24.152 86.84 
24.137 86.762 24.125 c 86.758 24.125 86.75 24.121 86.742 24.121 c 86.652
 24.109 86.566 24.105 86.48 24.105 c 86.477 24.105 86.469 24.105 86.465 
24.105 c 38.164 24.105 l 38.156 24.105 38.152 24.105 38.145 24.105 c 38.059
 24.105 37.973 24.109 37.887 24.121 c 37.879 24.121 37.875 24.125 37.867
 24.125 c 37.793 24.137 37.715 24.152 37.641 24.172 c 37.617 24.176 37.598
 24.184 37.578 24.188 c 37.516 24.207 37.453 24.227 37.395 24.25 c 37.371
 24.262 37.352 24.266 37.332 24.277 c 37.254 24.309 37.18 24.344 37.105 
24.387 c 37.102 24.387 37.102 24.391 37.098 24.391 c 37.02 24.438 36.941
 24.488 36.871 24.543 c 36.832 24.574 36.793 24.609 36.754 24.645 c 36.727
 24.672 36.691 24.695 36.664 24.727 c 36.621 24.77 36.582 24.816 36.543 
24.863 c 36.523 24.887 36.5 24.91 36.48 24.938 c 36.441 24.988 36.406 25.043
 36.371 25.102 c 36.355 25.121 36.34 25.141 36.328 25.16 c 36.324 25.172
 l 36.32 25.176 36.32 25.18 36.32 25.18 c 19.309 54.641 l 18.727 55.656 
19.07 56.949 20.082 57.535 c 21.098 58.121 22.391 57.773 22.977 56.758 c
 38.164 30.453 l 43.07 38.953 l 27.492 65.934 l 13.988 65.934 l 13.941 65.934
 13.898 65.938 13.852 65.941 c 13.828 65.945 13.801 65.945 13.777 65.949
 c 13.738 65.953 13.695 65.961 13.652 65.969 c 13.625 65.973 13.594 65.977
 13.566 65.98 c 13.531 65.988 13.5 66 13.465 66.008 c 13.43 66.02 13.395
 66.027 13.363 66.035 c 13.336 66.047 13.309 66.059 13.281 66.066 c 13.238
 66.082 13.203 66.094 13.164 66.113 c 13.141 66.121 13.117 66.133 13.094
 66.145 c 13.055 66.168 13.012 66.184 12.973 66.207 c 12.969 66.211 12.961
 66.215 12.953 66.219 c 12.941 66.227 12.934 66.23 12.922 66.238 c 12.863
 66.273 12.805 66.312 12.75 66.355 c 12.73 66.371 12.711 66.383 12.691 66.398
 c 12.629 66.449 12.566 66.5 12.512 66.559 c 12.496 66.574 12.48 66.59 12.465
 66.605 c 12.426 66.652 12.387 66.699 12.348 66.746 c 12.328 66.77 12.312
 66.793 12.293 66.816 c 12.258 66.863 12.227 66.918 12.195 66.969 c 12.184
 66.988 12.172 67.004 12.16 67.023 c 12.121 67.094 12.086 67.172 12.051 
67.246 c 12.051 67.258 12.047 67.27 12.039 67.277 c 12.016 67.348 11.992
 67.414 11.973 67.484 c 11.969 67.504 11.961 67.527 11.957 67.547 c 11.941
 67.609 11.93 67.672 11.922 67.734 c 11.918 67.758 11.914 67.777 11.91 67.801
 c 11.902 67.879 11.895 67.957 11.895 68.035 c 11.895 68.051 l 11.895 68.062
 11.895 68.074 11.895 68.086 c 11.898 68.156 11.902 68.227 11.91 68.297 
c 11.914 68.324 11.918 68.352 11.922 68.379 c 11.93 68.434 11.941 68.492
 11.953 68.547 c 11.961 68.574 11.969 68.598 11.977 68.625 c 11.996 68.695
 12.016 68.762 12.043 68.828 c 12.047 68.84 12.051 68.848 12.055 68.859 
c 12.09 68.941 12.125 69.02 12.168 69.09 c 12.172 69.098 12.176 69.105 12.176
 69.109 c 36.328 110.941 l 36.707 111.594 37.406 112 38.164 112 c 86.465
 112 l 86.473 112 86.48 112 86.484 112 c 86.57 112 86.656 111.992 86.742
 111.98 c 86.75 111.98 86.754 111.98 86.762 111.977 c 86.836 111.969 86.914
 111.953 86.992 111.93 c 87.012 111.926 87.035 111.922 87.055 111.914 c 
87.117 111.898 87.176 111.875 87.238 111.852 c 87.258 111.844 87.281 111.836
 87.297 111.828 c 87.375 111.793 87.453 111.758 87.527 111.715 c 87.602 
111.672 87.668 111.625 87.734 111.574 c 87.754 111.562 87.77 111.547 87.785
 111.535 c 87.84 111.492 87.887 111.453 87.934 111.406 c 87.949 111.391 
87.961 111.375 87.98 111.359 c 88.035 111.305 88.082 111.25 88.133 111.188
 c 88.137 111.18 88.141 111.176 88.145 111.172 c 88.199 111.102 88.246 111.031
 88.289 110.957 c 88.293 110.953 88.297 110.949 88.301 110.941 c 112.449
 69.109 l 112.453 69.105 112.453 69.098 112.457 69.094 c 112.5 69.02 112.539
 68.941 112.574 68.859 c 112.574 68.855 112.578 68.852 112.578 68.844 c 
112.609 68.773 112.633 68.699 112.656 68.625 c 112.66 68.602 112.664 68.582
 112.672 68.559 c 112.688 68.496 112.699 68.434 112.707 68.367 c 112.711
 68.344 112.715 68.324 112.715 68.305 c 112.727 68.223 112.734 68.137 112.734
 68.051 c 112.734 67.969 112.727 67.883 112.715 67.801 c h
112.715 67.801 m f*
123.648 109.387 m 126.691 111.34 131.062 112.82 135.746 112.82 c 142.691
 112.82 146.75 109.152 146.75 103.844 c 146.75 99.008 143.941 96.117 136.836
 93.465 c 128.254 90.344 122.945 85.816 122.945 78.48 c 122.945 70.285 129.734
 64.199 139.961 64.199 c 145.266 64.199 149.246 65.445 151.512 66.773 c 
149.637 72.312 l 148 71.301 144.484 69.816 139.727 69.816 c 132.547 69.816
 129.812 74.109 129.812 77.699 c 129.812 82.617 133.016 85.035 140.273 87.848
 c 149.168 91.281 153.617 95.574 153.617 103.301 c 153.617 111.414 147.684
 118.52 135.277 118.52 c 130.203 118.52 124.664 116.957 121.852 115.086 
c h
123.648 109.387 m f*
190.148 116.332 m 188.352 117.191 184.371 118.52 179.297 118.52 c 167.902
 118.52 160.488 110.793 160.488 99.242 c 160.488 87.613 168.449 79.105 180.781
 79.105 c 184.84 79.105 188.43 80.121 190.301 81.133 c 188.742 86.363 l 
187.102 85.504 184.527 84.566 180.781 84.566 c 172.117 84.566 167.434 91.047
 167.434 98.852 c 167.434 107.594 173.051 112.977 180.547 112.977 c 184.449
 112.977 187.023 112.039 188.977 111.18 c h
190.148 116.332 m f*
198.188 91.672 m 198.188 87.223 198.109 83.398 197.875 79.887 c 203.883
 79.887 l 204.195 87.379 l 204.43 87.379 l 206.145 82.305 210.363 79.105
 214.969 79.105 c 215.668 79.105 216.215 79.184 216.84 79.262 c 216.84 85.738
 l 216.137 85.582 215.434 85.582 214.5 85.582 c 209.66 85.582 206.223 89.172
 205.289 94.324 c 205.133 95.258 205.055 96.43 205.055 97.523 c 205.055 
117.66 l 198.188 117.66 l h
198.188 91.672 m f*
243.223 98.383 m 235.73 98.227 227.219 99.551 227.219 106.891 c 227.219
 111.414 230.188 113.445 233.621 113.445 c 238.613 113.445 241.816 110.324
 242.91 107.121 c 243.141 106.344 243.223 105.562 243.223 104.938 c h
249.855 108.605 m 249.855 111.887 250.012 115.086 250.398 117.66 c 244.238
 117.66 l 243.691 112.898 l 243.453 112.898 l 241.348 115.863 237.289 118.52
 231.906 118.52 c 224.254 118.52 220.352 113.133 220.352 107.668 c 220.352
 98.539 228.469 93.543 243.062 93.621 c 243.062 92.84 l 243.062 89.797 242.207
 84.098 234.48 84.18 c 230.891 84.18 227.219 85.191 224.57 86.988 c 223.008
 82.383 l 226.129 80.43 230.734 79.105 235.496 79.105 c 247.047 79.105 249.855
 86.988 249.855 94.48 c h
249.855 108.605 m f*
267.73 102.285 m 267.73 103.301 267.809 104.234 268.043 105.094 c 269.293
 109.855 273.43 113.133 278.344 113.133 c 285.605 113.133 289.816 107.203
 289.816 98.539 c 289.816 91.047 285.836 84.566 278.578 84.566 c 273.895
 84.566 269.445 87.848 268.199 92.996 c 267.965 93.855 267.73 94.871 267.73
 95.727 c h
260.938 92.215 m 260.938 87.379 260.785 83.473 260.629 79.887 c 266.715
 79.887 l 267.105 86.363 l 267.262 86.363 l 269.992 81.758 274.52 79.105
 280.688 79.105 c 289.895 79.105 296.762 86.832 296.762 98.227 c 296.762
 111.805 288.414 118.52 279.516 118.52 c 274.52 118.52 270.152 116.332 267.887
 112.586 c 267.73 112.586 l 267.73 133.113 l 260.938 133.113 l h
260.938 92.215 m f*
329.312 95.105 m 329.391 90.812 327.516 84.023 319.789 84.023 c 312.766
 84.023 309.801 90.344 309.25 95.105 c h
309.172 100.02 m 309.332 109.309 315.184 113.133 322.133 113.133 c 327.047
 113.133 330.09 112.273 332.59 111.18 c 333.84 116.098 l 331.418 117.191
 327.203 118.52 321.195 118.52 c 309.566 118.52 302.617 110.793 302.617 
99.398 c 302.617 88 309.332 79.105 320.336 79.105 c 332.742 79.105 335.945
 89.875 335.945 96.82 c 335.945 98.227 335.867 99.242 335.711 100.02 c h
309.172 100.02 m f*
344.453 91.672 m 344.453 87.223 344.375 83.398 344.141 79.887 c 350.152
 79.887 l 350.465 87.379 l 350.695 87.379 l 352.414 82.305 356.629 79.105
 361.234 79.105 c 361.938 79.105 362.48 79.184 363.105 79.262 c 363.105 
85.738 l 362.406 85.582 361.699 85.582 360.766 85.582 c 355.926 85.582 352.492
 89.172 351.555 94.324 c 351.402 95.258 351.32 96.43 351.32 97.523 c 351.32
 117.66 l 344.453 117.66 l h
344.453 91.672 m f*
149.625 72.301 m 136.277 19.695 l 143.461 19.695 l 149.703 46.312 l 151.262
 52.867 152.668 59.422 153.605 64.496 c 153.762 64.496 l 154.621 59.266 
156.258 53.023 158.055 46.234 c 165.078 19.695 l 172.18 19.695 l 178.582
 46.391 l 180.062 52.633 181.469 58.879 182.25 64.418 c 182.406 64.418 l
 183.5 58.645 184.98 52.789 186.617 46.234 c 193.566 19.695 l 200.512 19.695
 l 185.605 72.301 l 178.504 72.301 l 171.867 44.906 l 170.227 38.195 169.137
 33.043 168.434 27.738 c 168.277 27.738 l 167.418 32.965 166.172 38.113 
164.219 44.906 c 156.727 72.301 l h
149.625 72.301 m f*
228.223 49.746 m 228.301 45.453 226.426 38.664 218.699 38.664 c 211.676
 38.664 208.711 44.984 208.164 49.746 c h
208.086 54.66 m 208.242 63.949 214.094 67.773 221.039 67.773 c 225.957 
67.773 229.004 66.914 231.5 65.824 c 232.75 70.738 l 230.328 71.832 226.117
 73.16 220.105 73.16 c 208.477 73.16 201.531 65.434 201.531 54.039 c 201.531
 42.641 208.242 33.746 219.25 33.746 c 231.656 33.746 234.855 44.516 234.855
 51.461 c 234.855 52.867 234.777 53.883 234.621 54.66 c h
208.086 54.66 m f*
250.156 57.16 m 250.156 58.02 250.234 58.879 250.469 59.656 c 251.719 64.418
 255.773 67.695 260.77 67.695 c 268.027 67.695 272.242 61.844 272.242 53.18
 c 272.242 45.609 268.344 39.129 260.926 39.129 c 256.32 39.129 251.949 
42.41 250.547 47.559 c 250.312 48.418 250.156 49.355 250.156 50.449 c h
243.367 16.887 m 250.156 16.887 l 250.156 40.613 l 250.312 40.613 l 252.73
 36.398 257.102 33.746 263.188 33.746 c 272.633 33.746 279.188 41.551 279.188
 52.945 c 279.188 66.445 270.605 73.16 262.176 73.16 c 256.711 73.16 252.34
 71.051 249.453 66.137 c 249.297 66.137 l 248.906 72.301 l 243.055 72.301
 l 243.211 69.727 243.367 65.902 243.367 62.547 c h
243.367 16.887 m f*
Q Q
showpage
%%Trailer
end
%%EOF
