CLASSE;PADRÃO;Vencimento Básico (A);Gratificação de Desempenho de Atividade de Apoio Técnico-Administrativo à Polícia Federal - 80 pontos (B);TOTAL (A+B)
ESPECIAL;lll;3603,85;4256,8;7860,65
ESPECIAL;ll;3533,18;4157,6;7690,78
ESPECIAL;l;3463,91;4062,4;7526,31
C;Vl;3363,02;3908,8;7271,82
C;V;3297,08;3821,6;7118,68
C;lV;3232,44;3736;6968,44
C;lll;3169,06;3652;6821,06
C;ll;3106,92;3572;6678,92
C;l;3046,01;3494,4;6540,41
B;Vl;2957,29;3368,8;6326,09
B;V;2899,31;3296,8;6196,11
B;lV;2842,46;3227,2;6069,66
B;lll;2786,73;3158,4;5945,13
B;ll;2732,09;3092,8;5824,89
B;l;2678,53;3028,8;5707,33
A;V;2600,51;2925,6;5526,11
A;lV;2549,52;2866,4;5415,92
A;lll;2499,53;2809,6;5309,13
A;ll;2450,52;2752,8;5203,32
A;l;2402,47;2699,2;5101,67
