Fica estruturado o Plano Especial de Cargos do Departamento de Polícia Federal, composto pelos cargos de provimento efetivo, regidos pela Lei nº  8.112/1990, que não estejam organizados em carreiras, pertencentes ao Quadro de Pessoal do Departamento de Polícia Federal em 21 de março de 2003, mediante enquadramento dos servidores, de acordo com as respectivas atribuições, requisitos de formação profissional e posição relativa na tabela, conforme o constante do Anexo I da Lei nº 10.682/2003. ( art. 2º da Lei nº  10.682/2003)
VB - Vencimento Básico - Anexo II da Lei nº 10.682, de 28 de maio de 2003
GDATPF - Gratificação de Desempenho de Atividade de Apoio Técnico-Administrativo à Polícia Federal
( * ) Até que sejam processados os resultados do primeiro ciclo de avaliação de desempenho, as gratificações de desempenho serão pagas no valor correspondente a oitenta pontos, observados os respectivos níveis, classes e padrões. (art. 158 da MP 431/2008)
( * ) GDATPF será paga observado o limite máximo de cem pontos e o mínimo de trinta pontos por servidor, correspondendo cada ponto, em seus respectivos níveis, classes e padrões, ao valor estabelecido no Anexo V da Lei nº 10.682, de 28 de maio de 2003
A pontuação a que se refere a GDATPF será assim distribuída:
"I - até vinte pontos em decorrência dos resultados da avaliação de desempenho individual; e"
II - até oitenta pontos em decorrência do resultado da avaliação de desempenho institucional
A indenização de que trata o art. 1º da Lei nº 12.855, de 2013  será concedida ao servidor ocupante de cargo efetivo das Carreiras ou Planos Especiais de Cargos mencionado no §1º do art. 1º da Lei nº 12.855, de 2013 em exercício de atividade nas delegacias e postos do Departamento de Polícia Federal e do Departamento de Polícia Rodoviária Federal e em unidades da Secretaria da Receita Federal do Brasil, do Ministério da Agricultura, Pecuária e Abastecimento e do Ministério do Trabalho e Emprego situadas em localidades estratégicas, vinculadas à prevenção, controle, fiscalização e repressão dos delitos transfronteiriços. (art. 1º da Lei nº 12.855, de 2013).
( ** ) Aposentado - GDATPF - art. 4º-C da Lei nº 10.682/03 ( art. 26 da MP 431/08 ) 
É vedada a acumulação das vantagens pecuniárias devidas aos ocupantes do Plano Especial de Cargos do Departamento de Polícia Federal com outras vantagens de qualquer natureza a que o servidor faça jus em virtude de outros Planos de Carreiras ou de Classificação de Cargos (art. 4º-D da Lei nº 10.682/2003 - redação dada pelo art. 26 da Lei nº 11.784/2008).
( ** ) Aposentados e  Pensionistas  - GDATPF - arts. 22 a 26 da Lei nº 13.327, de 2016
Legislações Correspondentes:
