Nível Superior;;;;;;;;;;;;;;;;;;;;Posição: maio/2023
;;;GDACTSP;;RT - Retribuição por Titulação;;;ATIVO;;;;ATIVO;;;;GDACTSP;APOSENTADO;;;
CLASSE;PADRÃO;VB;80 pts.;100 pts.;Aperf./Espec.;Mestre;Doutor; TOTAL (em R$) - 80 pts.;;;; TOTAL (em R$) - 100 pts.;;;;50 pts.; TOTAL (em R$) - 50 pts.;;;
;;;( * );;;;;Sem RT;Aperf./Espec.;Mestre;Doutor;Sem RT;Aperf./Espec.;Mestre;Doutor;( ** );Sem RT;Aperf./Espec.;Mestre;Doutor
