;;A;B;C;D;E;F;G=(A+B);H=(A+B+D);I=(A+B+E);J=(A+B+F);K=(A+C);L=(A+C+D);M=(A+C+E);N=(A+C+F);O;P=(A+O);Q=(A+D+O);R=(A+E+O);S=(A+F+O)
TITULAR;lll;9942.42;2201.6;2752;2940.11;4166.02;7815.65;12144.02;15084.130000000001;16310.04;19959.67;12694.42;15634.53;16860.440000000002;20510.07;1376;11318.42;14258.53;15484.44;19134.07
;ll;9602.58;2148.8;2686;2845.78;4018.08;7530.94;11751.380000000001;14597.160000000002;15769.460000000001;19282.32;12288.58;15134.36;16306.66;19819.52;1343;10945.58;13791.36;14963.66;18476.52
;l;9274.91;2096;2620;2757.5;3870.42;7262.23;11370.91;14128.41;15241.33;18633.14;11894.91;14652.41;15765.33;19157.14;1310;10584.91;13342.41;14455.33;17847.14
ASSOCIADO;lll;8808.1;2019.1999999999998;2524;2632.6;3665.7;6876.35;10827.3;13459.9;14493;17703.65;11332.1;13964.7;14997.8;18208.45;1262;10070.1;12702.7;13735.8;16946.45
;ll;8507.81;1970.3999999999999;2463;2545.99;3533.31;6625.99;10478.21;13024.199999999999;14011.519999999999;17104.199999999997;10970.81;13516.8;14504.119999999999;17596.8;1231.5;9739.31;12285.3;13272.619999999999;16365.3
;l;8217.36;1922.4;2403;2466.95;3405.07;6385.88;10139.76;12606.71;13544.83;16525.64;10620.36;13087.310000000001;14025.43;17006.24;1201.5;9418.86;11885.810000000001;12823.93;15804.740000000002
ADJUNTO;lll;7806.32;1852.8;2316;2355.96;3222.31;6048.69;9659.119999999999;12015.079999999998;12881.429999999998;15707.809999999998;10122.32;12478.279999999999;13344.63;16171.009999999998;1158;8964.32;11320.279999999999;12186.63;15013.009999999998
;ll;7541.75;1808.8;2261;2284.76;3108.59;5830.73;9350.55;11635.31;12459.14;15181.279999999999;9802.75;12087.51;12911.34;15633.48;1130.5;8672.25;10957.01;11780.84;14502.98
;l;7285.97;1764.8;2206;2211.04;2996.12;5620.13;9050.77;11261.810000000001;12046.89;14670.900000000001;9491.970000000001;11703.010000000002;12488.09;15112.100000000002;1103;8388.970000000001;10600.01;11385.09;14009.1
ASSISTENTE DE PESQUISA;lll;6922.18;1700.8000000000002;2126;2111.92;2835.48;5321.79;8622.98;10734.9;11458.46;13944.77;9048.18;11160.1;11883.66;14369.970000000001;1063;7985.18;10097.1;10820.66;13306.970000000001
;ll;6689.32;1659.1999999999998;2074;2048.79;2733.98;5131.71;8348.52;10397.310000000001;11082.5;13480.23;8763.32;10812.11;11497.3;13895.029999999999;1037;7726.32;9775.11;10460.3;12858.029999999999
;l;6463.37;1619.1999999999998;2023.9999999999998;1980.07;2636.22;4946.15;8082.57;10062.64;10718.789999999999;13028.72;8487.369999999999;10467.439999999999;11123.589999999998;13433.519999999999;1011.9999999999999;7475.37;9455.44;10111.59;12421.52
