CLASSE;PADRÃO;Vencimento Básico (A);Gratificação de Desempenho de  Atividade de Ciência e Tecnologia, Produção e Inovação em Saúde Pública – 100 pontos (C);Retribuição por Titulação - Aperfeiçoamento (D);Retribuição por Titulação - Especialização (D);Retribuição por Titulação - Mestrado (E);Retribuição por Titulação - Doutorado (F);TOTAL - Sem Retribuição por Titulação (A+C);TOTAL - Aperfeiçoamento (A+C+D);TOTAL - Especialização (A+C+D);TOTAL - Mestrado (A+C+E);TOTAL - Doutorado (A+C+F)
TITULAR;lll;9942,42;2752;2940,11;2940,11;4166,02;7815,65;12694,42;15634,53;15634,53;16860,44;20510,07
TITULAR;ll;9602,58;2686;2845,78;2845,78;4018,08;7530,94;12288,58;15134,36;15134,36;16306,66;19819,52
TITULAR;l;9274,91;2620;2757,5;2757,5;3870,42;7262,23;11894,91;14652,41;14652,41;15765,33;19157,14
ASSOCIADO;lll;8808,1;2524;2632,6;2632,6;3665,7;6876,35;11332,1;13964,7;13964,7;14997,8;18208,45
ASSOCIADO;ll;8507,81;2463;2545,99;2545,99;3533,31;6625,99;10970,81;13516,8;13516,8;14504,12;17596,8
ASSOCIADO;l;8217,36;2403;2466,95;2466,95;3405,07;6385,88;10620,36;13087,31;13087,31;14025,43;17006,24
ADJUNTO;lll;7806,32;2316;2355,96;2355,96;3222,31;6048,69;10122,32;12478,28;12478,28;13344,63;16171,01
ADJUNTO;ll;7541,75;2261;2284,76;2284,76;3108,59;5830,73;9802,75;12087,51;12087,51;12911,34;15633,48
ADJUNTO;l;7285,97;2206;2211,04;2211,04;2996,12;5620,13;9491,97;11703,01;11703,01;12488,09;15112,1
ASSISTENTE DE PESQUISA;lll;6922,18;2126;2111,92;2111,92;2835,48;5321,79;9048,18;11160,1;11160,1;11883,66;14369,97
ASSISTENTE DE PESQUISA;ll;6689,32;2074;2048,79;2048,79;2733,98;5131,71;8763,32;10812,11;10812,11;11497,3;13895,03
ASSISTENTE DE PESQUISA;l;6463,37;2024;1980,07;1980,07;2636,22;4946,15;8487,37;10467,44;10467,44;11123,59;13433,52
