Nível Superior;;;;;;;;;;;;Posição: maio/2023
;;;;;;;;ATIVO E APOSENTADO;;;;
CLASSE;DENOMINAÇÃO;NÍVEL;VB;( * )  RT - Retribuição por Titulação;;;; TOTAL (em R$) ;;;;
;;;;Aperfeiçoamento;Especialização;Mestrado;Doutorado;Sem RT;Aperfeiçoamento;Especialização;Mestrado;Doutorado
