Os cargos efetivos das Carreiras e Cargos Isolados do Plano de Carreiras e Cargos de Magistério Federal  integram os Quadros de Pessoal das Instituições Federais de Ensino subordinadas ou vinculadas ao Ministério da Educação e ao Ministério da Defesa que tenham por atividade-fim o desenvolvimento e aperfeiçoamento do ensino, pesquisa e extensão, ressalvados os cargos de que trata o § 11 do art. 108-A da Lei nº 11.784, de 22 de setembro de 2008, que integram o Quadro de Pessoal do Ministério do Planejamento, Orçamento e Gestão. (§ 6º do art. 1º da Lei nº 12.772/2012 - art. 1º da lei nº 12863/2013);;
O corpo docente das IFE será constituído pelos cargos efetivos integrantes do Plano de Carreiras e Cargos de que trata  a Lei nº 12.772/2012 e pelos Professores Visitantes, Professores Visitantes Estrangeiros e Professores Substitutos. (art. 27 da Lei nº 12.772/2012);;
A contratação temporária de Professores Substitutos, de Professores Visitantes e de Professores Visitantes Estrangeiros será feita de acordo com o que dispõe a Lei nº  8.745, de 1993. ( art. 28 da Lei nº 12.772/2012 );;
"A partir de 1º de março de 2013, a estrutura remuneratória do Palno de Carreiras e Cargos de Magistério Federal de que trata a Lei nº  12.772/2012, será composta de: I - Vencimento Básico; e II - Retribuição por Titulação - RT.";;
A partir de 1º de março de 2013, a Carreira de Magistério Superior do Plano Único de Classificação e Retribuição de Cargos e Empregos - PUCRCE, de que trata a Lei nº 7.596, de 1987, passa a pertencer ao Plano de Carreiras e Cargos de Magistério Federal de que trata a Lei nº 12.772/2012, observada a Tabela de Correlação constante do Anexo II  Lei nº 12.772/2012. (art. 4º da Lei nº 12.772/2012);;
 A partir de 1º de março de 2013, os cargos de Professor Titular da Carreira de Magistério Superior do PUCRCE passam a integrar a Classe de Professor Titular da Carreira de Magistério Superior do Plano de Carreiras e Cargos de Magistério Federal de que trata a Lei nº 12.772/2012.  (art. 4º da Lei nº 12.772/2012);;
O enquadramento no Plano de Carreiras e Cargos de Magistério Federal não representa, para qualquer efeito legal, inclusive para efeito de aposentadoria, descontinuidade em relação à Carreira, ao cargo e às atribuições atuais desenvolvidas pelos seus ocupantes.(art.  6º da Lei nº 12.772/2012);;
Aos servidores de que trata a  Lei nº 12.772/2012, pertencentes ao Plano de Carreiras e Cargos de Magistério Federal, não se aplicam as disposições do Decreto nº  94.664, de 23 de julho de 1987. (art. 37 da Lei nº 12.772/2012 ).;;
"O ingresso no Cargo Isolado de Professor Titular-Livre do Magistério Superior ocorrerá na classe e nível únicos, mediante aprovação em concurso público de provas e títulos de Doutor : I - título de doutor ; e II - 10 (dez) anos de experiência ou de obtenção do título de doutor, ambos na área de conhecimento exigida no concurso, conforme disciplinado pelo Conselho Superior de cada IFE.   ( I e II do art. 9º da  Lei nº 12.772/2012 )";;
Variação dos padrões de remuneração -  Anexo III-A da Lei nº 12.772/2012 dos cargos do Plano de Carreiras e Cargos de Magistério Federal. (§ único do art. 16. da Lei nº 12.772/12  -  art. 1º da Lei nº 13.325/2016).;;
VB - Vencimento Básico - (Anexo III à Lei nº 12.772, de 28 de dezembro de 2012);;
( * ) RT - Retribuição por Titulação - Aperfeiçoamento, Especialização, Mestrado e Doutorado (Anexo IV à Lei nº 12.772, de 28 de dezembro de 2012);;
Instituída a RT a partir  de 01.03.2013 devida ao docente integrante do Plano de Carreiras e Cargos de Magistério Federal em conformidade com a Carreira, cargo, classe, nível e titulação comprovada, nos valores e vigência estabelecidos no Anexo IV à Lei nº 12.772, de 28 de dezembro de 2012.;;
 Os valores referentes à RT não serão percebidos cumulativamente para diferentes titulações ou com quaisquer outras Retribuições por Titulação, adicionais ou gratificações de mesma natureza. (§ 2º do art. 17 da Lei nº 12.772/2012);;
O ingresso no Cargo Isolado de Professor Titular-Livre do Magistério Superior ocorrerá na classe e nível únicos, mediante aprovação em concurso público de provas e títulos de Doutor ( item I, II e II do art. 9º da  Lei nº 12.772/2012 );;
A IFE poderá dispensar, no edital do concurso, a exigência de título de doutor, substituindo-a pelo título de mestre, de especialista ou por diploma de graduação, quando se tratar de provimento para área de conhecimento ou em localidade com grave carência de detentores da titulação acadêmica de doutor, conforme decisão fundamentada de seu Conselho Superior. (§ 3º  do art. 8º da Lei nº 12.772/2012 );;
Aposentado - RT -  a RT será considerada no cálculo dos proventos e das pensões, na forma dos regramentos de regime previdenciário aplicável a cada caso, desde que o certificado ou o título tenham sido obtidos anteriormente à data da inativação. (§ 1º do art. 17 da Lei nº 12.772/2012 );;
Legislações Correspondentes:;;
     Decreto nº 76.119 de 13.08.75;;
     Lei nº 7.596 de 20.04.87 ;     Medida Provisória nº 2.051-7 de 27.09.2000;Lei nº 11.498 de 28.06.2007
     Portaria nº 474 de 26.08.87;     Medida Provisória nº 2.051-8 de 26.10.2000;Medida Provisória nº 421 de 29.02.2008  SM
     Portaria nº 475 de 26.08.87;     Medida Provisória nº 2.051-9 de 23.11.2000;Medida Provisória nº 431 de 14.05.2008 art. 18
     Decreto nº 94.664 de 23.07.87;     Medida Provisória nº 2.051-10 de 21.12.2000;Lei nº 11.784 de 22.09.2008
 Lei nº 8.676 art. 4º de 13.07.93 ;    Medida Provisória nº 2.125-11 de 27.12.2000;Medida Provisória nº 479 de 30.12.2009 art. 26
     Lei nº 9.192 de 21.12.95;    Medida Provisória nº 2.125-12 de 26.01.2001;Lei nº 12.269 de 21.06.2010
     Decreto nº 1.916 de 23.05.96;    Lei nº 10.187 de 12.02.2001 art. 8º;Medida Provisória nº 568 de 11.05.2012 art. 27
     Lei nº 9.678 de 03.07.1998;     Lei nº 10.405 de 09.01.2002;Lei nº 12.702 de 07.08.2012
 Portaria MARE nº 2.179 de 28.07.98;     Medida Provisória nº 52 de 04.07.2002;Lei nº 12.772 de 28.12.2012
     Decreto nº 2668 de 13.07.1998;     Lei nº 10.697de 02.07.2003;Medida Provisória nº 614 de 14.05.2013
     Medida Provisória nº 2.020 de 24.03.2000;     Lei nº 10.698 de 02.07.2003;Lei nº 12.863 de 24.09.2013
     Medida Provisória nº 2.020-1 de 24.04.2000;     Medida Provisória nº 208 de 20.08.2004;Lei nº 13.325 de 29.07.2016 art. 1º e art.4º e art. 5º
     Medida Provisória nº 2.020-2 de 25.05.2000;     Lei nº 11.087 de 04.01.2005;Medida Provisória nº 849 de 31.08.2018 art.26
     Medida Provisória nº 2.020-3 de 21.06.2000;     Medida Provisória nº 248 de 20.04.2005;Medida Cautelar STF ADIN 6.004 - DF
     Medida Provisória nº 2.051-4 de 29.06.2000;     Medida Provisória nº 295 de 29.05.2006; Medida Provisória nº 1.170 de 28.04.2023
     Medida Provisória nº 2.051-5 de 28.07.2000;     Lei nº 11.344 de 09.09.2006;
     Medida Provisória nº 2.051-6 de 28.08.2000;     Medida Provisória nº 362 de 29.03.2007;
