<?xml version="1.0" encoding="UTF-8" standalone="no"?>
<svg width="260pt" height="254pt" viewBox="0.00 0.00 260.00 254.00" xmlns="http://www.w3.org/2000/svg" xmlns:xlink="http://www.w3.org/1999/xlink">
<g transform="translate(4 250)"> 
<g style="fill:none;stroke:black">
<path d="M99,-12C99,-44 99,-203 99,-234"/>
<path d="M98,-12C91,-42 59,-182 52,-212"/>
<path d="M97,-11C85,-36 31,-146 19,-170"/>
<path d="M95,-9C81,-21 36,-56 21,-67"/>
<path d="M95,-10C80,-29 24,-100 10,-119"/>
<path d="M94,-8C84,-13 65,-22 56,-27"/>
<path d="M8,-128C16,-145 41,-196 49,-212"/>
<path d="M7,-129C9,-139 14,-160 16,-170"/>
<path d="M57,-217C80,-217 172,-217 195,-217"/>
<path d="M56,-33C81,-53 206,-152 231,-172"/>
<path d="M56,-219C66,-224 85,-233 94,-238"/>
<path d="M56,-218C74,-222 130,-235 148,-239"/>
<path d="M56,-216C83,-210 203,-182 230,-176"/>
<path d="M54,-34C67,-64 137,-206 151,-235"/>
<path d="M54,-33C75,-58 177,-187 197,-212"/>
<path d="M52,-35C59,-65 91,-205 98,-235"/>
<path d="M51,-34C51,-61 51,-184 51,-212"/>
<path d="M50,-35C44,-58 24,-146 18,-169"/>
<path d="M49,-34C41,-51 16,-102 8,-118"/>
<path d="M47,-33C41,-41 27,-59 21,-67"/>
<path d="M245,-129C243,-139 238,-160 236,-170"/>
<path d="M244,-128C236,-145 211,-196 203,-212"/>
<path d="M242,-127C227,-146 171,-217 157,-236"/>
<path d="M242,-126C221,-144 125,-220 103,-237"/>
<path d="M242,-120C221,-102 125,-26 103,-9"/>
<path d="M241,-126C213,-139 83,-201 56,-215"/>
<path d="M241,-123C209,-123 45,-123 12,-123"/>
<path d="M241,-120C213,-107 83,-45 56,-31"/>
<path d="M240,-124C209,-131 54,-167 22,-174"/>
<path d="M240,-122C209,-115 54,-79 22,-72"/>
<path d="M236,-77C238,-87 243,-108 245,-118"/>
<path d="M235,-77C235,-95 235,-151 235,-169"/>
<path d="M234,-77C228,-100 208,-188 202,-211"/>
<path d="M233,-76C221,-101 167,-211 155,-235"/>
<path d="M231,-76C212,-99 121,-212 102,-236"/>
<path d="M231,-68C217,-56 172,-21 157,-10"/>
<path d="M231,-67C225,-59 211,-42 205,-33"/>
<path d="M230,-75C205,-95 80,-194 55,-214"/>
<path d="M230,-73C201,-87 52,-158 22,-173"/>
<path d="M230,-70C203,-64 83,-36 56,-30"/>
<path d="M230,-69C208,-59 125,-19 104,-8"/>
<path d="M23,-175C53,-175 199,-175 229,-175"/>
<path d="M229,-72C198,-79 43,-115 11,-122"/>
<path d="M229,-71C199,-71 53,-71 23,-71"/>
<path d="M22,-75C47,-95 172,-194 197,-214"/>
<path d="M22,-73C51,-87 200,-158 230,-173"/>
<path d="M22,-177C44,-187 127,-227 148,-238"/>
<path d="M22,-176C49,-182 169,-210 196,-216"/>
<path d="M21,-76C40,-99 131,-212 150,-236"/>
<path d="M21,-179C27,-187 41,-205 47,-213"/>
<path d="M21,-178C35,-190 80,-225 95,-236"/>
<path d="M205,-213C211,-205 225,-188 231,-179"/>
<path d="M203,-34C211,-51 236,-102 244,-118"/>
<path d="M202,-35C208,-58 228,-146 234,-169"/>
<path d="M201,-34C201,-61 201,-184 201,-212"/>
<path d="M200,-35C193,-65 161,-205 154,-235"/>
<path d="M198,-34C185,-64 115,-206 101,-235"/>
<path d="M198,-33C177,-58 75,-187 55,-212"/>
<path d="M196,-33C171,-53 46,-152 21,-172"/>
<path d="M196,-32C168,-45 38,-107 11,-121"/>
<path d="M196,-30C169,-36 49,-64 22,-70"/>
<path d="M196,-28C178,-24 122,-11 104,-7"/>
<path d="M196,-27C186,-23 167,-13 158,-8"/>
<path d="M195,-29C172,-29 80,-29 57,-29"/>
<path d="M19,-76C31,-101 85,-211 97,-235"/>
<path d="M18,-77C24,-100 44,-188 50,-211"/>
<path d="M17,-77C17,-95 17,-151 17,-169"/>
<path d="M16,-77C14,-87 9,-108 7,-118"/>
<path d="M158,-238C168,-234 187,-224 196,-219"/>
<path d="M157,-237C171,-225 216,-190 231,-179"/>
<path d="M157,-10C172,-29 228,-100 242,-119"/>
<path d="M155,-11C167,-36 221,-146 233,-170"/>
<path d="M154,-12C161,-42 193,-182 200,-212"/>
<path d="M153,-12C153,-44 153,-203 153,-234"/>
<path d="M152,-11C145,-42 108,-202 100,-234"/>
<path d="M150,-11C137,-41 67,-183 53,-212"/>
<path d="M149,-9C128,-27 32,-103 10,-120"/>
<path d="M149,-11C130,-34 39,-147 20,-171"/>
<path d="M148,-8C126,-18 43,-58 22,-69"/>
<path d="M148,-7C130,-11 74,-24 56,-28"/>
<path d="M147,-6C137,-6 115,-6 105,-6"/>
<path d="M12,-124C43,-131 198,-167 230,-174"/>
<path d="M11,-126C39,-139 169,-201 196,-215"/>
<path d="M105,-240C116,-240 137,-240 147,-240"/>
<path d="M104,-239C122,-235 178,-222 196,-218"/>
<path d="M104,-238C126,-228 209,-188 230,-177"/>
<path d="M103,-11C122,-34 213,-147 232,-171"/>
<path d="M102,-11C115,-41 185,-183 199,-212"/>
<path d="M100,-11C107,-42 144,-202 152,-234"/>
<path d="M10,-127C25,-146 81,-217 95,-236"/>
<path d="M10,-126C31,-144 127,-220 149,-237"/>
</g>
<g style="fill:blue;stroke:black">
<circle cx="99" cy="-6" r="5.4"/>
<circle cx="99" cy="-240" r="5.4"/>
<circle cx="6" cy="-123" r="5.4"/>
<circle cx="51" cy="-29" r="5.4"/>
<circle cx="51" cy="-217" r="5.4"/>
<circle cx="246" cy="-123" r="5.4"/>
<circle cx="235" cy="-71" r="5.4"/>
<circle cx="235" cy="-175" r="5.4"/>
<circle cx="201" cy="-29" r="5.4"/>
<circle cx="201" cy="-217" r="5.4"/>
<circle cx="17" cy="-71" r="5.4"/>
<circle cx="17" cy="-175" r="5.4"/>
<circle cx="153" cy="-6" r="5.4"/>
<circle cx="153" cy="-240" r="5.4"/>
</g></g></svg>