<?xml version="1.0" encoding="UTF-8" standalone="no"?>
<svg width="249pt" height="250pt" viewBox="0.00 0.00 249.00 250.00" xmlns="http://www.w3.org/2000/svg" xmlns:xlink="http://www.w3.org/1999/xlink">
<g transform="translate(4 246)"> 
<g style="fill:none;stroke:black">
<path d="M9,-98C19,-119 64,-204 75,-225"/>
<path d="M9,-154C14,-163 24,-184 29,-193"/>
<path d="M83,-231C94,-232 117,-234 127,-235"/>
<path d="M83,-229C101,-227 161,-220 179,-218"/>
<path d="M83,-228C106,-219 194,-186 217,-177"/>
<path d="M83,-227C105,-211 208,-140 230,-124"/>
<path d="M83,-15C105,-31 208,-102 230,-118"/>
<path d="M82,-16C103,-39 198,-148 218,-171"/>
<path d="M81,-17C95,-46 168,-184 182,-212"/>
<path d="M79,-18C87,-49 124,-200 132,-231"/>
<path d="M78,-18C78,-48 78,-194 78,-224"/>
<path d="M77,-17C70,-44 40,-166 33,-193"/>
<path d="M75,-17C65,-38 20,-123 9,-144"/>
<path d="M74,-16C61,-30 22,-74 10,-89"/>
<path d="M73,-15C65,-21 45,-35 37,-41"/>
<path d="M7,-98C12,-116 26,-174 31,-193"/>
<path d="M6,-99C6,-110 6,-133 6,-143"/>
<path d="M37,-47C63,-65 192,-154 217,-172"/>
<path d="M37,-46C67,-57 202,-108 230,-119"/>
<path d="M37,-201C45,-207 65,-221 73,-227"/>
<path d="M37,-200C55,-207 110,-228 128,-234"/>
<path d="M37,-199C61,-202 156,-213 179,-216"/>
<path d="M37,-197C65,-194 189,-179 217,-176"/>
<path d="M37,-196C67,-185 202,-134 230,-123"/>
<path d="M36,-48C57,-72 160,-189 181,-213"/>
<path d="M35,-49C49,-77 116,-204 130,-231"/>
<path d="M33,-49C40,-76 70,-198 77,-225"/>
<path d="M32,-49C32,-73 32,-168 32,-192"/>
<path d="M31,-49C26,-67 12,-125 7,-144"/>
<path d="M29,-49C24,-58 14,-79 9,-88"/>
<path d="M223,-72C226,-83 231,-105 234,-116"/>
<path d="M223,-170C226,-159 231,-137 234,-126"/>
<path d="M222,-73C222,-91 222,-151 222,-169"/>
<path d="M221,-72C215,-96 192,-188 186,-212"/>
<path d="M219,-72C207,-97 149,-207 136,-231"/>
<path d="M218,-71C197,-94 102,-203 82,-226"/>
<path d="M218,-63C211,-55 196,-38 189,-29"/>
<path d="M217,-70C191,-88 62,-177 37,-195"/>
<path d="M217,-69C186,-81 40,-136 11,-147"/>
<path d="M217,-66C189,-63 65,-48 37,-45"/>
<path d="M217,-65C194,-56 106,-23 83,-14"/>
<path d="M217,-64C202,-53 153,-20 138,-9"/>
<path d="M216,-68C186,-72 42,-89 12,-92"/>
<path d="M189,-213C196,-205 211,-188 218,-179"/>
<path d="M188,-30C196,-46 224,-99 232,-116"/>
<path d="M188,-212C196,-196 224,-143 232,-126"/>
<path d="M186,-30C192,-54 215,-146 221,-170"/>
<path d="M185,-31C185,-58 185,-183 185,-211"/>
<path d="M184,-31C176,-61 141,-201 134,-231"/>
<path d="M182,-30C168,-59 95,-197 81,-225"/>
<path d="M181,-29C160,-53 57,-170 36,-194"/>
<path d="M180,-28C155,-46 35,-129 11,-146"/>
<path d="M180,-27C153,-37 37,-81 11,-91"/>
<path d="M180,-26C156,-29 61,-40 38,-43"/>
<path d="M180,-24C162,-22 102,-15 84,-13"/>
<path d="M180,-23C170,-19 148,-11 138,-8"/>
<path d="M138,-234C148,-230 170,-222 180,-219"/>
<path d="M138,-233C153,-222 202,-189 217,-178"/>
<path d="M137,-232C153,-214 215,-143 231,-125"/>
<path d="M137,-10C153,-28 215,-99 231,-117"/>
<path d="M136,-11C148,-36 206,-146 219,-170"/>
<path d="M134,-12C142,-42 177,-182 184,-212"/>
<path d="M133,-12C133,-43 133,-199 133,-231"/>
<path d="M132,-12C124,-43 87,-194 79,-225"/>
<path d="M130,-11C116,-39 49,-166 35,-193"/>
<path d="M129,-10C111,-31 28,-124 10,-145"/>
<path d="M128,-9C109,-23 30,-76 11,-90"/>
<path d="M128,-8C110,-15 55,-36 37,-42"/>
<path d="M128,-7C117,-8 94,-10 84,-11"/>
<path d="M12,-94C43,-98 198,-117 230,-120"/>
<path d="M12,-150C42,-154 186,-171 216,-174"/>
<path d="M12,-148C43,-144 198,-125 230,-122"/>
<path d="M11,-96C36,-114 156,-197 180,-214"/>
<path d="M11,-95C42,-107 188,-162 217,-173"/>
<path d="M11,-152C30,-166 109,-219 128,-233"/>
<path d="M11,-151C38,-161 154,-205 180,-215"/>
<path d="M10,-97C28,-118 111,-211 129,-232"/>
<path d="M10,-153C23,-167 62,-211 74,-226"/>
</g>
<g style="fill:blue;stroke:black">
<circle cx="78" cy="-230" r="5.4"/>
<circle cx="78" cy="-12" r="5.4"/>
<circle cx="6" cy="-93" r="5.4"/>
<circle cx="6" cy="-149" r="5.4"/>
<circle cx="32" cy="-44" r="5.4"/>
<circle cx="32" cy="-198" r="5.4"/>
<circle cx="235" cy="-121" r="5.4"/>
<circle cx="222" cy="-67" r="5.4"/>
<circle cx="222" cy="-175" r="5.4"/>
<circle cx="185" cy="-25" r="5.4"/>
<circle cx="185" cy="-217" r="5.4"/>
<circle cx="133" cy="-6" r="5.4"/>
<circle cx="133" cy="-236" r="5.4"/>
</g></g></svg>