Adapt milligram theme to trust_http_auth feature

32 jobs for master in 10 minutes and 12 seconds (queued for 11 seconds)
latest
Status Job ID Name Coverage
  Carton
passed #971465
carton

00:00:16

passed #971464
podcheck

00:00:34

 
  Carton Bdd
passed #971468
carton_mysql

00:00:51

passed #971467
carton_postgresql

00:00:41

passed #971466
carton_sqlite

00:01:17

 
  Tests
failed #971520
mysql 1/3

00:02:52

failed #971531
mysql 2/3

00:02:55

failed #971521
mysql 3/3

00:02:58

failed #971518
postgresql 1/3

00:02:32

failed #971517
postgresql 2/3

00:02:34

failed #971519
postgresql 3/3

00:03:05

failed #971514
sqlite 1/3

00:02:04

failed #971513
sqlite 2/3

00:01:51

failed #971511
sqlite 3/3

00:01:52

failed #971509
mysql 1/3

00:03:03

failed #971475
mysql 1/3

00:03:16

failed #971515
mysql 2/3

00:03:11

failed #971476
mysql 2/3

00:04:11

failed #971477
mysql 3/3

00:02:19

failed #971510
mysql 3/3

00:03:13

failed #971472
postgresql 1/3

00:03:06

failed #971485
postgresql 1/3

00:03:13

failed #971473
postgresql 2/3

00:03:10

failed #971486
postgresql 2/3

00:03:10

failed #971488
postgresql 3/3

00:03:10

failed #971474
postgresql 3/3

00:02:37

failed #971484
sqlite 1/3

00:03:03

failed #971469
sqlite 1/3

00:02:20

failed #971483
sqlite 2/3

00:03:06

failed #971470
sqlite 2/3

00:02:19

failed #971471
sqlite 3/3

00:01:24

failed #971482
sqlite 3/3

00:01:41

 
Name Stage Failure
failed
mysql 2/3 Tests
  Failed tests:  178-180
Non-zero exit status: 3
Files=1, Tests=188, 105 wallclock secs ( 0.05 usr 0.00 sys + 30.33 cusr 1.00 csys = 31.38 CPU)
Result: FAIL
make: *** [Makefile:24: test] Error 1
Running after_script
Uploading artifacts for failed job
Authenticating with credentials from /root/.docker/config.json
ERROR: Job failed: exit code 1
failed
mysql 3/3 Tests
  Failed tests:  92-93, 178-180
Non-zero exit status: 5
Files=1, Tests=188, 107 wallclock secs ( 0.04 usr 0.00 sys + 30.51 cusr 0.87 csys = 31.42 CPU)
Result: FAIL
make: *** [Makefile:24: test] Error 1
Running after_script
Uploading artifacts for failed job
Authenticating with credentials from /root/.docker/config.json
ERROR: Job failed: exit code 1
failed
mysql 1/3 Tests
  Failed tests:  178-180
Non-zero exit status: 3
Files=1, Tests=188, 118 wallclock secs ( 0.04 usr 0.01 sys + 29.39 cusr 0.88 csys = 30.32 CPU)
Result: FAIL
make: *** [Makefile:24: test] Error 1
Running after_script
Uploading artifacts for failed job
Authenticating with credentials from /root/.docker/config.json
ERROR: Job failed: exit code 1
failed
postgresql 3/3 Tests
  Failed tests:  178-180
Non-zero exit status: 3
Files=1, Tests=188, 98 wallclock secs ( 0.04 usr 0.01 sys + 29.47 cusr 0.99 csys = 30.51 CPU)
Result: FAIL
make: *** [Makefile:24: test] Error 1
Running after_script
Uploading artifacts for failed job
Authenticating with credentials from /root/.docker/config.json
ERROR: Job failed: exit code 1
failed
postgresql 1/3 Tests
  Failed tests:  178-180
Non-zero exit status: 3
Files=1, Tests=188, 103 wallclock secs ( 0.05 usr 0.01 sys + 30.26 cusr 1.05 csys = 31.37 CPU)
Result: FAIL
make: *** [Makefile:24: test] Error 1
Running after_script
Uploading artifacts for failed job
Authenticating with credentials from /root/.docker/config.json
ERROR: Job failed: exit code 1
failed
postgresql 2/3 Tests
  Failed tests:  178-180
Non-zero exit status: 3
Files=1, Tests=188, 97 wallclock secs ( 0.04 usr 0.00 sys + 30.28 cusr 0.96 csys = 31.28 CPU)
Result: FAIL
make: *** [Makefile:24: test] Error 1
Running after_script
Uploading artifacts for failed job
Authenticating with credentials from /root/.docker/config.json
ERROR: Job failed: exit code 1
failed
sqlite 1/3 Tests
  Failed tests:  178-180
Non-zero exit status: 3
Files=1, Tests=188, 87 wallclock secs ( 0.03 usr 0.02 sys + 29.45 cusr 0.93 csys = 30.43 CPU)
Result: FAIL
make: *** [Makefile:24: test] Error 1
Running after_script
Uploading artifacts for failed job
Authenticating with credentials from /root/.docker/config.json
ERROR: Job failed: exit code 1
failed
sqlite 3/3 Tests
  Failed tests:  178-180
Non-zero exit status: 3
Files=1, Tests=188, 84 wallclock secs ( 0.04 usr 0.00 sys + 30.58 cusr 0.83 csys = 31.45 CPU)
Result: FAIL
make: *** [Makefile:24: test] Error 1
Running after_script
Uploading artifacts for failed job
Authenticating with credentials from /root/.docker/config.json
ERROR: Job failed: exit code 1
failed
sqlite 2/3 Tests
  Failed tests:  178-180
Non-zero exit status: 3
Files=1, Tests=188, 88 wallclock secs ( 0.04 usr 0.00 sys + 30.21 cusr 0.82 csys = 31.07 CPU)
Result: FAIL
make: *** [Makefile:24: test] Error 1
Running after_script
Uploading artifacts for failed job
Authenticating with credentials from /root/.docker/config.json
ERROR: Job failed: exit code 1