{
"type": "FeatureCollection",
"name": "result.tasks_hotosm_299_buffer_mapped",
"crs": { "type": "name", "properties": { "name": "urn:ogc:def:crs:OGC:1.3:CRS84" } },
"features": [
{ "type": "Feature", "properties": { "taskid": 1779, "taskstatus": "MAPPED", "percent_intersect": 82, "surface": 31240947.546787001, "url": "http:\/\/taches.francophonelibre.org\/project\/299#task\/1779" }, "geometry": { "type": "Polygon", "coordinates": [ [ [ -11.823442882423555, 10.460412405758399 ], [ -11.824476866731651, 10.461071673345328 ], [ -11.826978127516469, 10.4629574028696 ], [ -11.82915426823882, 10.465210554641875 ], [ -11.830216429108241, 10.466498490773974 ], [ -11.8320301079471, 10.469091041966371 ], [ -11.833412237836503, 10.471937174356922 ], [ -11.834017668770754, 10.473484819252683 ], [ -11.834938339619338, 10.476534841071516 ], [ -11.835363012106619, 10.479692359271832 ], [ -11.835452449307569, 10.481348215997182 ], [ -11.8353699740175, 10.484536626312755 ], [ -11.834781698427863, 10.487671382179576 ], [ -11.834346387159142, 10.489273363518306 ], [ -11.833274043225082, 10.492259763775147 ], [ -11.831742882536059, 10.495038982181708 ], [ -11.830825434097648, 10.496430277023608 ], [ -11.828894056589061, 10.498910435381175 ], [ -11.826597925385661, 10.501057336882425 ], [ -11.825288146022942, 10.502101759229575 ], [ -11.822711179165402, 10.503846919218372 ], [ -11.819894665231748, 10.505171151385662 ], [ -11.818320765274519, 10.505766469798193 ], [ -11.815353548595105, 10.50663338579194 ], [ -11.812288182403332, 10.507032695537804 ], [ -11.810604226145411, 10.507120638770834 ], [ -11.807518874297468, 10.507043309824637 ], [ -11.807345474297449, 10.507025510127706 ], [ -11.804679257572513, 10.50656790589178 ], [ -11.803244375603862, 10.50622032879957 ], [ -11.800658979948469, 10.505405019869125 ], [ -11.800413879948469, 10.505309021395735 ], [ -11.798550489410548, 10.504466919954087 ], [ -11.798362825888702, 10.504370269368772 ], [ -11.796480816369453, 10.503717967986836 ], [ -11.796416824020064, 10.503689152369509 ], [ -11.796011290290915, 10.503583736517392 ], [ -11.794725820090994, 10.503067903698623 ], [ -11.792420703730807, 10.501967132184229 ], [ -11.792085403730788, 10.501779834971337 ], [ -11.789993117988368, 10.500433855540539 ], [ -11.788913895937908, 10.499640529129879 ], [ -11.786997641397949, 10.498038322185964 ], [ -11.78639414139796, 10.497466029235555 ], [ -11.784635805435556, 10.495567973879055 ], [ -11.783768225795535, 10.494500530334284 ], [ -11.783481780833586, 10.494035643368411 ], [ -11.783481675047129, 10.494035726886741 ], [ -11.783137922552369, 10.493600321165212 ], [ -11.781268205294277, 10.490767223703745 ], [ -11.780413798230096, 10.489197196041074 ], [ -11.779043055037187, 10.486067958720795 ], [ -11.778224876007668, 10.482751085768271 ], [ -11.778178982858069, 10.482459919626613 ], [ -11.777595336296608, 10.480411166170562 ], [ -11.777286772732998, 10.478780941187042 ], [ -11.776945354459681, 10.475608786767916 ], [ -11.777112702064203, 10.472422703769093 ], [ -11.777331547258763, 10.470778496963923 ], [ -11.778000946836725, 10.467667738224124 ], [ -11.779155222602835, 10.464702512568632 ], [ -11.779880054463156, 10.463205271384831 ], [ -11.781475451076489, 10.460481458826562 ], [ -11.783479541640597, 10.458042593062059 ], [ -11.784639408573966, 10.45683888098703 ], [ -11.786976675306047, 10.45476504241195 ], [ -11.789608430757523, 10.453080558676202 ], [ -11.791089796907254, 10.452288207406751 ], [ -11.793926813471291, 10.451042906339266 ], [ -11.796922123809175, 10.450250723460721 ], [ -11.798579982735244, 10.449947297198571 ], [ -11.801650501392448, 10.449627537680625 ], [ -11.804733650865023, 10.449784127282197 ], [ -11.806405719784753, 10.449999328934798 ], [ -11.809431562958414, 10.450629559320477 ], [ -11.809831262958424, 10.450745661224307 ], [ -11.813272243668562, 10.452101255261567 ], [ -11.815058975164723, 10.453004086159988 ], [ -11.818206287883175, 10.454981386178762 ], [ -11.818522787883165, 10.455223989450602 ], [ -11.821874642443454, 10.458481371399762 ], [ -11.823437392279425, 10.460403737144592 ], [ -11.823442882423555, 10.460412405758399 ] ] ] } },
{ "type": "Feature", "properties": { "taskid": 1778, "taskstatus": "MAPPED", "percent_intersect": 92, "surface": 32656668.544163, "url": "http:\/\/taches.francophonelibre.org\/project\/299#task\/1778" }, "geometry": { "type": "Polygon", "coordinates": [ [ [ -11.826315836970181, 10.455564776256775 ], [ -11.826997090769959, 10.456684506651373 ], [ -11.827061590769949, 10.456806607613322 ], [ -11.828091501317761, 10.459092786311677 ], [ -11.828555208411832, 10.460322724563898 ], [ -11.829723013491476, 10.465208481696152 ], [ -11.829865350931355, 10.466512732773221 ], [ -11.829980355371976, 10.469031404779347 ], [ -11.829974355371977, 10.469375304678517 ], [ -11.829664490142351, 10.472550398016701 ], [ -11.82937215774516, 10.474183544715691 ], [ -11.828565009520668, 10.477258636992204 ], [ -11.82728078019721, 10.480166976004446 ], [ -11.826489540809551, 10.481631351847286 ], [ -11.824777116631816, 10.484277998737539 ], [ -11.822670106414373, 10.486622704320288 ], [ -11.821457412060402, 10.487774969291747 ], [ -11.819034543570229, 10.489741322906275 ], [ -11.816335309261754, 10.49130688108341 ], [ -11.814819866914174, 10.492034247434841 ], [ -11.811933760163136, 10.493153752219492 ], [ -11.808909466271409, 10.493814471220052 ], [ -11.807239617985909, 10.494045742401251 ], [ -11.804158204013886, 10.494231993886826 ], [ -11.801084834096185, 10.493941823192527 ], [ -11.799424036257475, 10.493654361867778 ], [ -11.796421837568117, 10.492891267855645 ], [ -11.793573483836479, 10.49167373327248 ], [ -11.792477108630154, 10.491100905552175 ], [ -11.792295954055827, 10.491016250559547 ], [ -11.789569005150724, 10.489470814634066 ], [ -11.789428205150724, 10.489375715974166 ], [ -11.787452325083168, 10.487853489357134 ], [ -11.786445813942096, 10.486972793504444 ], [ -11.783118445671478, 10.483227627531701 ], [ -11.782365497199908, 10.48212897963387 ], [ -11.781072453368369, 10.479960346102009 ], [ -11.78092545336837, 10.47967414830762 ], [ -11.779787893803773, 10.476843506748544 ], [ -11.778138400822606, 10.475152743222559 ], [ -11.776777653840167, 10.473433355474558 ], [ -11.774548164364438, 10.469918262922397 ], [ -11.774369364364437, 10.469558265620558 ], [ -11.773186728941678, 10.466610019020955 ], [ -11.772692804727557, 10.465024439978894 ], [ -11.771990205728583, 10.461914500493222 ], [ -11.77179073076522, 10.458732429045739 ], [ -11.77181923156874, 10.457074350500219 ], [ -11.772127748562164, 10.453902142142235 ], [ -11.772936260111271, 10.450819221825935 ], [ -11.773484396075212, 10.449250948192965 ], [ -11.774762788955615, 10.446353344083592 ], [ -11.776482560083343, 10.443693873234052 ], [ -11.777496675840462, 10.442368920506642 ], [ -11.779592238156482, 10.440035610998024 ], [ -11.782026795538275, 10.438058581651232 ], [ -11.783407622372506, 10.437106649250941 ], [ -11.786094508814134, 10.435547372954225 ], [ -11.78899044988963, 10.434422994634012 ], [ -11.79060282284966, 10.433937268070082 ], [ -11.793620666188886, 10.433277307747471 ], [ -11.796704142502954, 10.433089958159487 ], [ -11.798390231289384, 10.433117985956397 ], [ -11.801466809090297, 10.433407895245862 ], [ -11.804462002524181, 10.434168286365493 ], [ -11.806056761018921, 10.434707324833024 ], [ -11.80891606235137, 10.435928917546166 ], [ -11.811551467709053, 10.437578927081667 ], [ -11.812898789839313, 10.438576208937546 ], [ -11.814862964672871, 10.440284277039039 ], [ -11.815785042709106, 10.441067031220767 ], [ -11.815896914576459, 10.441174856554099 ], [ -11.816192646136171, 10.441395598530276 ], [ -11.816779636789674, 10.441850961884709 ], [ -11.817156836789684, 10.44215496590019 ], [ -11.818023445491331, 10.442895112140853 ], [ -11.81847647271614, 10.443304918905353 ], [ -11.819301040935688, 10.444094772093964 ], [ -11.819491340935699, 10.444287774388494 ], [ -11.821652537292518, 10.44688642943629 ], [ -11.822676237818209, 10.448353772194219 ], [ -11.823316764957349, 10.449461897144763 ], [ -11.823327793505065, 10.449454853906687 ], [ -11.823905897401884, 10.450360069141837 ], [ -11.825074674183282, 10.452458076390663 ], [ -11.825162474183273, 10.452640677724004 ], [ -11.826108829596512, 10.454974844076441 ], [ -11.826259662361869, 10.455426703932963 ], [ -11.826315836970181, 10.455564776256775 ] ] ] } },
{ "type": "Feature", "properties": { "taskid": 1776, "taskstatus": "MAPPED", "percent_intersect": 85, "surface": 106435105.784629, "url": "http:\/\/taches.francophonelibre.org\/project\/299#task\/1776" }, "geometry": { "type": "Polygon", "coordinates": [ [ [ -11.923989043635927, 10.491803813116602 ], [ -11.924349365109309, 10.491974901118196 ], [ -11.926919829053391, 10.493729996481639 ], [ -11.9282254866702, 10.494779315739859 ], [ -11.93051366163701, 10.496935260598985 ], [ -11.932435715810261, 10.499423141357665 ], [ -11.933347679813831, 10.500817799362155 ], [ -11.934868291559738, 10.503603323163004 ], [ -11.935929153658943, 10.506594305365116 ], [ -11.936358154658564, 10.508197779640858 ], [ -11.936934224954651, 10.51133518838008 ], [ -11.937004167551795, 10.514524278942622 ], [ -11.936908211940604, 10.516179608289852 ], [ -11.936471058241818, 10.519335588219544 ], [ -11.935538283750297, 10.52238210170564 ], [ -11.934926764332086, 10.523927251406999 ], [ -11.933533447067626, 10.526767771501834 ], [ -11.9317096236529, 10.529353028850826 ], [ -11.93064240020901, 10.530636751586036 ], [ -11.928457699738031, 10.532881025397812 ], [ -11.92594940946079, 10.534756701535958 ], [ -11.92453094925771, 10.535653341493008 ], [ -11.921787279752813, 10.537102891165809 ], [ -11.918852409987085, 10.538110589565246 ], [ -11.917221561792486, 10.538532381011647 ], [ -11.914181582939593, 10.539072449735714 ], [ -11.911654150184454, 10.539126262703 ], [ -11.910650778363387, 10.539417192491532 ], [ -11.910084495736527, 10.539565055252613 ], [ -11.909041279449958, 10.539807808428577 ], [ -11.90847637944996, 10.539923406485157 ], [ -11.907052435546486, 10.540161605874895 ], [ -11.906269125260595, 10.540263731500493 ], [ -11.904832626629593, 10.5403985348904 ], [ -11.904360026629604, 10.540425734424161 ], [ -11.901528902649275, 10.540387925053821 ], [ -11.900213004446536, 10.540276866810554 ], [ -11.900058252563328, 10.54029122353564 ], [ -11.898754048054334, 10.541899718383547 ], [ -11.898528448054323, 10.542134415613157 ], [ -11.896199653902489, 10.544206570561503 ], [ -11.89487125653125, 10.545214622263732 ], [ -11.892268670508489, 10.546889029466156 ], [ -11.889438929182818, 10.548141889200993 ], [ -11.887859586739488, 10.548699426473163 ], [ -11.884890067568966, 10.549497069680232 ], [ -11.881833375652617, 10.549830106192365 ], [ -11.880156173955136, 10.549883089399325 ], [ -11.877088489182166, 10.549744130714892 ], [ -11.877078450015659, 10.549742898672104 ], [ -11.876996384525691, 10.54974036835195 ], [ -11.874739516315378, 10.549542405409838 ], [ -11.873513254430279, 10.549364391980419 ], [ -11.871290821315766, 10.548911818037164 ], [ -11.870869921315775, 10.548800919878163 ], [ -11.868652093512583, 10.548075810739769 ], [ -11.86861479881828, 10.54806115821772 ], [ -11.868198574498903, 10.54816705119174 ], [ -11.863820086166312, 10.5487768570789 ], [ -11.863273886166292, 10.548791956819491 ], [ -11.861023079498633, 10.548727374575178 ], [ -11.859795365800794, 10.548622756766157 ], [ -11.85756463308177, 10.548305284255903 ], [ -11.856420133081789, 10.548075988117093 ], [ -11.85502533550172, 10.547744134950662 ], [ -11.854270533315111, 10.547535700181763 ], [ -11.853769828022211, 10.547377886705293 ], [ -11.852875434286021, 10.547131215415222 ], [ -11.852212868042491, 10.546925612807213 ], [ -11.851009957995169, 10.546509935354617 ], [ -11.850227457995199, 10.546211340138067 ], [ -11.848403361411052, 10.545409022291215 ], [ -11.847436559120011, 10.544924934720266 ], [ -11.847265094746312, 10.544828078921888 ], [ -11.844767521678312, 10.543670862221536 ], [ -11.844396024613987, 10.543458766205624 ], [ -11.84375896333059, 10.543163353013902 ], [ -11.843287255939041, 10.542930571201092 ], [ -11.842427885521847, 10.542480240045247 ], [ -11.842093685521835, 10.542294642821457 ], [ -11.839190941550248, 10.540331443961401 ], [ -11.837731803191019, 10.539145742074382 ], [ -11.835202922555379, 10.536690573081868 ], [ -11.834959922555377, 10.536408976211398 ], [ -11.832739807548187, 10.533270754983793 ], [ -11.831734817113867, 10.531513271941643 ], [ -11.831150621160706, 10.530214412335818 ], [ -11.831021124570823, 10.529995205399873 ], [ -11.831007807681148, 10.530001734625239 ], [ -11.830992079299149, 10.529969655302491 ], [ -11.830946431222392, 10.52987583637417 ], [ -11.829961725024649, 10.528569021652503 ], [ -11.82804895872432, 10.525482930579592 ], [ -11.827918758724321, 10.525222732551551 ], [ -11.827044946798852, 10.523206754087539 ], [ -11.826645720702592, 10.522126644608839 ], [ -11.826476226365449, 10.521576677678496 ], [ -11.826179865429957, 10.521083624804223 ], [ -11.825376120842751, 10.519287502253366 ], [ -11.821765701282581, 10.519078240546985 ], [ -11.821449001282561, 10.519027041412805 ], [ -11.818627375173156, 10.518357922883013 ], [ -11.817120644800136, 10.517882908356503 ], [ -11.811890329483777, 10.515348536200595 ], [ -11.810588810536938, 10.514463780735435 ], [ -11.808290779738602, 10.512641597212898 ], [ -11.808086779738602, 10.512453899561509 ], [ -11.806163104835115, 10.510417335629356 ], [ -11.805337331764211, 10.509410272719681 ], [ -11.803874306482109, 10.508824014949809 ], [ -11.803437106482111, 10.50862181808299 ], [ -11.80218124302262, 10.507986442506169 ], [ -11.80151330610326, 10.507618443334339 ], [ -11.800302842339391, 10.506894769165935 ], [ -11.799903942339391, 10.506636772856854 ], [ -11.7979965324249, 10.505236411624949 ], [ -11.797543025529341, 10.504860218782659 ], [ -11.797388365983103, 10.504748780410532 ], [ -11.796364185378662, 10.503959289417528 ], [ -11.795716728996453, 10.503425956380479 ], [ -11.794548286627965, 10.502384089838211 ], [ -11.794147886627965, 10.501997894558311 ], [ -11.793352773066573, 10.501186142162553 ], [ -11.792940977099523, 10.500741114383532 ], [ -11.792191864493178, 10.499883840131851 ], [ -11.791585864493168, 10.499149148054581 ], [ -11.791048851990377, 10.498441920441056 ], [ -11.789848471216159, 10.497109231686233 ], [ -11.789744571216147, 10.496971933089192 ], [ -11.788574999221549, 10.495246373354316 ], [ -11.78800548999738, 10.494303844343287 ], [ -11.787019146796325, 10.49246010182101 ], [ -11.786823846796326, 10.492044104805169 ], [ -11.786394992352813, 10.491063206371773 ], [ -11.786183717516213, 10.490542419269595 ], [ -11.785939004476186, 10.48988950512957 ], [ -11.785895933649288, 10.489780219597549 ], [ -11.785889722371495, 10.48975801649701 ], [ -11.785807532091971, 10.489538726198184 ], [ -11.78571247973, 10.489262838819602 ], [ -11.785747793653108, 10.489250672000594 ], [ -11.784791743978941, 10.485833135747169 ], [ -11.78443085738121, 10.48373239466452 ], [ -11.784368338083494, 10.482804201283377 ], [ -11.784269283796041, 10.482333164704547 ], [ -11.784206383796041, 10.481949965749218 ], [ -11.78407545551508, 10.481014661138481 ], [ -11.7840187151237, 10.480525452385102 ], [ -11.783932063805826, 10.479584674441968 ], [ -11.783894004312533, 10.479027693258228 ], [ -11.783834305448634, 10.478634284427613 ], [ -11.783717005356195, 10.476980082561923 ], [ -11.78374582829794, 10.473790476477363 ], [ -11.784281364791891, 10.470646018113785 ], [ -11.784689648081152, 10.469037126709924 ], [ -11.785712123535033, 10.466032040747164 ], [ -11.787197164644681, 10.463226572764809 ], [ -11.78809106570262, 10.461820483193518 ], [ -11.7899818903386, 10.459307195883826 ], [ -11.792243342227799, 10.457121408552466 ], [ -11.79353535979069, 10.456055762234707 ], [ -11.796084463637156, 10.454267488619047 ], [ -11.798880245729496, 10.45289655629516 ], [ -11.800443908116266, 10.4522756700346 ], [ -11.803397362606724, 10.451360118624885 ], [ -11.806456644752394, 10.45091076290363 ], [ -11.808138889793943, 10.45079541613527 ], [ -11.811226574211362, 10.450822625433071 ], [ -11.814273270769245, 10.451324796212429 ], [ -11.815909428600026, 10.451726280433599 ], [ -11.81885604251903, 10.452697091028297 ], [ -11.821617065517293, 10.454111926284263 ], [ -11.823046977609053, 10.454990939553463 ], [ -11.825577590670827, 10.456834230256121 ], [ -11.827789537461902, 10.459049859845285 ], [ -11.828873234056291, 10.460320354643414 ], [ -11.830597995322726, 10.462700509804952 ], [ -11.83172206918627, 10.463355920265256 ], [ -11.833081433380201, 10.464294823134306 ], [ -11.835474164030469, 10.466235893019521 ], [ -11.835656464030469, 10.466408695148791 ], [ -11.836935530438922, 10.467738380868933 ], [ -11.837531875983979, 10.468418510328686 ], [ -11.838046498340782, 10.468523427657813 ], [ -11.839204977601241, 10.468519506763606 ], [ -11.840505420331311, 10.468592630994976 ], [ -11.841040129778884, 10.468687403736043 ], [ -11.841413252610689, 10.46866799040748 ], [ -11.84160655261068, 10.468680090614342 ], [ -11.845125005500208, 10.469217671486984 ], [ -11.847008458377807, 10.469680014217493 ], [ -11.848792026190734, 10.470291061419863 ], [ -11.851531532479843, 10.470891341207386 ], [ -11.853108608366034, 10.471364240921115 ], [ -11.855942417346748, 10.472454606061333 ], [ -11.858578510475308, 10.473961384908989 ], [ -11.859936409253457, 10.474880942137759 ], [ -11.862329133052217, 10.476783413082263 ], [ -11.862524433052217, 10.476964715340863 ], [ -11.865130847997515, 10.479912461161002 ], [ -11.866350227977696, 10.481600811624041 ], [ -11.868339268411543, 10.485024163286731 ], [ -11.868404368411541, 10.485167164287772 ], [ -11.869339893976818, 10.487645630350235 ], [ -11.869742188669939, 10.488971219969004 ], [ -11.869962762156455, 10.489920918567599 ], [ -11.869974131649059, 10.489917872770517 ], [ -11.870012795378628, 10.490062198533417 ], [ -11.870027746885667, 10.490131509503225 ], [ -11.870103749628374, 10.490332941962043 ], [ -11.870218932891815, 10.490653927277442 ], [ -11.870428814580041, 10.491270182505883 ], [ -11.870641414580051, 10.491929385921342 ], [ -11.871080410043035, 10.493542045085869 ], [ -11.87261256358571, 10.492532641547584 ], [ -11.8735954635857, 10.492016433732893 ], [ -11.873748573619746, 10.491936862864364 ], [ -11.873831786424457, 10.491894072294564 ], [ -11.873985540120797, 10.491815844042135 ], [ -11.875070440120787, 10.491269735699595 ], [ -11.87635166355833, 10.490680466658269 ], [ -11.8770584420701, 10.490385125881049 ], [ -11.878375721985218, 10.489888377254637 ], [ -11.879122021985209, 10.489636573167347 ], [ -11.880673589399839, 10.489182037757026 ], [ -11.881529575366828, 10.488968432695225 ], [ -11.883110715899006, 10.48864104900364 ], [ -11.883588115899027, 10.48856214766837 ], [ -11.886715625561143, 10.488294914435938 ], [ -11.888430189466163, 10.488283451442378 ], [ -11.891560770028306, 10.488508809973254 ], [ -11.891917512386172, 10.488562875921959 ], [ -11.893753873079543, 10.488373038699919 ], [ -11.893993673079553, 10.488368438620959 ], [ -11.896397141753072, 10.488467019033907 ], [ -11.897706206483202, 10.488599906138965 ], [ -11.900821704460531, 10.48930221957885 ], [ -11.904005236983483, 10.488697446916808 ], [ -11.905810850034053, 10.488508220437549 ], [ -11.906686452837627, 10.488489653539533 ], [ -11.907230613433477, 10.488454841848267 ], [ -11.907612277971136, 10.488399261376935 ], [ -11.907932777971116, 10.488360660719454 ], [ -11.910627427207139, 10.488219462443411 ], [ -11.912102700875348, 10.488241826794271 ], [ -11.917430760485098, 10.489048660714236 ], [ -11.918844590948609, 10.489463523746187 ], [ -11.921249046753873, 10.490540793068917 ], [ -11.921252838988234, 10.490530881133546 ], [ -11.921537719935754, 10.490639874511485 ], [ -11.922666980320891, 10.491176070427755 ], [ -11.923786377367117, 10.491677594346479 ], [ -11.923989043635927, 10.491803813116602 ] ] ] } },
{ "type": "Feature", "properties": { "taskid": 1077, "taskstatus": "MAPPED", "percent_intersect": 83, "surface": 97912469.860476196, "url": "http:\/\/taches.francophonelibre.org\/project\/299#task\/1077" }, "geometry": { "type": "Polygon", "coordinates": [ [ [ -9.136854399057171, 10.168495621645004 ], [ -9.13759487713723, 10.168994799916888 ], [ -9.138815176790466, 10.16971160204471 ], [ -9.139530916286907, 10.170152515984787 ], [ -9.139912418451274, 10.170398739056758 ], [ -9.140609828184132, 10.170869928391657 ], [ -9.143192628184149, 10.172695253067635 ], [ -9.145599280736471, 10.17469593659064 ], [ -9.146798335857692, 10.17586297273397 ], [ -9.148877221972405, 10.178233089742012 ], [ -9.150557834338093, 10.180900441272284 ], [ -9.151331790344273, 10.182375036814843 ], [ -9.152580411483079, 10.185297219993407 ], [ -9.15335043807881, 10.188380281510669 ], [ -9.153623534763595, 10.1900180896052 ], [ -9.15389558631694, 10.193194201828375 ], [ -9.153659560988912, 10.196373194270391 ], [ -9.153405065746018, 10.198013893609302 ], [ -9.152669822514126, 10.201106166652753 ], [ -9.151453981811951, 10.204042910865692 ], [ -9.150696806408924, 10.205525899521771 ], [ -9.149045697472314, 10.208212911866699 ], [ -9.146992725900009, 10.210606967794547 ], [ -9.145806987940851, 10.211787083615738 ], [ -9.143427850228713, 10.213810835457597 ], [ -9.140762637519085, 10.215439487962945 ], [ -9.139264405296759, 10.216201216867205 ], [ -9.136401325746208, 10.21738749584042 ], [ -9.133389351294207, 10.218117216482559 ], [ -9.131725282217433, 10.218385998299949 ], [ -9.128646199959107, 10.218641589314126 ], [ -9.125564492477984, 10.21841988383186 ], [ -9.123897477222245, 10.218169409564879 ], [ -9.12087825990808, 10.217473053926966 ], [ -9.118002833488557, 10.216318711139699 ], [ -9.116496051121866, 10.21557349779763 ], [ -9.113819781578304, 10.213979236903981 ], [ -9.112109817798761, 10.212770798762238 ], [ -9.111131536118155, 10.212196173862152 ], [ -9.110601714110897, 10.21187381426291 ], [ -9.110318168062204, 10.211695214538739 ], [ -9.109798129902691, 10.211356268589663 ], [ -9.108518949267577, 10.210493958892627 ], [ -9.106768949461477, 10.209509295980075 ], [ -9.105480862444244, 10.208719025623036 ], [ -9.104802232484555, 10.208266518048056 ], [ -9.10357483254027, 10.207379165604403 ], [ -9.102036132540258, 10.206175481285062 ], [ -9.099612354099982, 10.203933398234675 ], [ -9.09842337060984, 10.202635633982275 ], [ -9.098126812011863, 10.202252426770405 ], [ -9.097556602135031, 10.202024519232118 ], [ -9.097102791446396, 10.201836640394324 ], [ -9.096857357424938, 10.201731481489574 ], [ -9.096408035543183, 10.201532395558102 ], [ -9.095301720895254, 10.201025857436042 ], [ -9.095129484893695, 10.201016144631224 ], [ -9.094317884893684, 10.200945145806854 ], [ -9.091219435707417, 10.200426414201395 ], [ -9.089558739866161, 10.200012087499845 ], [ -9.086572891258742, 10.199011645303459 ], [ -9.084147491258754, 10.197980161042999 ], [ -9.08318359825393, 10.197539722068873 ], [ -9.082667026817612, 10.197286928995544 ], [ -9.081726569884033, 10.19679535752512 ], [ -9.079498969884019, 10.19555467547185 ], [ -9.077833156896221, 10.194516644209665 ], [ -9.076963463243834, 10.193913514528255 ], [ -9.075403031003123, 10.192713467160022 ], [ -9.073942231003119, 10.191470982782722 ], [ -9.07258476017828, 10.190203152375657 ], [ -9.071891418042791, 10.189492510305358 ], [ -9.070653985243466, 10.188099963385733 ], [ -9.069950685243466, 10.187230072385884 ], [ -9.069564855528972, 10.186653254245892 ], [ -9.069037539203659, 10.186408822782028 ], [ -9.066784944084281, 10.185183463129777 ], [ -9.065613524824851, 10.184445187189867 ], [ -9.063528949875723, 10.182935654562286 ], [ -9.062754154973385, 10.182294708629477 ], [ -9.061595290129072, 10.181370849621452 ], [ -9.058996139310558, 10.178885261099882 ], [ -9.058345371196342, 10.178139825162555 ], [ -9.057009769307257, 10.177338723816478 ], [ -9.055656969307273, 10.176401636531118 ], [ -9.055005672918206, 10.17593084098009 ], [ -9.054660204489585, 10.17567039049835 ], [ -9.05402758331247, 10.175173184052843 ], [ -9.053960982037593, 10.175118636446015 ], [ -9.053031261515361, 10.174714151366024 ], [ -9.052151252234967, 10.174305630411673 ], [ -9.051679284273984, 10.174072454453894 ], [ -9.05081908043919, 10.173621157919445 ], [ -9.04928228043919, 10.172766670257404 ], [ -9.048664539716082, 10.172408612750379 ], [ -9.048333992014218, 10.172209052934729 ], [ -9.047728818868308, 10.171828776876589 ], [ -9.047292143272935, 10.171543371605686 ], [ -9.046766897148812, 10.171357539291051 ], [ -9.044683489745298, 10.170485139933005 ], [ -9.043582009860419, 10.169948913639725 ], [ -9.041604848963436, 10.168843728454036 ], [ -9.040119148963457, 10.167899041608095 ], [ -9.039210280960509, 10.167285511172039 ], [ -9.038729665133776, 10.16694152308046 ], [ -9.03785437210122, 10.166277964780056 ], [ -9.035912172101206, 10.164719784799065 ], [ -9.035014468297426, 10.163955003182528 ], [ -9.034545440810067, 10.163530933922278 ], [ -9.033692835728255, 10.162713006503955 ], [ -9.032126479930492, 10.16111888101609 ], [ -9.031380624808781, 10.160880934615562 ], [ -9.030948363208427, 10.160737589969598 ], [ -9.030713750645226, 10.160656812518168 ], [ -9.030284663459566, 10.160503588333135 ], [ -9.029904104362824, 10.160362785371714 ], [ -9.02953983799682, 10.160355803749717 ], [ -9.027160426136581, 10.160167749044312 ], [ -9.026413326136581, 10.160063550752533 ], [ -9.023353594061467, 10.159389009213989 ], [ -9.021722307075509, 10.158892608225567 ], [ -9.018797644353953, 10.157744674570507 ], [ -9.017754544353952, 10.157237382100957 ], [ -9.015068009474739, 10.155661120598438 ], [ -9.013691588998631, 10.154702078500128 ], [ -9.011266455107485, 10.152712514568863 ], [ -9.009182233471124, 10.150368232333914 ], [ -9.008174241407328, 10.149037428970026 ], [ -9.00646852676196, 10.146370488824026 ], [ -9.005205000874156, 10.143467811693407 ], [ -9.004664106508974, 10.141895511674447 ], [ -9.00387122761202, 10.138811451360439 ], [ -9.003577876455712, 10.135640642305203 ], [ -9.003557026298234, 10.133980750970332 ], [ -9.003770746791437, 10.130802847768706 ], [ -9.004486244183276, 10.127699171127947 ], [ -9.004987479192193, 10.126114170112018 ], [ -9.006178770406592, 10.123179045092209 ], [ -9.007818535048111, 10.120468822673322 ], [ -9.008792790848441, 10.119113865107952 ], [ -9.010819772498904, 10.116716823381397 ], [ -9.013196862720156, 10.114666480549044 ], [ -9.014548772366116, 10.113674202756563 ], [ -9.017192075231149, 10.112034156254598 ], [ -9.020057721356872, 10.110823836112223 ], [ -9.021654950513016, 10.110291372849984 ], [ -9.024656049282953, 10.109543011581561 ], [ -9.027736647511375, 10.109266329507621 ], [ -9.029422848259346, 10.109245804330891 ], [ -9.032508555375143, 10.109447316344374 ], [ -9.033262051391524, 10.10961579749045 ], [ -9.034188474431968, 10.109614252765043 ], [ -9.038031431528571, 10.109980405175488 ], [ -9.038875631528571, 10.110144207835098 ], [ -9.039526472935538, 10.110281761765361 ], [ -9.039880706338877, 10.110362805003691 ], [ -9.040526908810605, 10.110522005504116 ], [ -9.041375508810612, 10.110746109086255 ], [ -9.0422988583527, 10.111013851668455 ], [ -9.042798630572873, 10.111171887049275 ], [ -9.043708827014253, 10.111483980815583 ], [ -9.04741386242195, 10.11285484867828 ], [ -9.047900342506095, 10.113010052853173 ], [ -9.049038135345686, 10.11333835036667 ], [ -9.049784302377816, 10.113574711381782 ], [ -9.05006097279661, 10.113632249797599 ], [ -9.05124748247025, 10.113949645313967 ], [ -9.05339085966914, 10.114654763015036 ], [ -9.054444659669139, 10.115068669379346 ], [ -9.056786258684886, 10.116168130634273 ], [ -9.058012390083709, 10.116843866097124 ], [ -9.060199703260592, 10.11824166259168 ], [ -9.06187490326057, 10.119472278921091 ], [ -9.06276175066229, 10.120162960469667 ], [ -9.063227667438886, 10.120547332892837 ], [ -9.064075742719462, 10.121288071500597 ], [ -9.065948142719476, 10.123018792393596 ], [ -9.06687243676414, 10.123930531965094 ], [ -9.067350213601642, 10.124433445012125 ], [ -9.068144299824098, 10.125325712151447 ], [ -9.068792191836659, 10.125606265679766 ], [ -9.069235027643465, 10.125809941810056 ], [ -9.070042597801676, 10.126203582398004 ], [ -9.071152497801664, 10.126775790798384 ], [ -9.072053908518336, 10.127270243423171 ], [ -9.072534672512171, 10.12755026832601 ], [ -9.073410695988757, 10.128091182967877 ], [ -9.074629830693349, 10.128888015273999 ], [ -9.076186039582476, 10.129565081263131 ], [ -9.077217935562722, 10.130049459582427 ], [ -9.0777699445197, 10.130328041776398 ], [ -9.078774009806585, 10.130871257802893 ], [ -9.080219309806568, 10.131707369753823 ], [ -9.080932429423822, 10.132140005928633 ], [ -9.081312755603197, 10.132381733746913 ], [ -9.0820080356766, 10.132844298000121 ], [ -9.083317835676594, 10.133755710340091 ], [ -9.083951365409439, 10.134215200782158 ], [ -9.083965549185335, 10.134225917754771 ], [ -9.084194275561327, 10.134325738402133 ], [ -9.085482475561328, 10.134922747360852 ], [ -9.087394360614818, 10.135937915357886 ], [ -9.088396718952383, 10.136541849027607 ], [ -9.090192926997291, 10.137761686061623 ], [ -9.091194126997275, 10.138524196065223 ], [ -9.0935103113595, 10.140591016744402 ], [ -9.09465737057554, 10.141786940508542 ], [ -9.094863977814548, 10.142039073389689 ], [ -9.096040707949482, 10.14241146107797 ], [ -9.099122481925967, 10.143677807559611 ], [ -9.101951264329442, 10.145438192281057 ], [ -9.103391230532907, 10.146510435117927 ], [ -9.105905139501488, 10.148733376327048 ], [ -9.106412339501501, 10.149264082363837 ], [ -9.107955372375288, 10.151084717885109 ], [ -9.108378946014248, 10.15164965395981 ], [ -9.10895180806512, 10.151802382598254 ], [ -9.111134589214045, 10.152520959443757 ], [ -9.11229707996411, 10.152979231884547 ], [ -9.114388100784682, 10.153946166748183 ], [ -9.115998978314682, 10.154806967583175 ], [ -9.116183555123563, 10.154891480616314 ], [ -9.116303856219574, 10.154919187958511 ], [ -9.117488201425223, 10.155230432474616 ], [ -9.118128747813614, 10.155419911319004 ], [ -9.119293055043235, 10.155803500915423 ], [ -9.12043465504323, 10.156218807390445 ], [ -9.121221510233568, 10.156524009046567 ], [ -9.1216458904943, 10.156699004232117 ], [ -9.122419897945441, 10.157037468264111 ], [ -9.123070608497249, 10.157338542855003 ], [ -9.124243299084235, 10.157818710770163 ], [ -9.12657735141493, 10.158956553011361 ], [ -9.127797249270396, 10.15965268328924 ], [ -9.129971600743001, 10.161088930534419 ], [ -9.130599000743004, 10.16156483680134 ], [ -9.133386614907524, 10.164129588337996 ], [ -9.134734953362718, 10.165629684746145 ], [ -9.136854399057171, 10.168495621645004 ] ] ] } }
]
}
