concept_id;concept_name;domain_id;vocabulary_id;concept_class_id;standard_concept;concept_code;valid_start_date;valid_end_date;invalid_raison
;Chirurgie;Episode;Lille Perop Episode;Procedure Episode;;3;01/01/1970;31/12/2099;
;Induction - Incision;Episode;Lille Perop Episode;Procedure Episode;;71;01/01/1970;31/12/2099;
;Fin de chirurgie - Fin d'anesthésie;Episode;Lille Perop Episode;Procedure Episode;;72;01/01/1970;31/12/2099;
;Début d'intervention DIANE - Début d'anesthésie;Episode;Lille Perop Episode;Procedure Episode;;81;01/01/1970;31/12/2099;
;Début d'intervention DIANE - Début de chirurgie;Episode;Lille Perop Episode;Procedure Episode;;82;01/01/1970;31/12/2099;
;Anesthésie V6;Episode;Lille Perop Episode;Procedure Episode;;48;01/01/1970;31/12/2099;
;Pré-oxygénation - Intubation;Episode;Lille Perop Episode;Procedure Episode;;49;01/01/1970;31/12/2099;
;Période SSPI;Episode;Lille Perop Episode;Procedure Episode;;73;01/01/1970;31/12/2099;
;Intervention DIANE;Episode;Lille Perop Episode;Procedure Episode;;54;01/01/1970;31/12/2099;
;Transfert Salle de bloc - SSPI;Episode;Lille Perop Episode;Procedure Episode;;64;01/01/1970;31/12/2099;
;Episode de CEC (delta PAD-PAS < 15mmHg - PAD < 150 mmHg);Episode;Lille Perop Episode;Procedure Episode;;114;01/01/1970;31/12/2099;
;Bloc - SSPI;Episode;Lille Perop Episode;Procedure Episode;;115;01/01/1970;31/12/2099;
;Fin de chirurgie - Extubation;Episode;Lille Perop Episode;Procedure Episode;;120;01/01/1970;31/12/2099;
;Fin de chirurgie - Sortie de bloc;Episode;Lille Perop Episode;Procedure Episode;;121;01/01/1970;31/12/2099;
;Induction - Naissance;Episode;Lille Perop Episode;Procedure Episode;;116;01/01/1970;31/12/2099;
;Incision - Naissance;Episode;Lille Perop Episode;Procedure Episode;;119;01/01/1970;31/12/2099;
;Induction - Premier clampage;Episode;Lille Perop Episode;Procedure Episode;;123;01/01/1970;31/12/2099;
;Premier clampage - dernier déclampage;Episode;Lille Perop Episode;Procedure Episode;;124;01/01/1970;31/12/2099;
;Dernier déclampage - Fin d'anesthésie;Episode;Lille Perop Episode;Procedure Episode;;125;01/01/1970;31/12/2099;
;Incision - Extubation;Episode;Lille Perop Episode;Procedure Episode;;126;01/01/1970;31/12/2099;
;Intubation - Extubation;Episode;Lille Perop Episode;Procedure Episode;;127;01/01/1970;31/12/2099;
;Intubation - Fin de chirurgie;Episode;Lille Perop Episode;Procedure Episode;;128;01/01/1970;31/12/2099;
;Induction - Conversion anesthésique;Episode;Lille Perop Episode;Procedure Episode;;132;01/01/1970;31/12/2099;
;Conversion anesthésique - Naissance;Episode;Lille Perop Episode;Procedure Episode;;133;01/01/1970;31/12/2099;
;Monitorage Pression Invasive;Episode;Lille Perop Episode;Procedure Episode;;117;01/01/1970;31/12/2099;
;Induction - Monitorage Pression Invasive;Episode;Lille Perop Episode;Procedure Episode;;118;01/01/1970;31/12/2099;
;Entrée au bloc - Chute de pièce;Episode;Lille Perop Episode;Procedure Episode;;129;01/01/1970;31/12/2099;
;Chute de pièce - Sorti du bloc;Episode;Lille Perop Episode;Procedure Episode;;130;01/01/1970;31/12/2099;
;Incision - Chute de bloc;Episode;Lille Perop Episode;Procedure Episode;;131;01/01/1970;31/12/2099;
;Période de ventilation bi-pulmonaire;Episode;Lille Perop Episode;Procedure Episode;;134;01/01/1970;31/12/2099;
;Période de ventilation uni-pulmonaire;Episode;Lille Perop Episode;Procedure Episode;;135;01/01/1970;31/12/2099;
