concept_id;concept_name;domain_id;vocabulary_id;concept_class_id;standard_concept;concept_code;valid_start_date;valid_end_date;invalid_raison
2000000001;Lille AIMS;Metadata;Vocabulary;Vocabulary;;Lille University Hospital generated;01/01/1970;31/12/2099;
2000000002;Lille PMSI;Metadata;Vocabulary;Vocabulary;;Lille University Hospital generated;01/01/1970;31/12/2099;
2000000003;Lille AIMS Unit;Metadata;Vocabulary;Vocabulary;;Lille University Hospital generated;01/01/1970;31/12/2099;
2000000004;Lille AIMS Measurement;Metadata;Vocabulary;Vocabulary;;Lille University Hospital generated;01/01/1970;31/12/2099;
2000000005;Lille AIMS Event;Metadata;Vocabulary;Vocabulary;;Lille University Hospital generated;01/01/1970;31/12/2099;
2000000006;Lille AIMS Drug;Metadata;Vocabulary;Vocabulary;;Lille University Hospital generated;01/01/1970;31/12/2099;
2000000007;Lille Perop Episode;Metadata;Vocabulary;Vocabulary;;Lille University Hospital generated;01/01/1970;31/12/2099;
2000000008;Lille Perop Indicator;Metadata;Vocabulary;Vocabulary;;Lille University Hospital generated;01/01/1970;31/12/2099;
2000000009;Lille Perop Threshold;Metadata;Vocabulary;Vocabulary;;Lille University Hospital generated;01/01/1970;31/12/2099;
