[gd_scene load_steps=3 format=2]

[ext_resource path="res://ressources/acte3/mur_couloir_metro.png" type="Texture" id=1]

[sub_resource type="RectangleShape2D" id=1]
extents = Vector2( 32, 32 )

[node name="CouloirMetro_Mur" type="Node2D"]

[node name="Sprite" type="Sprite" parent="."]
texture = ExtResource( 1 )
vframes = 2
hframes = 2

[node name="StaticBody2D" type="StaticBody2D" parent="Sprite"]

[node name="CollisionShape2D" type="CollisionShape2D" parent="Sprite/StaticBody2D"]
shape = SubResource( 1 )

[node name="Noir" type="Sprite" parent="."]
position = Vector2( 138, 0 )
texture = ExtResource( 1 )
vframes = 2
hframes = 2
frame = 2

[node name="Sol" type="Sprite" parent="."]
position = Vector2( 281, 0 )
texture = ExtResource( 1 )
vframes = 2
hframes = 2
frame = 1
