[gd_scene load_steps=2 format=2]

[ext_resource path="res://ressources/acte3/details_couloir.png" type="Texture" id=1]

[node name="Details_Couloir" type="Node2D"]

[node name="Sprite" type="Sprite" parent="."]
position = Vector2( -54, -21 )
texture = ExtResource( 1 )
vframes = 3
hframes = 2

[node name="Sprite2" type="Sprite" parent="."]
texture = ExtResource( 1 )
vframes = 3
hframes = 2
frame = 1

[node name="Sprite3" type="Sprite" parent="."]
position = Vector2( 126, -20 )
texture = ExtResource( 1 )
vframes = 3
hframes = 2
frame = 2

[node name="Sprite4" type="Sprite" parent="."]
position = Vector2( -68, 54 )
texture = ExtResource( 1 )
vframes = 3
hframes = 2
frame = 3

[node name="Sprite5" type="Sprite" parent="."]
position = Vector2( 65, -51 )
texture = ExtResource( 1 )
vframes = 3
hframes = 2
frame = 4

[node name="Sprite6" type="Sprite" parent="."]
position = Vector2( 134, 29 )
texture = ExtResource( 1 )
vframes = 3
hframes = 2
frame = 5
