[gd_scene load_steps=5 format=2]

[ext_resource path="res://scenes/acte3/Fin.gd" type="Script" id=1]
[ext_resource path="res://ubuntu-font-family-0.83/Ubuntu-L.ttf" type="DynamicFontData" id=2]

[sub_resource type="DynamicFont" id=1]
size = 14
font_data = ExtResource( 2 )

[sub_resource type="DynamicFont" id=2]
font_data = ExtResource( 2 )

[node name="Fin" type="Control"]
anchor_right = 1.0
anchor_bottom = 1.0
script = ExtResource( 1 )
__meta__ = {
"_edit_use_anchors_": false
}

[node name="ColorRect" type="ColorRect" parent="."]
anchor_right = 1.0
anchor_bottom = 1.0
color = Color( 0, 0, 0, 1 )

[node name="Timer" type="Timer" parent="."]
wait_time = 7.0
one_shot = true

[node name="Texte" type="Label" parent="."]
anchor_right = 1.0
anchor_bottom = 1.0
custom_fonts/font = SubResource( 1 )
align = 1
valign = 1
__meta__ = {
"_edit_use_anchors_": false
}

[node name="Button" type="Button" parent="."]
visible = false
anchor_left = 0.5
anchor_top = 1.0
anchor_right = 0.5
anchor_bottom = 1.0
margin_left = -71.0
margin_top = -38.0
margin_right = 71.0
margin_bottom = -11.0
custom_fonts/font = SubResource( 2 )
text = "GENERIQUE_MAINMENU"
__meta__ = {
"_edit_use_anchors_": false
}
[connection signal="timeout" from="Timer" to="." method="_on_Timer_timeout"]
[connection signal="pressed" from="Button" to="." method="_on_Button_pressed"]
