[gd_scene load_steps=8 format=2]

[ext_resource path="res://generiques/Vide.gd" type="Script" id=1]
[ext_resource path="res://ressources/acte2/selecteur.png" type="Texture" id=2]

[sub_resource type="RectangleShape2D" id=1]
extents = Vector2( 25, 24 )

[sub_resource type="Gradient" id=2]
colors = PoolColorArray( 1, 1, 1, 0.392157, 1, 1, 1, 0 )

[sub_resource type="GradientTexture" id=3]
gradient = SubResource( 2 )

[sub_resource type="ParticlesMaterial" id=4]
emission_shape = 2
emission_box_extents = Vector3( 32, 32, 0 )
flag_disable_z = true
gravity = Vector3( 0, 98, 0 )
initial_velocity = 1.0
angular_velocity = 1.17709e-43
orbit_velocity = 0.0
orbit_velocity_random = 0.0
color_ramp = SubResource( 3 )

[sub_resource type="Animation" id=5]
length = 0.6
loop = true
tracks/0/type = "value"
tracks/0/path = NodePath("Selecteur:frame")
tracks/0/interp = 1
tracks/0/loop_wrap = true
tracks/0/imported = false
tracks/0/enabled = true
tracks/0/keys = {
"times": PoolRealArray( 0, 0.1, 0.2, 0.3, 0.4, 0.5 ),
"transitions": PoolRealArray( 1, 1, 1, 1, 1, 1 ),
"update": 1,
"values": [ 0, 1, 2, 3, 4, 5 ]
}

[node name="Vide" type="Area2D" groups=[
"vides",
]]
script = ExtResource( 1 )

[node name="CollisionShape2D" type="CollisionShape2D" parent="."]
shape = SubResource( 1 )

[node name="Particles2D" type="Particles2D" parent="."]
visible = false
amount = 6
speed_scale = 0.5
process_material = SubResource( 4 )

[node name="Selecteur" type="Sprite" parent="."]
texture = ExtResource( 2 )
vframes = 3
hframes = 3
frame = 2

[node name="AnimationPlayer" type="AnimationPlayer" parent="."]
autoplay = "actif"
anims/actif = SubResource( 5 )
[connection signal="body_entered" from="." to="." method="_on_Vide_body_entered"]
