{
	"format": "BeepBox",
	"version": 6,
	"scale": "easy :)",
	"key": "C",
	"introBars": 0,
	"loopBars": 4,
	"beatsPerBar": 8,
	"ticksPerBeat": 4,
	"beatsPerMinute": 151,
	"reverb": 0,
	"channels": [
		{
			"type": "pitch",
			"octaveScrollBar": 3,
			"instruments": [
				{
					"type": "chip",
					"volume": 100,
					"wave": "square",
					"transition": "sudden",
					"filter": "bright",
					"chorus": "union",
					"effect": "none"
				}
			],
			"patterns": [
				{
					"instrument": 1,
					"notes": []
				},
				{
					"instrument": 1,
					"notes": []
				},
				{
					"instrument": 1,
					"notes": []
				},
				{
					"instrument": 1,
					"notes": []
				},
				{
					"instrument": 1,
					"notes": []
				},
				{
					"instrument": 1,
					"notes": []
				},
				{
					"instrument": 1,
					"notes": []
				},
				{
					"instrument": 1,
					"notes": []
				}
			],
			"sequence": [
				1,
				1,
				1,
				1,
				1,
				1,
				1,
				1,
				1,
				1,
				1,
				1,
				1,
				1,
				1,
				1
			]
		},
		{
			"type": "pitch",
			"octaveScrollBar": 2,
			"instruments": [
				{
					"type": "chip",
					"volume": 100,
					"wave": "square",
					"transition": "sudden",
					"filter": "bright",
					"chorus": "union",
					"effect": "none"
				}
			],
			"patterns": [
				{
					"instrument": 1,
					"notes": [
						{
							"pitches": [
								26
							],
							"points": [
								{
									"tick": 0,
									"pitchBend": 0,
									"volume": 100
								},
								{
									"tick": 32,
									"pitchBend": 0,
									"volume": 100
								}
							]
						}
					]
				},
				{
					"instrument": 1,
					"notes": []
				},
				{
					"instrument": 1,
					"notes": []
				},
				{
					"instrument": 1,
					"notes": []
				},
				{
					"instrument": 1,
					"notes": []
				},
				{
					"instrument": 1,
					"notes": []
				},
				{
					"instrument": 1,
					"notes": []
				},
				{
					"instrument": 1,
					"notes": []
				}
			],
			"sequence": [
				1,
				1,
				1,
				1,
				1,
				1,
				1,
				1,
				1,
				1,
				1,
				1,
				1,
				1,
				1,
				1
			]
		},
		{
			"type": "pitch",
			"octaveScrollBar": 1,
			"instruments": [
				{
					"type": "chip",
					"volume": 100,
					"wave": "square",
					"transition": "sudden",
					"filter": "bright",
					"chorus": "union",
					"effect": "none"
				}
			],
			"patterns": [
				{
					"instrument": 1,
					"notes": [
						{
							"pitches": [
								12
							],
							"points": [
								{
									"tick": 0,
									"pitchBend": 0,
									"volume": 100
								},
								{
									"tick": 32,
									"pitchBend": 0,
									"volume": 100
								}
							]
						}
					]
				},
				{
					"instrument": 1,
					"notes": []
				},
				{
					"instrument": 1,
					"notes": []
				},
				{
					"instrument": 1,
					"notes": []
				},
				{
					"instrument": 1,
					"notes": []
				},
				{
					"instrument": 1,
					"notes": []
				},
				{
					"instrument": 1,
					"notes": []
				},
				{
					"instrument": 1,
					"notes": []
				}
			],
			"sequence": [
				1,
				1,
				1,
				1,
				1,
				1,
				1,
				1,
				1,
				1,
				1,
				1,
				1,
				1,
				1,
				1
			]
		},
		{
			"type": "drum",
			"octaveScrollBar": 0,
			"instruments": [
				{
					"type": "noise",
					"volume": 100,
					"wave": "white",
					"transition": "sudden"
				}
			],
			"patterns": [
				{
					"instrument": 1,
					"notes": []
				},
				{
					"instrument": 1,
					"notes": []
				},
				{
					"instrument": 1,
					"notes": []
				},
				{
					"instrument": 1,
					"notes": []
				},
				{
					"instrument": 1,
					"notes": []
				},
				{
					"instrument": 1,
					"notes": []
				},
				{
					"instrument": 1,
					"notes": []
				},
				{
					"instrument": 1,
					"notes": []
				}
			],
			"sequence": [
				1,
				1,
				1,
				1,
				1,
				1,
				1,
				1,
				1,
				1,
				1,
				1,
				1,
				1,
				1,
				1
			]
		}
	]
}