[gd_resource type="ShaderMaterial" load_steps=2 format=2]

[ext_resource path="res://OverlayShader.shader" type="Shader" id=1]

[resource]
shader = ExtResource( 1 )
shader_param/dispAmt = 0.002
shader_param/dispScale = 1.0
shader_param/abberationAmt = 0.002
shader_param/timeLine = null
shader_param/scanSpeed = 1.0
shader_param/scanOffset = 30.0
shader_param/screenCurvature = 1.0
shader_param/curvatureDistance = 1.5
