id,fr,en
TEST0-0,En toute chose les débuts sont modestes,In any thing the beginnings are modest
TEST0-1,"Bonjour, je suis Pierre du Mouvement :)

Avant toute chose je tiens à vous souhaiter un bon réveil !","Hello, I am Pierre from the Mouvement :)

First of all I would like to wish you a good awakening!"
TEST0-2,"Je suis là pour vous accompagner tout au long d'épreuves qui vous permettrons de retrouver votre citoyenneté.

L'échauffement est devant, foncez !","I am here to help you throughout the tests that will allow you to regain your citizenship.

The warm-up is ahead, go for it!"
TEST1-0,L'élan fait partie du saut,Momentum is part of the jump
TEST1-1,"Alors comment était-ce ? Le cube et le bouton ? 

Tout a fonctionné comme vous vouliez ?","So how was it? The cube and the button? 

Did everything work the way you wanted it to?"
TEST1-2,"Passons au niveau supérieur !

Dans la salle suivante, grâce à un dispositif que nous vous avons implanté, vous serez capable de placer un trampoline.","Let's take it up to the next level!


In the next room, thanks to a device that we have implanted in your body, you will be able to place a trampoline.
"
TEST1-3,"Concentrez-vous simplement sur une tuile, c'est facile.

On se revoit dans quelques instants !","Just focus on a tile, it's easy.

See you in a few moments!"
TEST2-0,L'enthousiasme est à la base de tout progrès,Enthusiasm is at the bottom of all progress.
TEST2-1,"Parfait ! Vous vous en sortez bien.

Je vais pouvoir désormais utiliser ces messages à des fins moins didactiques et plus informatives ;)","Great! You are doing fine.

I will now be able to use these messages for more informative purposes than didactic ones ;)"
TEST2-2,"Par exemple, saviez-vous que du fait de notre capacité limitée d’accueil et de la demande toujours plus grande pour réintégrer notre société, vous avez du être placé un certain temps en cryogénie ?","For example, did you know that due to our limited capacity and the ever-increasing demand for reintegration into our society, you had to be placed in cryogenics for some time?"
TEST2-3,"Dans votre cas, celle-ci a duré :
3 ans, 8 mois et 2 jours.

Mais ne vous faites pas de soucis, cela n'impactera pas vos capacités, et je suis certain que ceux dehors ne vous ont pas oublié.","In your case, this lasted:
3 years, 8 months and 2 days.

But don't worry, it won't impact your abilities, and I'm sure the ones out there haven't forgotten you."
TEST3-0,Un travail constant vient à bout de tout,Persistent work triumphs
TEST3-1,"Alors vous prenez la main ?

Un indice pour la prochaine : tâchez d'utiliser votre trampoline à son plein potentiel.","So you're getting the hang of it?

A hint for the next one: try to use your trampoline to its full potential.
"
TEST3-2,"Revenons à votre cryogénie : vous pourriez expérimenter en ce moment même une perte de votre mémoire à long terme.
    
Pas d'inquiétude, mes messages seront là au fil de la progression pour vous rappeler les éléments essentiels.","Back to your cryogenics: you may currently be experiencing long-term memory loss.

No worries, as you progress my messages will remind you of the fundamentals."
TEST3-3,"Le passé est parfois un poids, cet effet secondaire est aussi un moyen pour vous de repartir de zéro !","The past can sometimes be a burden, this side effect is also a way for you to start over!
"
TEST4-0,C'est en marchant que l'on trace le chemin,The path is made by walking
TEST4-1,"Parfait ! À la suivante nous complexifierons un peu avec de nouveaux éléments.

Pourquoi êtes vous en cet endroit ?
Vous posez vous sûrement cette audacieuse question.","Perfect! Next time we'll add new elements to make it a little more complex.

Why are you in this place?
You are probably asking yourself this bold question."
TEST4-2,"Pour des raisons diverses qui appartiennent désormais au passé, Le Mouvement a jugé que vous n'étiez plus apte à participer à notre projet de société.
Une place dans ce centre vous a alors été attribuée pour vous donner une seconde chance.","For various reasons that now belong to the past, Le Mouvement has judged that you were no longer suited to participate in our society's project.
A place in this center was then allocated to you to give you a second chance."
TEST4-3,Au bout de ces épreuves reposent votre liberté et votre vie future !,At the end of these trials lie your freedom and your future life!
TEST5-0,"Si vous pouvez le rêver, vous pouvez le faire","If you can dream it, you can do it"
TEST5-1,"Le Mouvement se fonde sur trois grands principes : la liberté, le mérite et l'indépendance.

Trois valeurs qui doivent vous guider au long de ces salles vers votre rédemption.","Le Mouvement is based on three main principles: freedom, merit and independence.

Three values that should guide you through these halls towards your redemption."
TEST5-2,"La liberté, dans la résolution des salles.

Le mérite, pour votre nouvelle vie qui vous attend dehors.

L'indépendance, car vous seul êtes responsable de votre réussite.","Freedom, in the resolution of the puzzles.

Merit, for your new life waiting for you outside.

Independence, because you alone are responsible for your success.
"
TEST6-0,Un objectif bien défini est à moitié atteint,A goal properly set is halfway reached
TEST6-1,"Courage dans votre progression !

Vous avez bien mérité un deuxième trampoline, placez le de la même manière que le premier.","Stay strong  during your progression!

You have rightfully earned a second trampoline, place it in the same way as the first one."
TEST6-2,"Projettez vous déjà dans votre futur radieux, debout au milieu de la foule enfin retrouvée.

Ne devant ce retour qu'à votre intelligence et votre persévérance.","Picture yourself already in your bright future, finally back in the middle of the crowd, standing.

You owe this return only to your intelligence and your perseverance.
"
TEST6-3,"Et nul besoin de nous remercier, nous ne sommes qu'un incubateur vous ayant permis d'éclore.","And there's no need to thank us, we're just the incubator that allowed you to grow."
TEST7-0,Le succès n'est pas un but\nmais une conséquence,"Success is a consequence\nand must not be a goal."
TEST7-1,"Il vous faudra redoubler d'ingéniosité dans la prochaine salle, ne relâchez pas vos effort !

Vous aurez tout le temps de vous reposer à la fin.","You'll have to be more resourceful in the next room,  so don’t relent in your efforts!

You will have plenty of time to rest at the end."
TEST8-0,Le succès naît de la persévérance,Success is born out of perseverance
TEST8-00,Folie,Madness
TEST8-1,"Vous approchez de la fin !
Noubliez pas ce précieux conseil :

N'abandonnez jamais, essayez, encore et encore, et vous triompherez toujours.
C'est celui qui ne fait pas d'effort qui échoue.","You are approaching the end!
Don't forget this valuable advice:

Never give up, try, again and again, and you will always prevail.
The one who does not try is the one that fails."
STAGIAIRE1-1,"Rapport de stage, 10/06/2034","Internship report, 06/10/2034"
STAGIAIRE1-2,"Ajourd'hui j'ai à nouveau pu pratiquer la contruction de salle de test.
C'est très intéressant, j'aime réfléchir en me mettant à la place du citoyen en réinsertion.","Today I was able to practice again the construction of a test room.
It is really interesting, I like to think from the point of view of the citizen in rehabilitation."
STAGIAIRE1-3,Malgré le mode limité que j'utilise j'ai raté le placement des tuiles à ma disposition et celles-ci se sont retrouvées de l'autre côté du mur.,"Despite using the limited mode I missed the placement of the tiles at my disposal and they ended up on the other side of the wall."
STAGIAIRE1-4,"Je demanderai demain à mon responsable de stage comment les récupérer, il est déjà 20h et j'ai des repas à livrer en vélo.","Tomorrow I will ask my internship manager how to get them back, it's already 8pm and I have meals to deliver by bike."
STAGIAIRE2-1,"Rapport de stage, 03/06/2034","Internship report, 06/03/2034"
STAGIAIRE2-2,"Les étapes de la réinsertion des citoyens me dépassent encore, je ne comprend pas bien les aboutissants de leur méthode.","The steps of citizen rehabilitation are still beyond me, I don't quite understand what their method is all about."
STAGIAIRE2-3,J'ai encore du mal à croire que ces personnes soient remises en société après ces quelques épreuves.,I still find it hard to believe that these people are back in society after these few trials.
STAGIAIRE2-4,Tant de choses à découvrir pendant ce stage !,So many things to learn during this internship!
COURRIEL-1,de : victor.gudin@lemouvement.fr,from : victor.gudin@lemouvement.fr
COURRIEL-2,à : bruno.pavit@phyzics.eu,to : bruno.pavit@phyzics.eu
COURRIEL-3,"Bonjour,

Je suis ravi de vous annoncer que le contrat de partenariat que vous nous avez proposé a été accepté. Je vous enverrai un mail ultérieurement pour fixer la date de signature.","Hello,

I am delighted to inform you that the partnership contract you proposed has been accepted. I will send you an email later to arrange the date of signature."
COURRIEL-4,"D'ici là, je vous joins différents documents qui nous permettrons de mieux cerner vos besoins, notamment quel type de personnes vous souhaitez, quelle sera la durée moyenne d'une expérience et quel matériel vous est nécessaire.

Vous retrouverez toutes ces informations dans le catalogue attaché.","Until then, I have attached various documents that will allow us to better understand your requirements, especially what type of people you want, what the average duration of an experiment will be and the equipment you need.

You will find all this information in the attached brochure."
COURRIEL-5,"Merci et bienvenue au sein de notre 
programme de rentabilisation des ex-citoyens,

Bonne journée,","Thank you and welcome to our 
ex-citizen profitability program,

Have a nice day,"
COURRIEL-6,"
Victor Gudin,
en charge des relation positives avec la société civile","
Victor Gudin,
in charge of positive interaction with the civil society"
TUTO-DEPLACEMENT,"Se déplacer : 

Utiliser les flèches ou ZQSD","Move: 

Arrow keys or WASD"
TUTO-AFFICHEUR,"        Interagir :

        Espace","        Interact :

        Space"
TUTO-TRAMPOLINE-POSER,"Poser un trampoline :

Cliquer avec la souris sur la tuile dans la direction choisie","Add trampoline :

Mouse click on the tile in choosen direction"
TUTO-TRAMPOLINE-RETIRER,"Retirer un trampoline :

Cliquer à nouveau sur le trampoline","Remove trampoline :

Click again on the trampoline"
GENERIQUE-TITRE,Sans-issue,Sans-issue
GENERIQUE-MUSIQUES1,"SAMPLES\n\n\n
Deena Abdelwahed - Saratan\n\n
The Ronettes - Be My Baby\n\n
Nekfeu - Squa\n\n
Lil Wayne - Scared of the dark\n\n
Hindi Zahra - Stand Up\n\n","SAMPLES\n\n\n
Deena Abdelwahed - Saratan\n\n
The Ronettes - Be My Baby\n\n
Nekfeu - Squa\n\n
Lil Wayne - Scared of the dark\n\n
Hindi Zahra - Stand Up\n\n"
GENERIQUE-MUSIQUES2,"SAMPLES\n\n\n
Ratatat - Breakaway\n\n
Dead Can Dance - The Host Of Seraphim\n\n
Low Roar - ""I'll Keep Coming""\n\n
Krzysztof Penderecki - Threnody for the Victims of Hiroshima\n\n
K/DA - Pop/Stars\n\n
Ratatat - Bilar\n\n","SAMPLES\n\n\n
Ratatat - Breakaway\n\n
Dead Can Dance - The Host Of Seraphim\n\n
Low Roar - ""I'll Keep Coming""\n\n
Krzysztof Penderecki - Threnody for the Victims of Hiroshima\n\n
K/DA - Pop/Stars\n\n
Ratatat - Bilar\n\n"
GENERIQUE-MUSIQUES3,"SAMPLES\n\n\n
Apple - The new iPhone SE\n\n
Voyou - Le naufragé\n\n
Apple ASMR - Satisfying woodshop sounds\n\n
REZZ - Edge\n\n
BOY - July\n\n","SAMPLES\n\n\n
Apple - The new iPhone SE\n\n
Voyou - Le naufragé\n\n
Apple ASMR - Satisfying woodshop sounds\n\n
REZZ - Edge\n\n
BOY - July\n\n"
GENERIQUE-MUSIQUEDEFIN,"MUSIQUE DE FIN\n\n\n
Hindi Zahra - Stand Up","ENDING MUSIC\n\n\n
Hindi Zahra - Stand Up"
GENERIQUE-EXTRAITS,"EXTRAITS AUDIO\n\n
AFP - Macron: ""je ne confonds pas les casseurs"" et les manifestants\n\n
L'Obs - Violences à Chanteloup: Edouard Philippe dénonce 'une bande d'imbéciles'\n\n
BFMTV - Attentat en Isère: Yassin Salhi était 'un bon voisin'\n\n
BFMTV - Fin d'une opération de police au CHU de Caen pour retrouver un homme aux propos menaçants\n\n","AUDIO EXTRACTS\n\n
AFP - Macron: ""je ne confonds pas les casseurs"" et les manifestants\n\n
L'Obs - Violences à Chanteloup: Edouard Philippe dénonce 'une bande d'imbéciles'\n\n
BFMTV - Attentat en Isère: Yassin Salhi était 'un bon voisin'\n\n
BFMTV - Fin d'une opération de police au CHU de Caen pour retrouver un homme aux propos menaçants\n\n"
GENERIQUE-LOGICIEL,"MOTEUR\n\nGodot Engine v3.2.3\n
\n\n
ÉDITEUR PIXEL ART\n\nPiskel\n
\n\n
CRT Shader - Rafael de Freitas","ENGINE\n\nGodot Engine v3.2.3\n
\n\n
PIXEL ART EDITOR\n\nPiskel\n
\n\n
CRT Shader - Rafael de Freitas"
GENERIQUE-TESTEURS,"TESTEURS\n\n\n
Thomas V.\n\n
Arsène I.\n\n
Marian M.\n\n
Héloïse T.\n\n
Thomas B.","TESTERS\n\n\n
Thomas V.\n\n
Arsène I.\n\n
Marian M.\n\n
Héloïse T.\n\n
Thomas B."
GENERIQUE-PIKARIO,"Conçu, dessiné, écrit et programmé\n\npar Pikario","Designed, drawn, written and programmed\n\nby Pikario"
GENERIQUE-MUSIQUE-ENIGME,"SAMPLE ÉNIGMES\n\n\n
Jordy Chandra - Do We Start to Like Each Other ?","PUZZLE SAMPLE\n\n\n
Jordy Chandra - Do We Start to Like Each Other ?"
GENERIQUE-LICENCES,"LICENCES\n\n\n
GPLv3\n\n
CC BY-SA 4.0","LICENSES\n\n\n
GPLv3\n\n
CC BY-SA 4.0"
GENERIQUE-TRADUCTION,"CORRECTION DE LA TRADUCTION ANGLAISE\n\n\nHéloïse T.","ENGLISH TRANSLATION CORRECTION\n\n\nHéloïse T."
INTRO_0_0,Cette nuit un important dispositif a été mis en place... hier soir,"Last night a large police force was set up... last night"
INTRO_0_1,"Antoine Delars vous êtes sur place pour BFMTV, Antoine","Antoine Delars you are on site for BFMTV, Antoine"
INTRO_0_2,"Oui, absolument tout commence vers 20h30 hier soir","Yes, absolutely everything starts around 8:30 last night"
INTRO_0_3,l'alerte est lancée et rapidement policiers et gendarmes arrivent sur place,the alarm is raised and quickly police and gendarmes arrive on scene
INTRO_0_4,"le quartier est entièrement bouclé, les...","the district is entirely cordoned off, the…"
INTRO_1_0,Je veux dire que nous avons donc assuré à madame le maire le soutien de l'État,I want to say that we have assured Madam Mayor of the support of the state
INTRO_1_1,mais nous sommes déterminés à faire en sorte que l'ordre puisse être respecté et rétabli,but we are determined to ensure that order can be respected and restored
INTRO_1_2,c'est donc un message de soutien et de soutien très sincère,so this is a very sincere message of support
INTRO_1_3,et tout à fait complet aux élus locaux qui doivent affronter ces situations,and quite complete to the local elected officials who have to face these situations
INTRO_1_4,un message de solidarité vis-à-vis de toute la population de cette ville et des villes avoisinantes,a message of solidarity towards all the population of this city and the neighbouring cities
INTRO_1_5,mais aussi un message de fermeté à l'égard de... la petite bande,but also a message of firmness towards... the little gang
INTRO_1_6,car je crois qu'en vérité il s'agit d'une petite bande d'imbéciles et d’irresponsables,because I truly believe that we’re dealing with a little gang of idiots and irresponsible people
INTRO_2_0,"Il a emménagé, bon j'ai du le voir peut-être six sept mois après plus tard","He moved in, well I must have seen him maybe six seven months later"
INTRO_2_1,il m'a dit bonjour et qu'il était content de l'endroit où est-qu'il habitait,"he said hello to me and that he was happy with the place where he lived
"
INTRO_2_2,que ses enfants s'y plaisaient et... quoi un bon voisin,that his children enjoyed it and... yes a good neighbor 
INTRO_2_3,c'est un homme qui se limitait à 'bonjour' 'au revoir' 'merci',he was a man who limited himself to 'hello' 'goodbye' 'thank you'
INTRO_2_4,un papa voilà qui pars le matin qui revient le soir,"a father who leaves in the morning and returns in the evening
"
INTRO_2_5,donc c'est vrai que bon bah voilà on ne va pas aller chercher plus loin,so it's true that we're not going to look any further
INTRO_2_6,"ça a surpris tout le monde, c'est choquant comme... pour entendre un truc pareil","it surprised everyone, it's shocking how... to hear something like that"
INTRO_2_7,c'est quand même c'est pas évident,it's not so easy
INTRO_3_0,Je ne confond pas avec des concitoyens qui veulent faire passer un message ,I do not mistake this for fellow citizens who want to send a message 
INTRO_3_1,J'éprouve de la compréhension pour ces concitoyens,I feel understanding for these fellow citizens
INTRO_3_2,mais je ne céderai rien à ceux qui veulent la destruction et le désordre,but I will not surrender to those who seek destruction and disorder
INTRO_3_3,car la république c'est à la fois l'ordre public,because the republic is both public order
INTRO_3_4,et la libre expression des opinions,and free expression of opinions
PAUSE,PAUSE,PAUSE
PAUSE_SD,Son,Sound
PAUSE_FS,Plein écran,Fullscreen
PAUSE_MAINMENU,Retour à l'écran titre,Back to main menu
PAUSE_POPUP_TEXT,"La partie est sauvegardée.

Revenir à l'écran titre ?","Game is saved

Go back to main menu ?"
PAUSE_POPUP_QUIT,Quitter,Quit
PAUSE_POPUP_CANCEL,Annuler,Cancel
PAUSE_ST,Sous-titres,Subtitles
ECRANTITRE_NOUVELLEPARTIE,Nouvelle partie,New game
ECRANTITRE_CONTINUER,Continuer,Continue
ECRANTITRE_QUITTER,Quitter,Quit
ECRANTITRE_PLEINCRAN,Plein écran,Fullscreen
SAUVEGARDE,Sauvegarde...,Saving...
GENERIQUE_MAINMENU,Retour à l'écran titre,Back to main menu
