[gd_scene load_steps=4 format=2]

[ext_resource path="res://Tuto.gd" type="Script" id=1]
[ext_resource path="res://ubuntu-font-family-0.83/Ubuntu-L.ttf" type="DynamicFontData" id=2]

[sub_resource type="DynamicFont" id=1]
size = 12
font_data = ExtResource( 2 )

[node name="Tuto" type="Control"]
anchor_right = 1.0
anchor_bottom = 1.0
mouse_filter = 2
script = ExtResource( 1 )
__meta__ = {
"_edit_use_anchors_": false
}

[node name="CanvasLayer" type="CanvasLayer" parent="."]

[node name="Panel" type="Panel" parent="CanvasLayer"]
modulate = Color( 1, 1, 1, 0 )
margin_top = 512.0
margin_right = 221.0
margin_bottom = 601.0
mouse_filter = 2
__meta__ = {
"_edit_use_anchors_": false
}

[node name="Label" type="Label" parent="CanvasLayer/Panel"]
anchor_right = 1.0
anchor_bottom = 1.0
margin_left = 10.0
margin_top = 10.0
margin_right = -10.0
margin_bottom = -10.0
custom_fonts/font = SubResource( 1 )
text = "Se déplacer en utilisant les flêches ou ZQSD."
valign = 1
autowrap = true

[node name="Apparition" type="Tween" parent="."]

[node name="Disparition" type="Tween" parent="."]

[node name="TimerSuppression" type="Timer" parent="."]
wait_time = 3.0
one_shot = true
[connection signal="timeout" from="TimerSuppression" to="." method="_on_TimerSuppression_timeout"]
