[gd_scene load_steps=3 format=2]

[ext_resource path="res://ressources/intro/tele.png" type="Texture" id=1]

[sub_resource type="Animation" id=1]
resource_name = "variation"
length = 3.0
loop = true
tracks/0/type = "value"
tracks/0/path = NodePath(".:modulate")
tracks/0/interp = 1
tracks/0/loop_wrap = true
tracks/0/imported = false
tracks/0/enabled = false
tracks/0/keys = {
"times": PoolRealArray( 0, 0.2, 0.5, 0.7, 1.3, 1.6, 1.8, 2.1, 2.3, 2.5, 2.7 ),
"transitions": PoolRealArray( 1, 1, 1, 1, 1, 1, 1, 1, 1, 1, 1 ),
"update": 0,
"values": [ Color( 0.447059, 0.447059, 0.447059, 1 ), Color( 0.113725, 0.113725, 0.113725, 1 ), Color( 0.72549, 0.72549, 0.72549, 1 ), Color( 0.360784, 0.360784, 0.360784, 1 ), Color( 0.729412, 0.729412, 0.729412, 1 ), Color( 1, 1, 1, 1 ), Color( 0.529412, 0.529412, 0.529412, 1 ), Color( 1, 1, 1, 1 ), Color( 0.415686, 0.415686, 0.415686, 1 ), Color( 0.607843, 0.607843, 0.607843, 1 ), Color( 0.941176, 0.941176, 0.941176, 1 ) ]
}

[node name="Tele" type="Node2D"]

[node name="ColorRect" type="ColorRect" parent="."]
modulate = Color( 0.447059, 0.447059, 0.447059, 1 )
margin_left = -23.0
margin_top = -17.0
margin_right = 24.0
margin_bottom = 6.0
color = Color( 0.815686, 0.447059, 0.447059, 1 )

[node name="AnimationPlayer" type="AnimationPlayer" parent="ColorRect"]
autoplay = "variation"
anims/variation = SubResource( 1 )

[node name="Decors" type="Sprite" parent="."]
texture = ExtResource( 1 )
vframes = 2

[node name="Ecran" type="Sprite" parent="."]
modulate = Color( 1, 1, 1, 0.235294 )
texture = ExtResource( 1 )
vframes = 2
frame = 1
