[gd_scene load_steps=6 format=2]

[ext_resource path="res://generiques/acte3/AlerteMetro.gd" type="Script" id=1]
[ext_resource path="res://ressources/acte3/lumiere_tunnel.png" type="Texture" id=2]
[ext_resource path="res://ressources/acte3/lumiere_couloir.png" type="Texture" id=3]
[ext_resource path="res://ressources/sons/acte3/fermeture.ogg" type="AudioStream" id=4]

[sub_resource type="Animation" id=1]
resource_name = "fermeture"
length = 2.0
tracks/0/type = "value"
tracks/0/path = NodePath("Light2D:energy")
tracks/0/interp = 1
tracks/0/loop_wrap = true
tracks/0/imported = false
tracks/0/enabled = true
tracks/0/keys = {
"times": PoolRealArray( 0, 0.2, 0.5, 0.7, 1, 1.2 ),
"transitions": PoolRealArray( 1, 1, 1, 1, 1, 1 ),
"update": 0,
"values": [ 1.0, 0.01, 1.0, 0.01, 1.0, 0.01 ]
}
tracks/1/type = "method"
tracks/1/path = NodePath(".")
tracks/1/interp = 1
tracks/1/loop_wrap = true
tracks/1/imported = false
tracks/1/enabled = true
tracks/1/keys = {
"times": PoolRealArray( 1.5 ),
"transitions": PoolRealArray( 1 ),
"values": [ {
"args": [ "depart" ],
"method": "emit_signal"
} ]
}
tracks/2/type = "method"
tracks/2/path = NodePath("AudioStreamPlayer2D")
tracks/2/interp = 1
tracks/2/loop_wrap = true
tracks/2/imported = false
tracks/2/enabled = true
tracks/2/keys = {
"times": PoolRealArray( 0, 0.5, 1 ),
"transitions": PoolRealArray( 1, 1, 1 ),
"values": [ {
"args": [ 0.0 ],
"method": "play"
}, {
"args": [ 0.0 ],
"method": "play"
}, {
"args": [ 0.0 ],
"method": "play"
} ]
}

[node name="AlerteMetro" type="Node2D" groups=[
"alerte",
]]
script = ExtResource( 1 )

[node name="Sprite" type="Sprite" parent="." groups=[
"alerte",
]]
modulate = Color( 1, 0, 0, 1 )
scale = Vector2( 0.1, 0.1 )
texture = ExtResource( 2 )

[node name="Light2D" type="Light2D" parent="."]
scale = Vector2( 0.25, 0.25 )
texture = ExtResource( 3 )
color = Color( 1, 0, 0, 1 )

[node name="AnimationPlayer" type="AnimationPlayer" parent="."]
anims/fermeture = SubResource( 1 )

[node name="AudioStreamPlayer2D" type="AudioStreamPlayer2D" parent="."]
stream = ExtResource( 4 )
volume_db = 2.0
bus = "Effets"
