{
  "": {
    "language": "es",
    "plural-forms": "nplurals=2; plural=(n!=1);"
  },
  "Welcome to Meta-Press.es": "Bienvenido a Meta-Press.es",
  " Welcome": " Bienvenido",
  "To open the search engine, click the [": "Para abrir Meta-Press.es, haga clic en el [",
  "] icon in the Firefox bar :": "] icono en la barra de Firefox",
  "Documentation": "Documentación",
  "Click ": "Clic ",
  "here": "aquí",
  " to read the documentation.": " para leer la documentación.",
  "Permissions": "Permiso",
  "Here is what Meta-Press.es is doing with the permissions it asks for :": "Esto es lo que está haciendo Meta-Press.es con los permisos que solicita :",
  " the ": " el permiso ",
  "host permission": "de afitrion",
  " is needed to read results from the queried source, only those sources are targeted, and permissions can be dropped between searches": " es necesario para leer los resultados de la fuente consultada, solo se orientan esas fuentes y los permisos se pueden eliminar entre búsquedas",
  "notification": "de notificación",
  " permission is only used to signal the end of a long search or new results in a scheduled search": " solo se utiliza para señalar el final de una búsqueda larga o nuevos resultados en una búsqueda programada",
  "alarm": "de alarma",
  " permission is used to schedule searches": " se utiliza para programar búsquedas",
  "storage": "de almacenamiento",
  " permission is used to remember settings and custom sources": " se usa para recordar configuraciones y fuentes personalizadas",
  "Also, this addon periodically (usually once a year) opens the \"journal\" page of the Meta-Press.es project website to present new features.": "Además, este WebExtension abre periódicamente (normalmente una vez al año) el sitio web del proyecto Meta-Press.es para presentar nuevas funcionalidades.",
  "Support": "Apoyo",
  "Simon Descarpentries is working on this free / libre software since 2013.": "Simon Descarpentries está trabajando en este software libre desde 2013.",
  "You can help him dedicating more time to this project supporting Meta-Press.es :": "Puedes ayudarlo dedicando más tiempo a este proyecto apoyando a Meta-Press.es:",
  "via ": "vía ",
  "This page uses ": "Esta página utiliza ",
  "Artwork by ": "Arte de ",
  "Meta-Press.es logo by Elisa de Castro Guerra": "Meta-Press.es logo de Elisa de Castro Guerra",
  "Create sources for Meta-Press.es": "Crea fuentes para Meta-Press.es",
  "📰 New sources": "📰 Nuevas fuentes",
  "You can define more sources to search in, adding the corresponding instructions in the following JSON editing text area.": "Puede definir más fuentes en las que buscar, añadiendo las instrucciones correspondientes en la siguiente área de texto de edición JSON.",
  "Some ": "Algunas ",
  "instructions": "instucciones",
  " about how to define a source can be found": " sobre cómo definir una fuente se pueden encontrar",
  "(en/fr) and more examples are shown below.": "(en/fr) y más ejemplos se muestran a continuación.",
  "Line number ": "Número de línea ",
  " ; column number ": " ; Número de columna ",
  "💾  Save": "💾  Guardar",
  "↶  Reset": "↶  Reiniciar",
  "Reload your Meta-Press.es addon tab to take your changes into account.": "Recargar Meta-Press.es para tener en cuenta sus cambios.",
  "Put ": "Poner ",
  "valid JSON": "JSON válido",
  " here, use only double quotes: ": " aquí, usa solo comillas dobles: ",
  " ; and no trailling comas: ": " ; y no uses comas: ",
  "Here are the ": "Estas son las ",
  "provided sources": "fuentes proporcionadas",
  " to help you finding inspiration with examples. For instance :": " para ayudarte a encontrar la inspiración. Por ejemplo :",
  " provides results in ": " proporciona resultados en ",
  "extends": "extiende",
  "the ": "la ",
  " uses the HTTP ": " utiliza el HTTP ",
  " method;": " methodolgìa;",
  " uses ": " utiliza ",
  " selectors to parse HTML;": " selectores para analizar HTML;",
  "s to parse some fields.": "s para analizar algunos campos.",
  "Added sources will remain accessible between searches and updates.": "Las fuentes añadidas permanecerán accesibles entre las búsquedas y las actualizaciones.",
  "If you defined usefull sources, ": "Si se definen las fuentes útiles, ",
  "please copy/paste us the corresponding JavaScript object:": "por favor copie/pegue el objeto JavaScript correspondiente:",
  "by email at ": "por correo electrónico a ",
  "or via the ": "o a través del ",
  "code repository": "repositorio del código",
  ", creating an issue or a pull request.": ", crear un tema o una solicitud.",
  "You can also help me dedicating more time to this project supporting Meta-Press.es :": "También puedes ayudarme a dedicar más tiempo a este proyecto apoyando a Meta-Press.es:",
  ", and ": ", y ",
  "https://www.meta-press.es/pages/meta-press.es_documentation.html#_how_to_add_a_new_source_to_the_search_engine": "",
  "https://developer.mozilla.org/en-US/docs/Web/JavaScript/Reference/Global_Objects/JSON/parse": "",
  "Settings of Meta-Press.es": "Configuración de Meta-Press.es",
  "⚙ Settings": "⚙ Configuración",
  " General": " ",
  "Language: ": "Idioma: ",
  "Default": "Defecto",
  "Dark background: ": "Fondo oscuro: ",
  "Auto": "",
  "Dark": "Oscuro",
  "Light": "Claro",
  "Reload search when source filters change: ": "Recargar la búsqueda cuando cambien los filtros de las fuentes: ",
  "Automaticaly search in single or many words capable sources: ": "Busque automáticamente en fuentes con capacidad para una o varias palabras: ",
  "🔍 Search": "🔍 Busque",
  "Max. results by source: ": "Max. resultados por fuente: ",
  "Deduplicate results (based on title): ": "Deduplicar resultados (basado en los títulos): ",
  "Load photos in results: ": "Cargar fotos en los resultados: ",
  "📢 News": "📢 Noticias",
  "Automatically load news: ": "Cargar noticias automáticamente: ",
  "Reload news when source filters change: ": "Recargar noticias cuando cambien los filtros de las fuentes: ",
  "Max. loaded elements: ": "Máximo de elementos cargados: ",
  "Default page size: ": "Tamaño de la página por defecto: ",
  "🔐 Permissions": "🔐 Permisos",
  "To be able to read results from the sources, Meta-Press.es needs their \"host permission\".": "Para leer a los resultados en las fuentes, Meta-Press.es necesita sus \"permisos de afitrion\".",
  "Request all host permissions: ": "Dar todos los permisos de afitrion: ",
  "Request": "Dar",
  "Remember host permissions: ": "Mantener los permisos de afitrion: ",
  "Drop all host permissions: ": "Eliminar los permisos de afitrion: ",
  "Drop": "Eliminar",
  "⏰ Automatic search": "⏰ Busqueda automatica",
  "You can schedule searches. Set the search you want from the ": "Puede programar búsquedas. Establezca la búsqueda que desee en la ",
  "main interface": "interfaz principal",
  " and click its ⏰ ": " y haga clic en el ⏰ ",
  "schedule search": "Programar búsqueda",
  " button.": " botón.",
  "Timezone: ": "Zona horaria",
  "Search terms": "Términos de búsqueda",
  "Last search": "Ultima busqueda",
  "Next search date": "Próxima búsqueda",
  "Periodicity": "Periodicidad",
  "💾": "",
  "Hourly": "Cada hora",
  "Daily": "Diaria",
  "Weekly": "Semanal",
  "Monthly": "Mensual",
  "Stop": "Desactivada",
  "✏️": "",
  "✖": "",
  " create source": " crear fuente",
  "Save date / time change": "Guardar cambio de fecha",
  "Edit": "Editar",
  "Clone": "Clon",
  "Delete": "Eliminar",
  "Launch": "Almorzar",
  "icon": "",
  "Clone line": "Clonación de línea",
  "Import: ": "Importar",
  "A propos": "Acerca de",
  "Position the cursor still over elements to get more info on them.": "Posiciona el cursor sobre los elementos para obtener más información.",
  "Settings": "Configuración",
  "Decentralized press meta-search engine": "Metabuscador de prensa descentralizado",
  "Click on the bouton \"Load some news\" below to load real news here": "Haga clic en el botón \"Cargar algunas noticias\" a continuación para cargar noticias reales aquí",
  "Click here to consult the official online documentation": "Haga clic aquí para consultar la documentación oficial en línea",
  "Enter your search terms and click on the sided button to start it": "Ingrese sus términos de búsqueda y haga clic en el botón lateral para iniciarlo",
  "Please consider a small donation to support Meta-Press.es": "Considere una pequeña donación para apoyar Meta-Press.es",
  "Show: ": "Mostrar",
  "all": "todos",
  " news ": " noticias ",
  "Load some news": "Cargar algun noticias",
  "Cancel": "Cancelar",
  "Advanced search": "Búsqueda Avanzada",
  "Type:": "Tipo:",
  "Agenda": "",
  "Database": "Base de datos",
  "Encyclo.": "Enciclo.",
  "Illustrated": "Ilustrada",
  "Institution": "Institución",
  "Magazine": "Revista",
  "Peer review": "Revisión por pares",
  "Press": "Prensa",
  "Radio": "",
  "Reference Press": "Prensa de Referencia",
  "Scientific Press": "Prensa Científica",
  "TV": "",
  "Language:": "Idioma:",
  "Result type:": "Tipo de resultado:",
  "audio": "",
  "photo": "foto",
  "text": "texto",
  "video": "",
  "Themes:": "Temas:",
  "docu.": "docs",
  "ecology": "ecología",
  "events": "",
  "financial": "finanzas",
  "general": "",
  "life-style": "estilo de vida",
  "media": "medios",
  "politics": "política",
  "science": "ciencia",
  "techno.": "tecnología",
  "Technical criterion:": "Criterio técnico:",
  "approx": "",
  "exact": "",
  "external search": "",
  "fast": "rápido",
  "internal search": "búsqueda interna",
  "many words": "muchas palabras",
  "never empty": "",
  "one word": "one palabra",
  "slow": "lento",
  "Country:": "País:",
  "Cherry-pick sources:": "Elegir fuentes:",
  "Currently ": "Actualmente ",
  " selected source(s). ": " fuentes seleccionadas. ",
  " reset filters": " reiniciar filtros",
  "⏰ schedule search": "⏰ Programar búsqueda",
  " is ": " en ",
  "waiting for ": " espera para ",
  " source(s)": " fuente(s)",
  " over ": " sobre ",
  " selected, since ": " seleccionado, mientras ",
  " fetched ": " obtuvo ",
  " results for \"": " resultados para \"",
  " in ": " en ",
  "s from ": "s desde ",
  " source(s) over ": " fuente(s) sobre ",
  " selected.": " seleccionado.",
  "Please consider a small ": "Por favor, considere una pequeña ",
  "donation": "donación",
  " to help keeping Meta-Press.es up-to-date.": " para ayudar a mantener Meta-Press.es actualizada",
  "No results.": "Sin resultados.",
  "Start test": "",
  "Number of results by page:": "Número de resultados por página:",
  "Total": "",
  "Last day": "1 día",
  "Last 2 days": "2 días",
  "Last 3 days": "3 días",
  "Last week": "1 semana",
  "Last 2 wks": "2 semanas",
  "Last month": "1 mes",
  "Last 2 mon.": "2 meses",
  "Last 6 mon.": "6 meses",
  "Last year": "1 año",
  "Last 2 yrs": "2 año",
  "Last 5 yrs": "5 año",
  "Last decade": "10 año",
  "All results": "Todos los resultados",
  "Save search as:": "Guardar búsqueda como:",
  "RSS file": "archivo RSS",
  "Selection mode:": "Modo de selección",
  "✅ toggle": "✅ cambiar",
  "Export selection in:": "Exportar selección en:",
  "Refresh sources": "",
  "Sources: ": "Fuentes: ",
  " (loaded in ": " (cargados en ",
  "s) for ": "s) para ",
  " countries and ": " países y ",
  " languages.": " idiomas.",
  "⇬ Back to top": "⇬ Volver arriba",
  "✍ Report feedback": "✍ Enviar comentarios",
  "€ Support the project": "€ Apoyar el proyecto",
  " WebExtension made by ": " WebExtension realizada por ",
  " with ": " con ",
  " and ": " y ",
  "Meta-Press.es needs the permission to read the content of the selected sources.\nThose \"host\" permissions can be dropped or requested once and for all via the\nMeta-Press.es setting page.": "Meta-Press.es necesita el permiso de leer el contenido de las fuentes seleccionadas.\n Se peude eliminar este permiso de afitrion (o dar los todos) en la pagina de Configuración de Meta-Press.es.",
  "Mobile Dev Tools": "",
  "Skip to main input": "Ir a la busca",
  "RSS feed file": "archivo canal RSS",
  "Like this :-)": "Como esto :-)",
  "Headlines": "Actualidades",
  "Search": "Búsqueda",
  "Show this quantity of headlines at once": "Muestre esta cantidad de titulares a la vez",
  "Reload the news": "Recargar noticias",
  "Remove the news": "Eliminar las noticias",
  "Type your query here": "Escriba su consulta aquí",
  "Click here to start the search. You can also press the Enter key.": "Haga clic aquí para comenzar la búsqueda. También puedes presionar la tecla Enter.",
  "Click to reload the page and start a new search": "Haga clic para volver a cargar la página y comenzar una nueva búsqueda.",
  "Criterion to restrict the research to some sources only. For instance, if you want only French sources, select the 'fr' tag in the Country filter.": "Criterio para restringir la investigación a algunas fuentes únicamente. Por ejemplo, si solo desea fuentes francesas, seleccione la etiqueta 'fr' en el filtro País",
  "Only sources of the selected types (press, radio, TV…) will be searched": "Solo se buscarán fuentes de los tipos seleccionados (prensa, radio, TV...)",
  "Only sources in the selected languages will be searched": "Solo se buscarán fuentes en los idiomas seleccionados",
  "Only sources producing results from those selected types will be searched": "Solo se bucarán fuentes de estos tipos de resultado",
  "Only sources of the selected themes will be searched": "Solo se buscarán fuentes de los temas seleccionados",
  "Only sources corresponding to all those selected criterion will be searched": "Solo se buscarán fuentes que correspondan a todos los criterios seleccionados",
  "Only sources from the selected contries will be searched": "Solo se buscarán fuentes de los países seleccionados",
  "You can also select one by one in which sources to search in": "También puede seleccionar una por una qué fuentes buscar",
  "Reset default selection": "Restablecer la selección predeterminada",
  "Schedule this search": "Programar esta busqueda",
  "Local permalink for this search": "Enlace permanente local para esta búsqueda",
  "Please donate today": "Por favor, dona hoy",
  "No result, because of a torn butterfly net ?": "Sin resultados",
  "Click to display all results again": "Haga clic para mostrar todos los resultados de nuevo",
  "Remove results of this source": "Eliminar resultados de esta fuenta",
  "Link to the results in the source site": "Enlace a los resultados en el sitio de la fuente",
  "Clear filter": "Limpiar el filtro",
  "toggle selection mode": "alternar el modo de selección",
  "Libres Software Service Society": "Libres Software Service Society",
  "Adding search, sort, filters and flexibility to various existing HTML element collections.": "Añadiendo búsqueda, clasificación, filtros y flexibilidad a varias colecciones de elementos HTML existentes.",
  "A vanilla, lightweight, configurable select box/text input plugin. Similar to Select2 and Selectize but without the jQuery dependency.": "",
  "Click to load image": "Clic para cargar la imagen",
  "save modification": "guardar modificación",
  "New result for scheduled search": "Nuevo resultado de la búsqueda programada",
  " new ": " nueva ",
  "This choice would result in an empty selection.": "Esta elección resultaría en una selección vacía.",
  "Filter results of": "filtrar resultados de",
  "only": "sólo",
  "Meta-Press.es butterfly net logo": "Meta-Press.es logotipo de red de mariposas",
  "Search terms, ex.": "Términos de búsqueda, ejemplo",
  "Filter results": "Filtrar resultados"
}
