<?xml version="1.0" encoding="UTF-8" standalone="no"?>
<svg
   xmlns:dc="http://purl.org/dc/elements/1.1/"
   xmlns:cc="http://creativecommons.org/ns#"
   xmlns:rdf="http://www.w3.org/1999/02/22-rdf-syntax-ns#"
   xmlns:svg="http://www.w3.org/2000/svg"
   xmlns="http://www.w3.org/2000/svg"
   viewBox="0 0 750.66669 234.66667"
   height="234.66667"
   width="750.66669"
   xml:space="preserve"
   id="svg2"
   version="1.1"><metadata
     id="metadata8"><rdf:RDF><cc:Work
         rdf:about=""><dc:format>image/svg+xml</dc:format><dc:type
           rdf:resource="http://purl.org/dc/dcmitype/StillImage" /><dc:title></dc:title></cc:Work></rdf:RDF></metadata><defs
     id="defs6" /><g
     transform="matrix(1.3333333,0,0,-1.3333333,0,234.66667)"
     id="g10"><g
       transform="scale(0.1)"
       id="g12"><path
         id="path14"
         style="fill:#000000;fill-opacity:1;fill-rule:nonzero;stroke:none"
         d="m 456.129,562.578 c -10,0 -17.969,4.961 -23.899,14.844 -5.941,9.918 -8.91,24.258 -8.91,43.129 l -1.41,220 c -1.051,18.75 -1.558,49.918 -1.558,93.59 -1.993,92.189 -2.973,196.249 -2.973,312.189 v 75.78 c -8.859,-47.62 -24.219,-114.49 -46.09,-200.63 -21.801,-89.29 -37.148,-162.609 -46.09,-220 v -8.902 l -4.379,-28.277 c -1.992,-21.801 -6.949,-44.071 -14.84,-66.879 -9.929,-23.871 -25.281,-35.781 -46.101,-35.781 -35.738,0 -53.59,46.597 -53.59,139.839 0,51.45 -5.238,106.64 -15.629,165.63 -10.308,58.94 -26.871,131.56 -49.68,217.81 l -44.6909,166.41 -2.9688,-178.28 c 0,-53.56 2.5,-155.63 7.4997,-306.249 l 2.969,-101.102 2.973,-203.59 c 0,-20.859 -7.4612,-39.648 -22.3518,-56.41 -24.8008,0 -41.8711,7.66 -51.25,22.973 -9.3711,15.308 -14.0586,37.848 -14.0586,67.66 l 2.9687,121.867 c 2.8906,53.52 4.3789,93.641 4.3789,120.321 l -2.9687,286.87 -2.9688,288.44 c 0,42.58 0.9688,106.48 2.9688,191.72 l 40.1484,23.75 c 7.8906,-0.94 15.8203,-6.64 23.75,-17.03 7.8906,-10.43 16.8831,-27.04 26.8831,-49.85 24.687,-61.48 56.867,-184.33 96.558,-368.59 5.942,-25.74 9.879,-47.03 11.879,-63.91 11.871,-57.5 20.313,-101.09 25.313,-130.78 l 22.187,-114.531 10.461,49.061 28.289,121.88 c 15.821,71.33 28.942,133.79 39.371,187.34 10.391,53.52 20.551,111.49 30.469,173.91 10.82,74.25 17.731,136.17 20.781,185.78 v 8.9 c 1.95,12.9 7.891,23.05 17.809,30.47 9.891,7.5 21.762,11.25 35.633,11.25 8.937,0 16.867,-4.02 23.75,-12.03 6.949,-7.93 10.468,-16.33 10.468,-25.15 0,-118.99 4.45,-296.84 13.43,-533.6 4.891,-115.94 8.36,-229.451 10.469,-340.471 1.961,-50.539 2.973,-114.449 2.973,-191.719 0,-22.808 -6.012,-43.121 -17.973,-60.929 -11.867,-17.821 -25.231,-26.723 -40,-26.723 z" /><path
         id="path16"
         style="fill:#000000;fill-opacity:1;fill-rule:nonzero;stroke:none"
         d="m 771.371,581.801 c -12.93,0 -24.609,4.488 -35,13.429 -10.43,8.95 -16.101,19.852 -17.031,32.661 v 68.441 c -1.059,8.828 -1.57,19.258 -1.57,31.25 0,20.699 -1.481,52.379 -4.372,95 l -2.968,95.148 c 0,48.52 1.449,120.86 4.371,217.04 3.949,86.25 5.937,158.59 5.937,217.03 0,13.82 -1.476,34.68 -4.367,62.5 -3.051,28.63 -4.531,49.41 -4.531,62.34 0,70.39 20.82,105.63 62.5,105.63 32.691,0 70.539,-6.49 113.59,-19.38 43.121,-12.93 64.691,-28.28 64.691,-46.09 0,-9.92 -4.223,-19.07 -12.66,-27.5 -8.359,-8.44 -18.441,-15.12 -30.313,-20 -41.679,14.76 -79.339,24.68 -112.968,29.68 0.941,-14.92 1.41,-36.21 1.41,-63.9 0,-39.69 -0.469,-75.39 -1.41,-107.03 -3.051,-47.62 -4.532,-83.28 -4.532,-107.03 l 4.532,-23.75 23.75,1.4 c 7.89,1.02 17.808,1.56 29.691,1.56 47.578,0 71.399,-13.9 71.399,-41.71 0,-10.86 -4.489,-20 -13.43,-27.5 -8.988,-7.43 -20.391,-11.1 -34.219,-11.1 -17.82,0 -31.68,0.98 -41.57,2.97 h -37.18 c 1.949,-25.74 2.969,-63.4 2.969,-112.97 0,-49.611 -0.469,-94.182 -1.41,-133.748 -3.051,-60.434 -4.532,-105.551 -4.532,-135.313 0,-55.55 0.973,-83.277 2.973,-83.277 l 49.059,1.559 c 16.871,1.019 37.191,1.558 60.941,1.558 37.688,0 56.559,-11.949 56.559,-35.777 0,-13.871 -6.211,-24.453 -18.59,-31.871 -12.43,-7.5 -27.578,-11.25 -45.469,-11.25 z" /><path
         id="path18"
         style="fill:#000000;fill-opacity:1;fill-rule:nonzero;stroke:none"
         d="m 1207.15,624.922 -1.41,57.969 c -1.05,16.879 -1.56,35.699 -1.56,56.558 l 1.56,50.473 c -3.04,10.937 -10.47,119.418 -22.34,325.468 -11.88,206.13 -18.83,338.44 -20.78,396.88 -57.5,1.95 -94.18,7.96 -110,17.96 -10.94,7.89 -16.41,16.8 -16.41,26.72 0,7.89 5.2,15.08 15.63,21.57 10.39,6.44 21.01,9.68 31.87,9.68 27.81,0 61.49,-1.99 101.09,-5.93 37.7,-5 71.41,-7.5 101.1,-7.5 h 23.75 c 30.7,0 46.09,-11.88 46.09,-35.63 0,-11.87 -4.96,-21.56 -14.84,-29.06 -9.92,-7.42 -21.33,-11.1 -34.22,-11.1 -8.87,0 -21.72,1.45 -38.59,4.38 l -29.69,5.94 -1.56,-7.35 -1.41,-7.5 c 0,-88.12 8.36,-228.83 25.16,-422.03 15.93,-181.369 23.9,-322.111 23.9,-422.19 0,-11.871 -5.23,-22.3 -15.62,-31.25 -10.43,-8.859 -22.11,-13.281 -35,-13.281 z" /><path
         id="path20"
         style="fill:#000000;fill-opacity:1;fill-rule:nonzero;stroke:none"
         d="m 1796.99,587.73 c -22.73,0 -39.53,3.52 -50.47,10.469 -10.93,6.961 -16.4,19.852 -16.4,38.602 0,29.758 -4.96,80.347 -14.85,151.719 l -5.93,31.089 -147.19,22.34 c -5.94,-22.808 -14.34,-68.898 -25.16,-138.277 -5.94,-48.551 -15.39,-80.742 -28.28,-96.563 -6.99,-8.949 -16.87,-13.437 -29.69,-13.437 -11.99,0 -22.93,3.707 -32.81,11.098 -9.92,7.5 -14.84,16.71 -14.84,27.652 l 2.97,7.348 1.56,5.929 c 65.39,254.692 114.92,505.861 148.59,753.601 0,4.06 0.47,10.78 1.41,20.15 1.01,9.38 2.07,23.01 3.12,40.94 2.89,36.56 6.1,65.7 9.53,87.5 3.52,21.88 9.26,38.28 17.19,49.22 h 50.47 c 13.83,0 25.7,-3.24 35.63,-9.69 10,-6.48 15,-15.62 15,-27.5 0,-75.31 10.35,-187.3 31.09,-335.94 19.88,-152.61 29.84,-259.64 29.84,-321.089 0,-5.942 2.43,-21.332 7.35,-46.09 5,-22.821 7.5,-37.66 7.5,-44.531 0,-7 4.92,-36.719 14.84,-89.219 8.95,-47.621 13.44,-78.36 13.44,-92.192 v -1.41 c 0,-21.867 -7.97,-35.777 -23.91,-41.719 z m -98.12,285.469 c -2.93,14.891 -4.38,33.211 -4.38,55 0,89.141 -7.93,203.131 -23.75,341.881 l -14.84,154.53 c -42.62,-232.81 -71.88,-408.71 -87.81,-527.661 14.88,-9.918 58.47,-17.808 130.78,-23.75 z" /><path
         id="path22"
         style="fill:#000000;fill-opacity:1;fill-rule:nonzero;stroke:none"
         d="m 2025.7,1076.8 c -12.93,0 -24.33,4.22 -34.22,12.65 -9.92,8.44 -14.84,18.6 -14.84,30.47 0,11.88 11.88,22.27 35.63,31.25 33.75,12.81 92.22,21.72 175.46,26.72 31.65,1.95 51.96,2.97 60.94,2.97 12.89,0 24.3,-4.22 34.22,-12.66 9.88,-8.43 14.84,-18.59 14.84,-30.47 0,-11.87 -11.87,-22.3 -35.62,-31.25 -33.75,-12.81 -92.27,-21.71 -175.47,-26.71 -31.68,-2 -51.99,-2.97 -60.94,-2.97 z" /><path
         id="path24"
         style="fill:#000000;fill-opacity:1;fill-rule:nonzero;stroke:none"
         d="m 2557.73,593.672 c -10.85,0 -19.49,4.687 -25.93,14.058 -6.49,9.461 -9.69,21.141 -9.69,35 l 2.97,249.848 c 2.89,120.822 4.37,214.452 4.37,280.942 0,230.82 -12.89,407.69 -38.59,530.62 14.88,22.7 33.75,34.06 56.56,34.06 36.64,0 70.08,-8.2 100.31,-24.53 30.2,-16.25 55.2,-38.28 75,-66.09 38.64,-57.5 57.97,-121.96 57.97,-193.28 0,-74.3 -15.9,-140.71 -47.65,-199.22 -31.68,-58.44 -77.74,-103.99 -138.13,-136.56 l 2.97,-150.161 2.97,-78.75 c 1.02,-16.879 1.56,-41.211 1.56,-72.968 2.89,-66.371 4.38,-120.391 4.38,-162.032 0,-18.75 -3.99,-33.589 -11.88,-44.527 -7.93,-10.941 -20.31,-16.41 -37.19,-16.41 z m 34.22,596.098 c 38.64,36.64 67.11,75.03 85.47,115.15 18.32,40.2 27.5,85.55 27.5,136.1 v 1.4 c 0,22.81 -2.5,51.56 -7.5,86.25 -2.93,11.88 -8.36,23.75 -16.25,35.63 -7.93,11.95 -12.42,18.94 -13.44,20.93 -6.87,9.89 -25.23,25.24 -55,46.1 l -38.59,28.12 c 0,-50.54 2.97,-128.83 8.91,-234.84 z" /><path
         id="path26"
         style="fill:#000000;fill-opacity:1;fill-rule:nonzero;stroke:none"
         d="m 3198.48,575.859 c -21.8,0 -41.57,23.832 -59.38,71.411 -20.86,51.562 -36.21,104.57 -46.09,159.062 l -10.47,50.469 c -28.75,141.75 -47.11,222.539 -55,242.339 h -17.81 c 0,-28.75 -0.55,-55 -1.57,-78.75 v -81.87 c 0,-132.739 9.42,-236.25 28.29,-310.629 L 3020.2,587.73 h -41.72 l -19.38,22.352 1.56,99.527 c 0,89.262 -4.49,224.532 -13.43,405.781 -7.93,193.32 -11.88,328.63 -11.88,405.94 0,47.5 16.33,71.25 49.06,71.25 53.52,0 97.39,-13.91 131.57,-41.72 34.14,-27.74 51.25,-66.33 51.25,-115.78 v -104.06 c 0,-14.93 -2.5,-32.04 -7.5,-51.41 -4.93,-19.3 -10.32,-34.84 -16.25,-46.72 l -28.28,-53.44 -23.75,-44.68 7.5,-35.63 20.78,-105.62 c 13.82,-76.25 27.18,-138.211 40,-185.79 12.89,-47.5 28.79,-90.582 47.65,-129.21 l 8.91,-17.821 c 9.88,-19.918 14.84,-35.777 14.84,-47.648 0,-9.93 -2.97,-18.52 -8.9,-25.942 -5.94,-7.5 -13.87,-11.25 -23.75,-11.25 z m -182.82,596.091 c 21.76,10.94 40.32,40.86 55.63,89.85 15.39,49.06 23.12,94.41 23.12,136.09 0,31.64 -3.98,61.41 -11.87,89.22 -5,15.82 -13.2,27.97 -24.53,36.41 -11.37,8.43 -25.47,12.65 -42.35,12.65 l -2.96,-7.5 -2.97,-13.44 2.97,-175.31 c 1.95,-51.56 2.96,-107.58 2.96,-167.97 z" /><path
         id="path28"
         style="fill:#000000;fill-opacity:1;fill-rule:nonzero;stroke:none"
         d="m 3445.12,581.801 c -12.93,0 -24.61,4.488 -35,13.429 -10.43,8.95 -16.1,19.852 -17.03,32.661 v 68.441 c -1.06,8.828 -1.57,19.258 -1.57,31.25 0,20.699 -1.48,52.379 -4.37,95 l -2.97,95.148 c 0,48.52 1.44,120.86 4.37,217.04 3.95,86.25 5.94,158.59 5.94,217.03 0,13.82 -1.48,34.68 -4.37,62.5 -3.05,28.63 -4.53,49.41 -4.53,62.34 0,70.39 20.82,105.63 62.5,105.63 32.69,0 70.54,-6.49 113.59,-19.38 43.12,-12.93 64.69,-28.28 64.69,-46.09 0,-9.92 -4.22,-19.07 -12.66,-27.5 -8.36,-8.44 -18.44,-15.12 -30.31,-20 -41.68,14.76 -79.34,24.68 -112.97,29.68 0.94,-14.92 1.41,-36.21 1.41,-63.9 0,-39.69 -0.47,-75.39 -1.41,-107.03 -3.05,-47.62 -4.53,-83.28 -4.53,-107.03 l 4.53,-23.75 23.75,1.4 c 7.89,1.02 17.81,1.56 29.69,1.56 47.58,0 71.4,-13.9 71.4,-41.71 0,-10.86 -4.49,-20 -13.43,-27.5 -8.99,-7.43 -20.39,-11.1 -34.22,-11.1 -17.82,0 -31.68,0.98 -41.57,2.97 h -37.18 c 1.95,-25.74 2.97,-63.4 2.97,-112.97 0,-49.611 -0.47,-94.182 -1.41,-133.748 -3.05,-60.434 -4.53,-105.551 -4.53,-135.313 0,-55.55 0.98,-83.277 2.97,-83.277 l 49.06,1.559 c 16.87,1.019 37.19,1.558 60.94,1.558 37.69,0 56.56,-11.949 56.56,-35.777 0,-13.871 -6.21,-24.453 -18.59,-31.871 -12.43,-7.5 -27.58,-11.25 -45.47,-11.25 z" /><path
         id="path30"
         style="fill:#000000;fill-opacity:1;fill-rule:nonzero;stroke:none"
         d="m 3824.49,580.391 c -17.93,2.929 -33.08,9.379 -45.47,19.379 -12.42,9.878 -19.61,22.73 -21.56,38.589 l 16.41,25.313 c 5.93,0 15.35,-2.031 28.28,-6.09 14.88,-2.934 26.29,-4.383 34.22,-4.383 17.81,0 33.9,7.891 48.28,23.75 14.37,15.821 25,36.641 31.87,62.5 12.89,47.5 19.38,90.082 19.38,127.821 0,65.39 -20.86,134.25 -62.5,206.56 l -16.25,28.28 c -18.87,32.69 -34.77,61.91 -47.66,87.66 -12.81,25.7 -23.71,53.47 -32.65,83.28 -11.88,38.63 -17.82,77.26 -17.82,115.93 0,43.52 9.89,89.11 29.69,136.72 9.88,22.82 23.99,41.41 42.34,55.78 18.33,14.38 38.91,21.57 61.72,21.57 17.82,0 34.38,-5.75 49.69,-17.19 15.39,-11.37 23.13,-24.96 23.13,-40.78 0,-8.99 -3.52,-15.94 -10.47,-20.94 -6.88,-4.92 -15.28,-7.34 -25.16,-7.34 -10.94,0 -21.37,2.97 -31.25,8.9 -21.8,-0.93 -39.14,-20.27 -52.03,-57.97 -10.86,-34.68 -16.25,-63.43 -16.25,-86.25 0,-28.75 4.41,-57.77 13.28,-87.03 8.95,-29.18 20.35,-55.62 34.22,-79.37 l 32.66,-59.53 52.03,-98.13 c 13.83,-27.73 25,-59.92 33.43,-96.561 8.44,-36.679 12.66,-73.828 12.66,-111.41 0,-60.539 -13.87,-118.039 -41.56,-172.5 -13.87,-27.73 -33.44,-50 -58.75,-66.867 -25.31,-16.883 -53.28,-25.312 -83.91,-25.312 z" /><path
         id="path32"
         style="fill:#000000;fill-opacity:1;fill-rule:nonzero;stroke:none"
         d="m 4193.2,580.391 c -17.93,2.929 -33.08,9.379 -45.47,19.379 -12.42,9.878 -19.61,22.73 -21.56,38.589 l 16.41,25.313 c 5.94,0 15.35,-2.031 28.28,-6.09 14.88,-2.934 26.29,-4.383 34.22,-4.383 17.81,0 33.9,7.891 48.28,23.75 14.37,15.821 25,36.641 31.87,62.5 12.89,47.5 19.38,90.082 19.38,127.821 0,65.39 -20.86,134.25 -62.5,206.56 l -16.25,28.28 c -18.87,32.69 -34.77,61.91 -47.66,87.66 -12.81,25.7 -23.71,53.47 -32.65,83.28 -11.88,38.63 -17.82,77.26 -17.82,115.93 0,43.52 9.89,89.11 29.69,136.72 9.88,22.82 23.99,41.41 42.35,55.78 18.32,14.38 38.9,21.57 61.71,21.57 17.82,0 34.38,-5.75 49.69,-17.19 15.39,-11.37 23.13,-24.96 23.13,-40.78 0,-8.99 -3.52,-15.94 -10.47,-20.94 -6.88,-4.92 -15.28,-7.34 -25.16,-7.34 -10.94,0 -21.37,2.97 -31.25,8.9 -21.8,-0.93 -39.14,-20.27 -52.03,-57.97 -10.86,-34.68 -16.25,-63.43 -16.25,-86.25 0,-28.75 4.41,-57.77 13.28,-87.03 8.95,-29.18 20.35,-55.62 34.22,-79.37 l 32.66,-59.53 52.03,-98.13 c 13.83,-27.73 25,-59.92 33.44,-96.561 8.43,-36.679 12.65,-73.828 12.65,-111.41 0,-60.539 -13.87,-118.039 -41.56,-172.5 -13.87,-27.73 -33.44,-50 -58.75,-66.867 -25.31,-16.883 -53.28,-25.312 -83.91,-25.312 z" /><path
         id="path34"
         style="fill:#000000;fill-opacity:1;fill-rule:nonzero;stroke:none"
         d="m 4648.01,577.422 c -12.81,0 -24.22,5.469 -34.22,16.41 -9.92,10.816 -14.84,23.156 -14.84,37.027 0,14.879 5.46,28.282 16.4,40.161 10.94,11.871 23.79,17.812 38.6,17.812 13.94,0 26.32,-5.941 37.18,-17.812 10.94,-11.879 16.41,-24.77 16.41,-38.598 0,-15.863 -5.74,-28.981 -17.19,-39.371 -11.37,-10.391 -25.47,-15.629 -42.34,-15.629 z" /><path
         id="path36"
         style="fill:#000000;fill-opacity:1;fill-rule:nonzero;stroke:none"
         d="m 5030.23,581.801 c -12.93,0 -24.61,4.488 -35,13.429 -10.43,8.95 -16.09,19.852 -17.03,32.661 v 68.441 c -1.05,8.828 -1.56,19.258 -1.56,31.25 0,20.699 -1.48,52.379 -4.37,95 l -2.97,95.148 c 0,48.52 1.44,120.86 4.37,217.04 3.95,86.25 5.94,158.59 5.94,217.03 0,13.82 -1.49,34.68 -4.38,62.5 -3.04,28.63 -4.53,49.41 -4.53,62.34 0,70.39 20.82,105.63 62.5,105.63 32.7,0 70.55,-6.49 113.6,-19.38 43.12,-12.93 64.68,-28.28 64.68,-46.09 0,-9.92 -4.21,-19.07 -12.65,-27.5 -8.36,-8.44 -18.44,-15.12 -30.31,-20 -41.68,14.76 -79.34,24.68 -112.97,29.68 0.93,-14.92 1.4,-36.21 1.4,-63.9 0,-39.69 -0.47,-75.39 -1.4,-107.03 -3.05,-47.62 -4.53,-83.28 -4.53,-107.03 l 4.53,-23.75 23.75,1.4 c 7.89,1.02 17.81,1.56 29.68,1.56 47.58,0 71.41,-13.9 71.41,-41.71 0,-10.86 -4.49,-20 -13.44,-27.5 -8.98,-7.43 -20.39,-11.1 -34.22,-11.1 -17.81,0 -31.68,0.98 -41.56,2.97 h -37.19 c 1.96,-25.74 2.97,-63.4 2.97,-112.97 0,-49.611 -0.47,-94.182 -1.4,-133.748 -3.05,-60.434 -4.53,-105.551 -4.53,-135.313 0,-55.55 0.97,-83.277 2.96,-83.277 l 49.07,1.559 c 16.87,1.019 37.18,1.558 60.93,1.558 37.7,0 56.57,-11.949 56.57,-35.777 0,-13.871 -6.21,-24.453 -18.6,-31.871 -12.42,-7.5 -27.57,-11.25 -45.47,-11.25 z" /><path
         id="path38"
         style="fill:#000000;fill-opacity:1;fill-rule:nonzero;stroke:none"
         d="m 5409.61,580.391 c -17.93,2.929 -33.09,9.379 -45.47,19.379 -12.42,9.878 -19.61,22.73 -21.56,38.589 l 16.4,25.313 c 5.94,0 15.36,-2.031 28.29,-6.09 14.88,-2.934 26.28,-4.383 34.21,-4.383 17.82,0 33.91,7.891 48.29,23.75 14.37,15.821 25,36.641 31.87,62.5 12.89,47.5 19.38,90.082 19.38,127.821 0,65.39 -20.86,134.25 -62.5,206.56 l -16.25,28.28 c -18.87,32.69 -34.77,61.91 -47.66,87.66 -12.81,25.7 -23.71,53.47 -32.66,83.28 -11.87,38.63 -17.81,77.26 -17.81,115.93 0,43.52 9.88,89.11 29.69,136.72 9.88,22.82 23.98,41.41 42.34,55.78 18.32,14.38 38.91,21.57 61.72,21.57 17.81,0 34.38,-5.75 49.69,-17.19 15.39,-11.37 23.12,-24.96 23.12,-40.78 0,-8.99 -3.51,-15.94 -10.47,-20.94 -6.87,-4.92 -15.27,-7.34 -25.15,-7.34 -10.94,0 -21.37,2.97 -31.25,8.9 -21.8,-0.93 -39.14,-20.27 -52.03,-57.97 -10.86,-34.68 -16.25,-63.43 -16.25,-86.25 0,-28.75 4.41,-57.77 13.28,-87.03 8.94,-29.18 20.35,-55.62 34.22,-79.37 l 32.65,-59.53 52.03,-98.13 c 13.83,-27.73 25,-59.92 33.44,-96.561 8.44,-36.679 12.66,-73.828 12.66,-111.41 0,-60.539 -13.87,-118.039 -41.56,-172.5 -13.87,-27.73 -33.44,-50 -58.75,-66.867 -25.32,-16.883 -53.29,-25.312 -83.91,-25.312 z" /><path
         id="path40"
         style="fill:#8a916f;fill-opacity:1;fill-rule:nonzero;stroke:none"
         d="m 32.8516,25.8594 c -4.0625,0 -8.1211,1.0508 -12.1914,3.1211 -4.0586,2.0703 -6.0899,4.4609 -6.0899,7.1914 0,1.9492 1.3281,5.3476 4.0586,10.1562 2.6992,4.4532 3.9102,7.8907 3.6016,10.3125 l -1.5703,44.8394 -3.5899,139.54 -1.0898,61.871 c -0.3203,37.808 -1.1797,61.449 -2.5,70.937 -0.6289,3.75 -2,8.012 -4.07034,12.813 -2.42188,6.449 -3.58985,11.019 -3.58985,13.75 0,8.199 12.96879,12.339 38.91019,12.339 h 2.5 c 17.3789,0 32.3789,-6.011 45,-17.96 9.7575,-9.18 18.6285,-23.68 26.5585,-43.442 5.391,-15.629 9.449,-33.129 12.191,-52.5 1.321,-10.238 2.54,-25.898 3.59,-47.027 v -15.942 c 0,-21.058 -2.808,-43.91 -8.441,-68.589 -5.617,-24.692 -13.551,-47.782 -23.75,-69.2192 C 96.2109,84.3789 88.3203,72.1094 78.6289,61.1719 68.9492,50.2305 59.6484,41.5586 50.8203,35.2305 41.9492,28.9805 35.9805,25.8594 32.8516,25.8594 Z m 7.6601,26.0898 c 12.5781,6.4492 23.8281,15.8594 33.75,28.2813 9.8789,12.5 17.7266,26.2495 23.5899,41.2495 5.0784,12.579 9.2964,26.961 12.6604,43.129 3.437,16.25 5.816,31.332 7.187,45.313 1.012,12.187 1.563,23.906 1.563,35.156 0,99.453 -27.4612,149.223 -82.3518,149.223 -7.1094,0 -10.6211,-1.879 -10.6211,-5.629 0,-11.871 0.6601,-26.012 2.0312,-42.344 1.3281,-16.68 2.0313,-30.859 2.0313,-42.5 0,-18.75 1.3281,-51.25 4.0586,-97.5 2.3906,-40.238 3.6015,-72.617 3.6015,-97.187 V 51.9492 Z" /><path
         id="path42"
         style="fill:#8a916f;fill-opacity:1;fill-rule:nonzero;stroke:none"
         d="m 214.77,20.2305 c -6.18,0 -9.61,3.5976 -10.321,10.789 v 6.711 c 0.321,1.6484 0.473,3.6797 0.473,6.0976 l -2.031,2.0313 c 2.808,7.1914 4.218,14.1406 4.218,20.9414 0,7.8086 -0.55,19.0586 -1.558,33.7502 l -1.102,33.75 c 0,16.949 0.512,42.5 1.571,76.558 1.32,30.313 2.031,56.02 2.031,77.192 l -0.942,30.621 c -0.738,9.137 -1.089,19.379 -1.089,30.629 0,5.078 1.171,8.75 3.589,10.929 2.379,2.27 6.129,3.442 11.25,3.442 3.442,0 6.129,-1.051 8.121,-3.121 0.711,-0.321 5.668,-1.02 14.848,-2.031 8.512,-1.059 15.863,-2.579 22.031,-4.54 6.442,-2.101 9.692,-4.64 9.692,-7.652 0,-3.437 -3.25,-6.879 -9.692,-10.308 -19.488,6.441 -33.281,9.679 -41.41,9.679 l -2.648,-2.969 c 0.39,-3.121 0.621,-10.46 0.621,-22.031 0,-14.609 -0.391,-27.73 -1.094,-39.371 -0.308,-11.879 -0.469,-25.156 -0.469,-39.848 0,-9.492 2.379,-14.21 7.192,-14.21 l 8.121,0.46 c 2.699,0.321 5.629,0.469 8.75,0.469 13.199,0 19.848,-3.039 19.848,-9.058 0,-3.75 -0.899,-6.95 -2.661,-9.532 -1.679,-2.5 -4.179,-3.75 -7.5,-3.75 -5.121,0 -9.058,1.332 -11.879,4.063 l -16.25,2.5 h -2.652 l -2.5,-2.5 v -1.563 c 0.703,-5.859 1.094,-19.3 1.094,-40.308 0,-13.36 -0.231,-25.473 -0.621,-36.41 l -0.473,-36.2504 c 0,-13.2422 0.512,-26.8398 1.563,-40.7812 0.308,-7.9297 1.949,-13.1992 5,-15.7813 3.129,-2.5 8.789,-3.75 17.031,-3.75 l 9.058,0.6211 c 3.129,0.3203 6.571,0.4727 10.321,0.4727 9.879,0 14.84,-2.2617 14.84,-6.7227 0,-6.1289 -7.5,-9.2187 -22.5,-9.2187 z" /><path
         id="path44"
         style="fill:#8a916f;fill-opacity:1;fill-rule:nonzero;stroke:none"
         d="m 373.48,23.3594 c -6.492,2.1094 -12,5 -16.57,8.75 -4.609,3.75 -8.898,9.3711 -12.961,16.8711 -7.187,13.5195 -11.488,33.1289 -12.82,58.7495 -0.738,11.571 -1.09,21.758 -1.09,30.629 v 58.282 c 0,22.07 0.699,43.519 2.191,64.379 0.93,15.308 2.418,28.199 4.532,38.75 2.066,10.621 5.308,21.171 9.687,31.71 4.762,10.942 10.031,18.598 15.781,22.969 2.379,2.071 7.032,4.461 13.899,7.192 4.383,1.64 8.641,3.519 12.82,5.629 h 21.871 c 0.309,-0.321 0.821,-0.469 1.559,-0.469 l 2.5,-0.629 2.031,-1.563 c 1.02,-0.937 1.57,-1.64 1.57,-2.031 0.309,-0.629 0.469,-1.637 0.469,-2.969 l -6.57,-7.66 H 390.98 c -6.57,0 -12.5,-3.199 -17.82,-9.527 -5.23,-6.25 -9.18,-14.184 -11.871,-23.75 -2.738,-8.551 -4.961,-18.594 -6.719,-30.152 -1.679,-11.571 -2.66,-21.641 -2.968,-30.161 -0.743,-10.859 -1.09,-18.359 -1.09,-22.5 l -0.942,-2.5 c 0,-19.058 -0.39,-36.25 -1.09,-51.558 l -0.941,-51.571 c 0,-15 0.981,-28.82 2.973,-41.4019 1.758,-13.6679 6.718,-25.9375 14.84,-36.8789 7.808,-10.8594 19.878,-16.25 36.25,-16.25 5.078,0 9.378,1.4922 12.808,4.5313 5.078,0 7.66,-1.8711 7.66,-5.6211 0,-2.418 -2.148,-5.2305 -6.41,-8.4375 -4.289,-3.2031 -8.59,-5.6602 -12.961,-7.3438 H 385.82 Z" /><path
         id="path46"
         style="fill:#8a916f;fill-opacity:1;fill-rule:nonzero;stroke:none"
         d="m 491.211,20.2305 c -6.172,0 -9.609,3.5976 -10.313,10.789 v 6.711 c 0.313,1.6484 0.473,3.6797 0.473,6.0976 l -2.031,2.0313 c 2.808,7.1914 4.211,14.1406 4.211,20.9414 0,7.8086 -0.539,19.0586 -1.563,33.7502 l -1.09,33.75 c 0,16.949 0.512,42.5 1.563,76.558 1.328,30.313 2.027,56.02 2.027,77.192 l -0.937,30.621 c -0.742,9.137 -1.09,19.379 -1.09,30.629 0,5.078 1.168,8.75 3.59,10.929 2.39,2.27 6.14,3.442 11.25,3.442 3.437,0 6.14,-1.051 8.129,-3.121 0.699,-0.321 5.66,-1.02 14.84,-2.031 8.519,-1.059 15.859,-2.579 22.031,-4.54 6.449,-2.101 9.687,-4.64 9.687,-7.652 0,-3.437 -3.238,-6.879 -9.687,-10.308 -19.492,6.441 -33.281,9.679 -41.403,9.679 l -2.66,-2.969 c 0.391,-3.121 0.633,-10.46 0.633,-22.031 0,-14.609 -0.391,-27.73 -1.101,-39.371 -0.309,-11.879 -0.469,-25.156 -0.469,-39.848 0,-9.492 2.39,-14.21 7.187,-14.21 l 8.133,0.46 c 2.688,0.321 5.617,0.469 8.75,0.469 13.199,0 19.84,-3.039 19.84,-9.058 0,-3.75 -0.902,-6.95 -2.66,-9.532 -1.672,-2.5 -4.172,-3.75 -7.5,-3.75 -5.11,0 -9.063,1.332 -11.871,4.063 l -16.25,2.5 h -2.66 l -2.5,-2.5 v -1.563 c 0.71,-5.859 1.101,-19.3 1.101,-40.308 0,-13.36 -0.242,-25.473 -0.633,-36.41 L 497.77,95.3906 c 0,-13.2422 0.511,-26.8398 1.57,-40.7812 0.308,-7.9297 1.949,-13.1992 5,-15.7813 3.121,-2.5 8.781,-3.75 17.031,-3.75 l 9.059,0.6211 c 3.121,0.3203 6.558,0.4727 10.308,0.4727 9.883,0 14.852,-2.2617 14.852,-6.7227 0,-6.1289 -7.5,-9.2187 -22.5,-9.2187 z" /><path
         id="path48"
         style="fill:#8a916f;fill-opacity:1;fill-rule:nonzero;stroke:none"
         d="m 742.422,24.9219 c -2.731,0 -4.692,1.0195 -5.942,2.9687 -1.171,2.0703 -2.261,5.1602 -3.281,9.2188 -0.308,2.8125 -1.008,5.1914 -2.027,7.1914 l 0.629,1.5586 c -2.821,16.0195 -8.68,35.6211 -17.5,58.7496 l -9.071,26.563 c -0.742,0.707 -4.019,9.418 -9.839,26.098 l -4.063,12.179 c -30.629,94.692 -49.848,145.981 -57.656,153.91 -2.731,-9.3 -4.063,-21.211 -4.063,-35.781 0,-7.93 0.161,-14.769 0.469,-20.469 l 0.473,-20 -0.473,-12.187 c -0.308,-3.75 -0.469,-7.891 -0.469,-12.344 0,-7.5 0.313,-13.988 0.942,-19.379 0.699,-10.859 1.09,-16.25 1.09,-16.25 h -1.563 c 0,-56.988 1.172,-88.3592 3.594,-94.0584 V 46.9492 c 1.328,-2.8086 2.027,-6.3984 2.027,-10.7773 0,-2.7305 -0.929,-5.1211 -2.808,-7.1914 -1.871,-2.0703 -4.18,-3.1211 -6.871,-3.1211 -7.192,0 -10.79,9.2187 -10.79,27.6601 l 1.098,16.4024 c 0.621,5.0781 0.942,10.6992 0.942,16.8789 0,16.3202 -0.551,40.8202 -1.571,73.4292 -0.929,32.7 -1.398,57.231 -1.398,73.598 0,9.883 0.469,25.043 1.398,45.473 1.02,20.078 1.571,35.078 1.571,45 v 6.719 c 0,16.64 3.039,27.531 9.21,32.652 l 1.571,-1.563 5.148,1.09 c 1.332,-0.429 2.852,-1.48 4.531,-3.121 1.329,-1.367 2.04,-2.887 2.04,-4.527 l 1.089,-3.129 c 0,-0.742 0.039,-1.371 0.161,-1.871 0.191,-0.43 0.308,-0.629 0.308,-0.629 5.391,-24.301 17.652,-58.203 36.723,-101.723 19.449,-46.051 31.558,-76.519 36.25,-91.398 3.429,-12 6.168,-22.582 8.277,-31.723 6.442,-28.9882 14.102,-51.328 22.973,-67.0272 l 0.929,1.5586 c 7.899,75.6206 11.879,168.4416 11.879,278.4416 l -0.629,6.25 c -0.308,1.64 -0.46,3.82 -0.46,6.558 0,7.192 2.378,10.782 7.179,10.782 3.012,0 5.629,-1.563 7.821,-4.692 2.261,-3.039 3.429,-6.398 3.429,-10.148 v -34.223 l -2.648,-4.058 c 0,-32.43 -1.879,-85.59 -5.629,-159.54 C 763.75,75.1211 760.23,34.9609 756.801,28.5195 l -8.75,-2.039 v -0.6211 l -0.473,0.6211 z" /><path
         id="path50"
         style="fill:#8a916f;fill-opacity:1;fill-rule:nonzero;stroke:none"
         d="m 880.352,34.1406 -0.473,18.9102 c -0.309,5.3906 -0.469,11.4805 -0.469,18.2773 0,3.4414 0.16,6.3321 0.469,8.75 l 0.473,9.2227 c 0,3.4297 -0.704,7.5 -2.032,12.1792 0,22.899 -1.718,65.36 -5.16,127.348 -3.359,59.883 -5.148,100.551 -5.461,122.031 -21.179,0 -35.32,0.512 -42.5,1.563 -6.801,1.637 -10.16,4.379 -10.16,8.129 1.641,3.75 4.883,5.621 9.691,5.621 10.192,0 25,-0.703 44.372,-2.031 17.699,-1.68 32.539,-2.5 44.527,-2.5 h 10.633 l 10.777,0.468 c 6.133,0 9.223,-2.187 9.223,-6.558 0,-2.11 -1.102,-3.75 -3.282,-5 -2.191,-1.172 -4.851,-1.723 -7.968,-1.723 -6.801,0 -13.91,0.352 -21.41,1.094 l -22.032,0.937 c -1.371,0 -2.031,-0.55 -2.031,-1.558 -0.309,-0.942 -0.469,-4.18 -0.469,-9.692 0,-33.05 2.032,-83.089 6.09,-150.16 3.75,-69.488 5.629,-119.3709 5.629,-149.6795 0,-2.4297 -1.488,-4.6484 -4.379,-6.7187 -2.93,-2 -5.738,-2.9727 -8.43,-2.9727 z" /><path
         id="path52"
         style="fill:#8a916f;fill-opacity:1;fill-rule:nonzero;stroke:none"
         d="m 1076.6,20.8594 c -4.06,4.3711 -8.51,16.0898 -13.28,35.1601 -4.8,19.1407 -9.22,40.6211 -13.28,64.3715 -2.74,19.449 -6.64,38.75 -11.72,57.808 -4.18,16.961 -8.12,25.473 -11.87,25.473 h -1.57 c -7.42,0 -11.09,-2.344 -11.09,-7.031 0,-24.61 1.33,-61.871 4.06,-111.8715 1.33,-30.75 2.85,-48.6797 4.53,-53.75 l -4.06,-8.5976 h -7.19 l -4.06,4.0586 c -5.43,157.2695 -8.121,264.5705 -8.121,321.8785 0,3.75 0.231,6.801 0.781,9.219 0.5,2.383 1.6,4.57 3.28,6.563 1.33,2.379 3.75,3.589 7.19,3.589 17.26,0 31.17,-4.289 41.71,-12.808 10.63,-8.442 15.94,-20.703 15.94,-36.723 v -37.34 c 0,-6.48 -2.15,-15.16 -6.4,-26.089 -4.3,-10.86 -8.99,-20.899 -14.07,-30.161 l -6.56,-12.66 c 3.75,-17.418 11.13,-48.711 22.19,-93.898 11.01,-45.1213 17.07,-69.0315 18.12,-71.7229 0.32,-0.3086 0.71,-1.1679 1.25,-2.5 0.51,-1.3672 1.64,-3.3984 3.44,-6.0976 2.38,-4.8008 3.59,-8.9024 3.59,-12.3399 0,-4.7695 -1.87,-7.1914 -5.62,-7.1914 z M 1016.29,216.48 c 6.44,0 12.23,3.211 17.34,9.692 5.08,6.449 9.22,14.848 12.35,25.156 5.39,20.703 8.12,37.223 8.12,49.531 0,7.813 -0.43,14.262 -1.25,19.371 -0.86,5.079 -2.3,10.551 -4.37,16.411 -4.07,11.879 -13.75,17.808 -29.07,17.808 -1.79,0 -3.2,-1.48 -4.21,-4.371 -0.94,-2.93 -1.41,-5.898 -1.41,-8.906 0,-22.813 0.31,-43.442 0.94,-61.871 0.31,-18.36 0.47,-38.91 0.47,-61.723 z" /><path
         id="path54"
         style="fill:#8a916f;fill-opacity:1;fill-rule:nonzero;stroke:none"
         d="m 1247.77,22.4219 c -5.11,0 -8.39,0.5898 -9.84,1.7187 -1.37,1.168 -2.34,4.3008 -2.97,9.5313 -3.12,24.7695 -5,40.2383 -5.62,46.4062 l -2.5,20.4729 c -7.5,1.64 -16.06,2.5 -25.63,2.5 l -18.44,1.09 c -8.12,1.019 -14.06,1.558 -17.81,1.558 -2.11,0 -3.28,-0.898 -3.59,-2.648 0,-1.063 -0.16,-1.571 -0.47,-1.571 l -1.1,-10.1519 c -0.31,-6.1679 -2.18,-18.3984 -5.62,-36.7187 -1.68,-9.3008 -3.71,-16.4883 -6.09,-21.5586 -2.74,-5.75 -5.28,-8.6016 -7.66,-8.6016 -2.11,0 -4.34,0.9414 -6.72,2.8203 -2.3,1.8711 -3.44,3.7813 -3.44,5.7813 l 0.94,3.1211 c 6.13,24.1367 11.25,48.1679 15.31,72.0271 l 6.1,31.723 6.25,38.75 c 0,0 1.87,11.25 5.62,33.75 1.64,9.137 4.69,23.988 9.06,44.527 4.77,23.129 7.7,38.949 8.75,47.5 0.32,0.942 0.98,7.231 2.04,18.91 1.32,12.891 2.54,22.422 3.59,28.59 1.02,8.832 2.07,13.949 3.12,15.321 h 3.6 c 0.94,-0.321 2.07,-0.469 3.44,-0.469 4.14,0 7.22,0.969 9.21,2.969 2.39,0 4.54,-0.79 6.41,-2.348 1.88,-1.481 2.81,-3.242 2.81,-5.313 0,-16.371 1.18,-35.121 3.6,-56.25 1.33,-10.859 2.38,-19.839 3.12,-27.031 3.75,-43.988 13.28,-126.406 28.6,-247.3475 v -1.4024 c 0,-3.4375 -1.37,-5.9765 -4.07,-7.6562 z m -23.59,91.8791 c -3.36,49.058 -9.8,121.437 -19.38,217.179 l -27.65,-136.402 c -7.81,-39.18 -11.72,-63.867 -11.72,-74.058 0,-1.801 6.45,-3.36 19.37,-4.692 13.01,-1.367 24.46,-2.027 34.38,-2.027 z" /><path
         id="path56"
         style="fill:#8a916f;fill-opacity:1;fill-rule:nonzero;stroke:none"
         d="m 1315.9,20.2305 c -4.69,0 -7.58,3.9883 -8.6,11.8789 0.63,1.9492 0.94,7.582 0.94,16.8711 0,31.25 0.51,77.6995 1.56,139.3785 1.02,61.332 1.57,105.661 1.57,132.969 l 0.93,18.281 1.57,15.313 c 0,2.379 1.17,3.598 3.59,3.598 1.64,0 4.06,-0.551 7.19,-1.571 l 1.56,-0.469 c 0,-7.5 -0.23,-14.332 -0.62,-20.46 v -75.629 c 0.39,-16.371 0.62,-34.922 0.62,-55.621 -0.43,-1.68 -0.62,-5.43 -0.62,-11.25 l -0.47,-10.79 c -0.32,-6.789 -0.47,-13.75 -0.47,-20.929 0,-7.821 0.15,-14.961 0.47,-21.41 l 0.47,-22.032 -1.41,-4.058 0.47,0.469 c 0,-0.942 -0.16,-1.649 -0.47,-2.04 v -2.031 c 0,-2.73 0.47,-5.078 1.41,-7.027 l -1.41,-49.0626 v -3.1289 c 0,-5.8594 0.16,-9.211 0.47,-10.1524 0,-1.7968 0.82,-2.6562 2.5,-2.6562 l 26.56,-0.9414 c 7.81,0 13.17,-0.1094 16.09,-0.3086 2.9,-0.2305 4.73,-0.3125 5.47,-0.3125 h 1.41 c 1.76,0 3.48,-0.9375 5.16,-2.8086 1.64,-1.8789 2.5,-3.832 2.5,-5.7813 0,-4.0703 -2.74,-6.289 -8.13,-6.7187 -5.74,0.4297 -19.84,0.6211 -42.34,0.6211 l 0.93,-0.6211 c -3.35,0 -6.56,-0.1602 -9.68,-0.4727 -2.74,-0.707 -5.78,-1.0976 -9.22,-1.0976 z" /><path
         id="path58"
         style="fill:#8a916f;fill-opacity:1;fill-rule:nonzero;stroke:none"
         d="m 1461.05,26.9492 c -7.81,0 -12.42,1.7227 -13.75,5.1602 -1.79,0 -3.12,-0.2305 -4.06,-0.6289 h -4.22 c -7.5,0 -12.26,1.7187 -14.22,5.1601 0,2.3789 1.33,4.4102 4.07,6.0899 l 2.5,2.6601 h 14.84 l 2.03,2.0313 1.1,4.5273 0.46,6.1016 c 0,20.8203 -0.54,39.4101 -1.56,55.7772 l -0.94,18.902 -1.09,37.348 c 0,13.203 0.51,33.121 1.56,59.692 l 1.1,59.371 c 0,25.82 -0.9,45.55 -2.66,59.218 -3.05,1.02 -8.12,1.563 -15.31,1.563 l -5.63,-0.621 c -1.99,-0.321 -4.18,-0.473 -6.56,-0.473 -6.56,0 -9.84,2.891 -9.84,8.75 0,1.332 1.48,2.692 4.53,4.063 3.12,1.328 5.7,2.031 7.81,2.031 12.89,0 25.82,-0.703 38.75,-2.031 7.89,-0.313 15.78,-1.871 23.59,-4.692 6.14,-1.988 9.22,-4.84 9.22,-8.59 0,-0.738 -0.54,-2.109 -1.56,-4.058 l -11.72,-1.102 c -2.42,2.071 -7.34,3.129 -14.84,3.129 l -2.5,-1.558 c 0.94,-3.051 1.4,-12.04 1.4,-27.04 0,-22.5 -0.15,-42.769 -0.46,-60.781 l -0.94,-60.929 c 0,-15.321 0.66,-33.872 2.03,-55.629 0.94,-24.922 1.41,-43.6722 1.41,-56.2504 v -6.5625 c -0.32,-2.4179 -0.47,-5.4687 -0.47,-9.2187 0,-7.8086 0.5,-12.6211 1.56,-14.3789 l -0.47,-0.9297 c 0,-3.4414 3.75,-5.1602 11.25,-5.1602 3.01,0 5.55,0.1602 7.66,0.4688 h 7.65 c 9.89,0 14.85,-2.3399 14.85,-7.0313 0,-3.1289 -1.06,-5.6289 -3.13,-7.5 -2.11,-1.8789 -4.8,-2.8086 -8.12,-2.8086 -3.13,0 -5.9,0.3516 -8.28,1.0899 -2.74,0.3125 -5.59,0.4687 -8.6,0.4687 -2.11,0 -5.15,-0.8593 -9.22,-2.5 -4.06,-2.1093 -7.15,-3.1289 -9.22,-3.1289 z" /><path
         id="path60"
         style="fill:#8a916f;fill-opacity:1;fill-rule:nonzero;stroke:none"
         d="m 1545.08,25.8594 c -5.12,0 -7.66,2.582 -7.66,7.8125 0,4.0586 1.64,12.8867 5,26.5586 l 4.69,17.3476 c 4.69,16.3321 7.23,25.8629 7.66,28.5939 2.38,7.5 5.62,21.449 9.68,41.879 4.38,21.129 7.66,36.129 9.85,45 2.26,8.828 7.03,23.98 14.22,45.469 8.12,26.871 14.21,49.058 18.28,66.558 4.06,17.582 6.09,33.203 6.09,46.871 -5.12,0 -13.09,-0.539 -23.91,-1.558 -10.62,-1.051 -18.67,-1.563 -24.06,-1.563 -2.11,0 -3.83,0.82 -5.15,2.5 -1.37,1.762 -2.04,3.633 -2.04,5.621 0,3.129 6.14,5.352 18.44,6.723 12.27,1.019 25.04,1.558 38.28,1.558 2.39,0 4.42,-0.23 6.1,-0.621 1.75,-0.308 3.32,-1.019 4.68,-2.031 1.33,-1.988 2.04,-3.867 2.04,-5.629 0,-11.871 -4.3,-30.429 -12.82,-55.621 -8.12,-25.937 -12.18,-41.25 -12.18,-45.937 -1.06,-5.551 -4.97,-20.391 -11.72,-44.532 l -3.6,-12.187 c -21.48,-70.551 -32.42,-122.5001 -32.81,-155.9415 2.38,-0.6211 7.34,-0.9297 14.84,-0.9297 4.14,0 7.74,0.3086 10.79,0.9297 3,0.3906 6.6,0.6289 10.78,0.6289 9.76,0 14.68,-2.2696 14.68,-6.7188 0,-4.3711 -3.9,-6.5625 -11.71,-6.5625 -5.43,0 -10.4,0.1524 -14.85,0.4727 l -15.31,0.9297 c -3.75,0 -7.5,-1.0117 -11.25,-2.961 -4.06,-1.7578 -6.41,-2.6601 -7.03,-2.6601 z" /><path
         id="path62"
         style="fill:#8a916f;fill-opacity:1;fill-rule:nonzero;stroke:none"
         d="m 1694.73,20.2305 c -6.18,0 -9.61,3.5976 -10.32,10.789 v 6.711 c 0.32,1.6484 0.47,3.6797 0.47,6.0976 l -2.03,2.0313 c 2.81,7.1914 4.22,14.1406 4.22,20.9414 0,7.8086 -0.55,19.0586 -1.56,33.7502 l -1.1,33.75 c 0,16.949 0.51,42.5 1.57,76.558 1.32,30.313 2.03,56.02 2.03,77.192 l -0.94,30.621 c -0.74,9.137 -1.09,19.379 -1.09,30.629 0,5.078 1.17,8.75 3.59,10.929 2.38,2.27 6.13,3.442 11.25,3.442 3.44,0 6.13,-1.051 8.13,-3.121 0.7,-0.321 5.66,-1.02 14.84,-2.031 8.51,-1.059 15.86,-2.579 22.03,-4.54 6.45,-2.101 9.69,-4.64 9.69,-7.652 0,-3.437 -3.24,-6.879 -9.69,-10.308 -19.49,6.441 -33.28,9.679 -41.41,9.679 l -2.65,-2.969 c 0.39,-3.121 0.62,-10.46 0.62,-22.031 0,-14.609 -0.39,-27.73 -1.09,-39.371 -0.31,-11.879 -0.47,-25.156 -0.47,-39.848 0,-9.492 2.38,-14.21 7.19,-14.21 l 8.12,0.46 c 2.7,0.321 5.63,0.469 8.75,0.469 13.21,0 19.85,-3.039 19.85,-9.058 0,-3.75 -0.9,-6.95 -2.66,-9.532 -1.68,-2.5 -4.18,-3.75 -7.5,-3.75 -5.12,0 -9.06,1.332 -11.87,4.063 l -16.25,2.5 h -2.66 l -2.5,-2.5 v -1.563 c 0.7,-5.859 1.09,-19.3 1.09,-40.308 0,-13.36 -0.23,-25.473 -0.62,-36.41 l -0.47,-36.2504 c 0,-13.2422 0.51,-26.8398 1.56,-40.7812 0.31,-7.9297 1.95,-13.1992 5,-15.7813 3.13,-2.5 8.79,-3.75 17.03,-3.75 l 9.07,0.6211 c 3.12,0.3203 6.56,0.4727 10.31,0.4727 9.88,0 14.84,-2.2617 14.84,-6.7227 0,-6.1289 -7.5,-9.2187 -22.5,-9.2187 z" /><path
         id="path64"
         style="fill:#8a916f;fill-opacity:1;fill-rule:nonzero;stroke:none"
         d="m 1825.47,24.4492 c -2.81,0 -4.22,4.5703 -4.22,13.75 -1.37,23.5196 -2.03,53.1719 -2.03,88.9098 0,22.5 0.19,42.582 0.62,60.313 l 0.47,60.308 c 0,25.821 -0.7,57.821 -2.03,95.942 -3.12,2.808 -4.69,6.25 -4.69,10.308 0,2.391 1.45,4.848 4.38,7.348 2.89,2.582 5.55,3.902 7.97,3.902 2.69,0 5.23,-1.359 7.65,-4.058 l 5.63,-4.692 c 1.95,-1.05 5.86,-2.031 11.72,-2.96 5.82,-1.059 9.92,-2.11 12.34,-3.129 5.08,-2.731 11.88,-7.969 20.31,-15.782 8.21,-8.238 13.83,-13.398 16.88,-15.468 l -0.47,-0.942 c 0.31,-2.109 2.85,-6.519 7.66,-13.277 3.75,-5.121 6.79,-9.922 9.22,-14.371 5.39,-15.629 8.12,-35.903 8.12,-60.781 0,-4.379 -0.16,-8.29 -0.47,-11.719 v -16.41 l -0.47,-5 c 0,-6.481 0.98,-11.563 2.97,-15.313 -1.99,-10.937 -4.53,-31.558 -7.65,-61.879 -1.06,-8.859 -2.78,-18.238 -5.16,-28.1209 -2.31,-9.9179 -5.16,-18.0898 -8.6,-24.5273 -8.86,-16.6797 -23.71,-30.7813 -44.53,-42.3516 z m 33.59,14.6914 c 2.39,2.8086 4.61,5.0391 6.72,6.7188 0,0 1.17,0.8203 3.6,2.5 l 4.06,3.5898 c 23.83,21.4492 35.78,62.3518 35.78,122.6598 v 9.692 c -0.31,2.687 -0.47,5.621 -0.47,8.75 l -2.03,51.558 c -1.06,19.77 -7.03,40.192 -17.97,61.25 -5.12,10.621 -12.03,19.219 -20.78,25.782 -8.67,6.64 -17.74,10 -27.19,10 -4.18,0 -6.25,-31.52 -6.25,-94.532 0,-72.808 2.07,-136.328 6.25,-190.4684 l -0.62,-9.6914 2.03,-1.0898 1.09,-6.7188 z" /><path
         id="path66"
         style="fill:#8a916f;fill-opacity:1;fill-rule:nonzero;stroke:none"
         d="m 2088.24,20.8594 c -3.75,21.4414 -5.62,45.9804 -5.62,73.5898 0,10.8208 0.5,26.6408 1.56,47.4998 l 1.09,47.5 c -2.42,4.77 -3.59,8.672 -3.59,11.723 3.32,5.387 5,21.098 5,47.027 0,61.961 -0.86,95 -2.5,99.071 3.01,8.511 5.39,12.808 7.19,12.808 h 22.5 c 3.75,0 9.1,-1.84 16.09,-5.469 6.95,-3.558 12.85,-7.339 17.66,-11.41 8.43,-7.808 12.65,-27.929 12.65,-60.308 0,-17.301 -0.54,-30.59 -1.56,-39.84 -0.62,-6.492 -1.72,-11.571 -3.28,-15.321 -1.48,-3.75 -3.75,-8.039 -6.88,-12.808 -5.11,-7.813 -13.82,-14.613 -26.09,-20.313 -5.12,-2.808 -12.26,-5.589 -21.41,-8.281 v -60.777 c 0,-8.563 0.83,-25.242 2.5,-50.0002 l 1.1,-16.4102 0.94,-33.2812 c 0,-6.0196 -3.25,-9.0586 -9.69,-9.0586 z m 16.41,182.8126 c 9.88,0 18.2,4.609 25,13.906 2.38,3.32 4.57,7.891 6.56,13.75 2.07,5.82 3.48,11.442 4.22,16.871 1.95,9.891 2.97,21.289 2.97,34.223 v 13.75 c 0,4.769 -0.16,9.379 -0.47,13.75 -0.31,4.457 -1.02,8.75 -2.03,12.808 -1.37,4.461 -3.2,8.129 -5.47,10.942 -2.19,2.887 -5.16,5.387 -8.91,7.5 -4.06,2.066 -8.98,3.129 -14.68,3.129 -4.18,0 -7.11,-1.063 -8.75,-3.129 -1.68,-2.113 -2.5,-5.703 -2.5,-10.781 0,-8.121 0.5,-20.391 1.56,-36.719 l 0.94,-36.723 c 0,-8.98 -0.32,-16.988 -0.94,-24.058 l -1.1,-24.063 z" /><path
         id="path68"
         style="fill:#8a916f;fill-opacity:1;fill-rule:nonzero;stroke:none"
         d="m 2293.09,20.8594 c -4.07,4.3711 -8.52,16.0898 -13.29,35.1601 -4.8,19.1407 -9.21,40.6211 -13.28,64.3715 -2.73,19.449 -6.64,38.75 -11.72,57.808 -4.18,16.961 -8.12,25.473 -11.87,25.473 h -1.56 c -7.42,0 -11.1,-2.344 -11.1,-7.031 0,-24.61 1.33,-61.871 4.07,-111.8715 1.32,-30.75 2.85,-48.6797 4.53,-53.75 l -4.07,-8.5976 h -7.18 l -4.07,4.0586 c -5.43,157.2695 -8.12,264.5705 -8.12,321.8785 0,3.75 0.23,6.801 0.78,9.219 0.51,2.383 1.6,4.57 3.28,6.563 1.33,2.379 3.75,3.589 7.19,3.589 17.27,0 31.17,-4.289 41.72,-12.808 10.62,-8.442 15.94,-20.703 15.94,-36.723 v -37.34 c 0,-6.48 -2.15,-15.16 -6.41,-26.089 -4.3,-10.86 -8.98,-20.899 -14.06,-30.161 l -6.57,-12.66 c 3.75,-17.418 11.14,-48.711 22.19,-93.898 11.02,-45.1213 17.07,-69.0315 18.13,-71.7229 0.31,-0.3086 0.7,-1.1679 1.25,-2.5 0.51,-1.3672 1.64,-3.3984 3.43,-6.0976 2.39,-4.8008 3.6,-8.9024 3.6,-12.3399 0,-4.7695 -1.88,-7.1914 -5.63,-7.1914 z M 2232.77,216.48 c 6.45,0 12.23,3.211 17.35,9.692 5.08,6.449 9.22,14.848 12.34,25.156 5.39,20.703 8.13,37.223 8.13,49.531 0,7.813 -0.43,14.262 -1.25,19.371 -0.86,5.079 -2.31,10.551 -4.38,16.411 -4.06,11.879 -13.75,17.808 -29.06,17.808 -1.8,0 -3.2,-1.48 -4.22,-4.371 -0.94,-2.93 -1.41,-5.898 -1.41,-8.906 0,-22.813 0.32,-43.442 0.94,-61.871 0.31,-18.36 0.47,-38.91 0.47,-61.723 z" /><path
         id="path70"
         style="fill:#8a916f;fill-opacity:1;fill-rule:nonzero;stroke:none"
         d="m 2373.32,20.2305 c -6.17,0 -9.61,3.5976 -10.31,10.789 v 6.711 c 0.31,1.6484 0.47,3.6797 0.47,6.0976 l -2.03,2.0313 c 2.81,7.1914 4.21,14.1406 4.21,20.9414 0,7.8086 -0.54,19.0586 -1.56,33.7502 l -1.09,33.75 c 0,16.949 0.51,42.5 1.56,76.558 1.33,30.313 2.03,56.02 2.03,77.192 l -0.94,30.621 c -0.74,9.137 -1.09,19.379 -1.09,30.629 0,5.078 1.17,8.75 3.59,10.929 2.39,2.27 6.14,3.442 11.25,3.442 3.44,0 6.14,-1.051 8.13,-3.121 0.7,-0.321 5.66,-1.02 14.84,-2.031 8.52,-1.059 15.86,-2.579 22.03,-4.54 6.45,-2.101 9.69,-4.64 9.69,-7.652 0,-3.437 -3.24,-6.879 -9.69,-10.308 -19.49,6.441 -33.28,9.679 -41.4,9.679 l -2.66,-2.969 c 0.39,-3.121 0.63,-10.46 0.63,-22.031 0,-14.609 -0.39,-27.73 -1.1,-39.371 -0.31,-11.879 -0.47,-25.156 -0.47,-39.848 0,-9.492 2.39,-14.21 7.19,-14.21 l 8.13,0.46 c 2.69,0.321 5.62,0.469 8.75,0.469 13.2,0 19.84,-3.039 19.84,-9.058 0,-3.75 -0.9,-6.95 -2.66,-9.532 -1.68,-2.5 -4.18,-3.75 -7.5,-3.75 -5.11,0 -9.06,1.332 -11.87,4.063 l -16.25,2.5 h -2.66 l -2.5,-2.5 v -1.563 c 0.71,-5.859 1.1,-19.3 1.1,-40.308 0,-13.36 -0.24,-25.473 -0.63,-36.41 l -0.47,-36.2504 c 0,-13.2422 0.51,-26.8398 1.57,-40.7812 0.31,-7.9297 1.95,-13.1992 5,-15.7813 3.12,-2.5 8.78,-3.75 17.03,-3.75 l 9.06,0.6211 c 3.12,0.3203 6.56,0.4727 10.31,0.4727 9.88,0 14.85,-2.2617 14.85,-6.7227 0,-6.1289 -7.5,-9.2187 -22.5,-9.2187 z" /><path
         id="path72"
         style="fill:#8a916f;fill-opacity:1;fill-rule:nonzero;stroke:none"
         d="m 2499.84,20.8594 c -3.75,0.6211 -7.34,2.1094 -10.78,4.3711 -3.36,2.1914 -5.15,4.7695 -5.47,7.8203 l 2.5,4.0586 c 1.33,0 4.42,-0.4688 9.22,-1.4102 3.75,-1.3594 6.8,-2.0273 9.22,-2.0273 7.5,0 14.1,2.9687 19.85,8.9062 5.82,5.9414 10.23,13.6719 13.28,23.2813 4.76,17.6914 7.18,34.3706 7.18,49.9996 0,23.52 -7.14,48.75 -21.4,75.621 -8.87,15.629 -15.71,28.008 -20.47,37.192 -4.81,9.258 -9.06,19.848 -12.81,31.719 -4.38,13.949 -6.57,27.418 -6.57,40.468 0,12.192 3.05,26.641 9.22,43.442 3.01,7.808 7.35,14.14 12.97,19.058 5.63,5 11.64,7.5 18.13,7.5 4.45,0 8.79,-1.558 12.97,-4.687 4.25,-3.051 6.4,-6.25 6.4,-9.692 0,-2.73 -2.19,-4.058 -6.56,-4.058 -1.37,0 -3.09,0.508 -5.16,1.558 -1.99,1.02 -3.86,1.571 -5.62,1.571 -5.12,0 -9.69,-2.11 -13.75,-6.25 -4.07,-4.071 -7.15,-9.34 -9.22,-15.781 -4.06,-12.622 -6.09,-24.18 -6.09,-34.692 0,-6.488 0.82,-13.129 2.5,-20 0.31,-2.109 0.62,-3.828 0.93,-5.156 0.39,-1.371 0.63,-2.344 0.63,-2.973 l 3.12,-10.308 2.5,-9.063 4.06,-9.219 c 1.02,-2.418 2.11,-4.531 3.29,-6.41 1.25,-1.871 2.38,-3.711 3.43,-5.469 l 6.1,-10.621 c 1.33,-2.109 4.22,-6.988 8.59,-14.687 4.45,-7.621 8.59,-15.703 12.35,-24.223 3.43,-7.109 5.97,-13.82 7.65,-20.148 1.64,-6.25 3.17,-13.832 4.53,-22.66 1.02,-8.551 1.56,-17.93 1.56,-28.121 0,-16.3716 -2.18,-31.7192 -6.56,-46.0981 -6.17,-16.9922 -15,-28.8711 -26.56,-35.6211 -6.48,-4.1406 -13.98,-6.25 -22.5,-6.25 z m 40.94,333.1206 c 0,0.321 -0.16,0.469 -0.47,0.469 v -0.469 z" /><path
         id="path74"
         style="fill:#8a916f;fill-opacity:1;fill-rule:nonzero;stroke:none"
         d="m 2615.59,20.8594 c -3.75,0.6211 -7.35,2.1094 -10.79,4.3711 -3.35,2.1914 -5.15,4.7695 -5.46,7.8203 l 2.5,4.0586 c 1.32,0 4.41,-0.4688 9.21,-1.4102 3.75,-1.3594 6.8,-2.0273 9.22,-2.0273 7.5,0 14.11,2.9687 19.85,8.9062 5.82,5.9414 10.23,13.6719 13.28,23.2813 4.76,17.6914 7.19,34.3706 7.19,49.9996 0,23.52 -7.15,48.75 -21.41,75.621 -8.87,15.629 -15.7,28.008 -20.47,37.192 -4.8,9.258 -9.06,19.848 -12.81,31.719 -4.38,13.949 -6.56,27.418 -6.56,40.468 0,12.192 3.04,26.641 9.21,43.442 3.01,7.808 7.35,14.14 12.97,19.058 5.63,5 11.64,7.5 18.13,7.5 4.45,0 8.79,-1.558 12.97,-4.687 4.26,-3.051 6.4,-6.25 6.4,-9.692 0,-2.73 -2.18,-4.058 -6.56,-4.058 -1.37,0 -3.08,0.508 -5.16,1.558 -1.99,1.02 -3.86,1.571 -5.62,1.571 -5.12,0 -9.69,-2.11 -13.75,-6.25 -4.06,-4.071 -7.15,-9.34 -9.22,-15.781 -4.06,-12.622 -6.09,-24.18 -6.09,-34.692 0,-6.488 0.82,-13.129 2.5,-20 0.31,-2.109 0.62,-3.828 0.93,-5.156 0.4,-1.371 0.63,-2.344 0.63,-2.973 l 3.12,-10.308 2.5,-9.063 4.07,-9.219 c 1.01,-2.418 2.11,-4.531 3.28,-6.41 1.25,-1.871 2.38,-3.711 3.44,-5.469 l 6.09,-10.621 c 1.33,-2.109 4.22,-6.988 8.59,-14.687 4.46,-7.621 8.6,-15.703 12.35,-24.223 3.43,-7.109 5.97,-13.82 7.65,-20.148 1.64,-6.25 3.17,-13.832 4.53,-22.66 1.02,-8.551 1.57,-17.93 1.57,-28.121 0,-16.3716 -2.19,-31.7192 -6.57,-46.0981 -6.17,-16.9922 -15,-28.8711 -26.56,-35.6211 -6.48,-4.1406 -13.98,-6.25 -22.5,-6.25 z m 40.93,333.1206 c 0,0.321 -0.15,0.469 -0.47,0.469 v -0.469 z" /><path
         id="path76"
         style="fill:#8a916f;fill-opacity:1;fill-rule:nonzero;stroke:none"
         d="m 3025.43,0.390625 c -6.8,0 -10.16,10.898475 -10.16,32.660175 v 33.75 c 0,49.0582 -1.05,87.3792 -3.12,115.0002 l -1.56,18.898 c -1.37,8.52 -2.04,16.02 -2.04,22.5 0,11.571 0.36,22.071 1.1,31.571 l 0.94,31.71 c 0,10.629 -0.71,18.641 -2.04,24.071 -6.79,-4.813 -27.34,-76.531 -61.71,-215.1604 l -0.63,-7.6601 c -1.05,-8.5508 -2.42,-15.3907 -4.06,-20.461 -1.06,-3.75 -2.5,-6.6797 -4.38,-8.75 -1.87,-2 -4.02,-2.9687 -6.4,-2.9687 -5.43,0 -9.34,1.3281 -11.72,4.0586 -2.42,2.6914 -3.6,6.9492 -3.6,12.8125 0,9.1367 -4.33,32.9691 -12.96,71.4061 -8.68,38.512 -18.05,75.512 -28.13,110.942 -10,35.5 -16.87,55.07 -20.62,58.75 -0.43,-11.879 -1.84,-39.969 -4.22,-84.219 -4.69,-78.36 -7.03,-140.0002 -7.03,-185.0002 l 0.46,-20.4727 c -1.36,-4.3789 -4.96,-6.5586 -10.78,-6.5586 -1.05,0 -2.77,0.9297 -5.15,2.8086 -2.31,1.8711 -3.44,3.3633 -3.44,4.3711 0,30.6289 2.7,84.4218 8.12,161.4098 5.08,71.563 7.66,125.192 7.66,160.942 0,1.64 -0.31,3.359 -0.94,5.148 -1.05,1.961 -1.56,3.481 -1.56,4.531 0,5.079 4.42,7.661 13.28,7.661 5.71,0 9.1,-2.582 10.16,-7.661 1.33,-6.789 2.03,-11.871 2.03,-15.308 l 0.62,-6.094 c 1.65,-8.867 6.57,-22.5 14.69,-40.937 6.45,-14.61 11.41,-27.34 14.85,-38.282 2.07,-8.238 3.94,-14.918 5.62,-20 5.39,-19.687 8.99,-34.339 10.78,-43.91 l 6.56,-13.277 c 1.02,-5.121 3.13,-13.442 6.25,-25 3.01,-12.934 5.2,-23.512 6.57,-31.723 1.33,-8.121 2.03,-15.929 2.03,-23.4295 3.75,5.6995 14.37,40.5005 31.87,104.3715 17.58,63.949 27.89,104.769 30.94,122.5 0.39,0.629 0.67,1.488 0.78,2.66 0.2,1.25 0.47,2.89 0.78,5 0.71,4.371 2.27,10.969 4.69,19.84 2.7,6.879 6.76,10.308 12.19,10.308 2.38,0 5.08,-1.051 8.12,-3.121 3.13,-2.109 4.69,-4.137 4.69,-6.098 0,-142.101 2.19,-217.179 6.56,-225.308 v -26.563 c -0.31,-7.9293 -0.47,-16.9879 -0.47,-27.1871 0,-21.8008 1.18,-38.1211 3.6,-49.0625 0.31,-0.3086 0.51,-0.7813 0.62,-1.4102 0.2,-0.6992 0.51,-1.5976 0.94,-2.6484 0.31,-1.332 0.47,-2.8516 0.47,-4.5313 0,-3.75 -1.09,-7.49997 -3.28,-11.24997 -2.19,-3.75 -4.85,-5.628905 -7.97,-5.628905 z M 3008.55,313.52 h -0.46 l -1.1,-0.469 1.56,-0.473 z" /><path
         id="path78"
         style="fill:#8a916f;fill-opacity:1;fill-rule:nonzero;stroke:none"
         d="m 3122.77,20.2305 c -6.17,0 -9.61,3.5976 -10.31,10.789 v 6.711 c 0.31,1.6484 0.47,3.6797 0.47,6.0976 l -2.03,2.0313 c 2.81,7.1914 4.22,14.1406 4.22,20.9414 0,7.8086 -0.55,19.0586 -1.57,33.7502 l -1.09,33.75 c 0,16.949 0.51,42.5 1.56,76.558 1.33,30.313 2.03,56.02 2.03,77.192 l -0.93,30.621 c -0.74,9.137 -1.1,19.379 -1.1,30.629 0,5.078 1.18,8.75 3.6,10.929 2.38,2.27 6.13,3.442 11.25,3.442 3.43,0 6.13,-1.051 8.12,-3.121 0.71,-0.321 5.67,-1.02 14.85,-2.031 8.51,-1.059 15.86,-2.579 22.03,-4.54 6.44,-2.101 9.68,-4.64 9.68,-7.652 0,-3.437 -3.24,-6.879 -9.68,-10.308 -19.49,6.441 -33.28,9.679 -41.41,9.679 l -2.66,-2.969 c 0.4,-3.121 0.63,-10.46 0.63,-22.031 0,-14.609 -0.39,-27.73 -1.09,-39.371 -0.32,-11.879 -0.47,-25.156 -0.47,-39.848 0,-9.492 2.38,-14.21 7.18,-14.21 l 8.13,0.46 c 2.7,0.321 5.62,0.469 8.75,0.469 13.2,0 19.84,-3.039 19.84,-9.058 0,-3.75 -0.89,-6.95 -2.65,-9.532 -1.68,-2.5 -4.18,-3.75 -7.5,-3.75 -5.12,0 -9.07,1.332 -11.88,4.063 l -16.25,2.5 h -2.65 l -2.5,-2.5 v -1.563 c 0.7,-5.859 1.09,-19.3 1.09,-40.308 0,-13.36 -0.23,-25.473 -0.63,-36.41 l -0.46,-36.2504 c 0,-13.2422 0.5,-26.8398 1.56,-40.7812 0.31,-7.9297 1.95,-13.1992 5,-15.7813 3.12,-2.5 8.79,-3.75 17.03,-3.75 l 9.06,0.6211 c 3.13,0.3203 6.56,0.4727 10.31,0.4727 9.89,0 14.85,-2.2617 14.85,-6.7227 0,-6.1289 -7.5,-9.2187 -22.5,-9.2187 z" /><path
         id="path80"
         style="fill:#8a916f;fill-opacity:1;fill-rule:nonzero;stroke:none"
         d="m 3277.42,34.1406 -0.47,18.9102 c -0.31,5.3906 -0.47,11.4805 -0.47,18.2773 0,3.4414 0.16,6.3321 0.47,8.75 l 0.47,9.2227 c 0,3.4297 -0.7,7.5 -2.03,12.1792 0,22.899 -1.72,65.36 -5.16,127.348 -3.35,59.883 -5.15,100.551 -5.46,122.031 -21.18,0 -35.32,0.512 -42.5,1.563 -6.8,1.637 -10.16,4.379 -10.16,8.129 1.64,3.75 4.88,5.621 9.69,5.621 10.19,0 25,-0.703 44.37,-2.031 17.7,-1.68 32.54,-2.5 44.53,-2.5 h 10.63 l 10.78,0.468 c 6.13,0 9.22,-2.187 9.22,-6.558 0,-2.11 -1.1,-3.75 -3.28,-5 -2.19,-1.172 -4.85,-1.723 -7.97,-1.723 -6.8,0 -13.91,0.352 -21.41,1.094 l -22.03,0.937 c -1.37,0 -2.03,-0.55 -2.03,-1.558 -0.31,-0.942 -0.47,-4.18 -0.47,-9.692 0,-33.05 2.03,-83.089 6.09,-150.16 3.75,-69.488 5.63,-119.3709 5.63,-149.6795 0,-2.4297 -1.48,-4.6484 -4.38,-6.7187 -2.93,-2 -5.74,-2.9727 -8.43,-2.9727 z" /><path
         id="path82"
         style="fill:#8a916f;fill-opacity:1;fill-rule:nonzero;stroke:none"
         d="m 3496.13,22.4219 c -5.11,0 -8.4,0.5898 -9.84,1.7187 -1.37,1.168 -2.34,4.3008 -2.97,9.5313 -3.12,24.7695 -5,40.2383 -5.62,46.4062 l -2.5,20.4729 c -7.5,1.64 -16.06,2.5 -25.63,2.5 l -18.44,1.09 c -8.12,1.019 -14.06,1.558 -17.81,1.558 -2.11,0 -3.28,-0.898 -3.59,-2.648 0,-1.063 -0.16,-1.571 -0.47,-1.571 l -1.1,-10.1519 c -0.31,-6.1679 -2.18,-18.3984 -5.62,-36.7187 -1.68,-9.3008 -3.71,-16.4883 -6.09,-21.5586 -2.74,-5.75 -5.28,-8.6016 -7.66,-8.6016 -2.11,0 -4.34,0.9414 -6.72,2.8203 -2.3,1.8711 -3.44,3.7813 -3.44,5.7813 l 0.94,3.1211 c 6.13,24.1367 11.25,48.1679 15.31,72.0271 l 6.1,31.723 6.25,38.75 c 0,0 1.87,11.25 5.62,33.75 1.64,9.137 4.69,23.988 9.06,44.527 4.77,23.129 7.7,38.949 8.75,47.5 0.32,0.942 0.98,7.231 2.04,18.91 1.32,12.891 2.53,22.422 3.59,28.59 1.01,8.832 2.07,13.949 3.12,15.321 h 3.6 c 0.94,-0.321 2.07,-0.469 3.44,-0.469 4.14,0 7.22,0.969 9.21,2.969 2.39,0 4.54,-0.79 6.41,-2.348 1.88,-1.481 2.81,-3.242 2.81,-5.313 0,-16.371 1.17,-35.121 3.6,-56.25 1.32,-10.859 2.38,-19.839 3.12,-27.031 3.75,-43.988 13.28,-126.406 28.6,-247.3475 v -1.4024 c 0,-3.4375 -1.37,-5.9765 -4.07,-7.6562 z m -23.59,91.8791 c -3.36,49.058 -9.81,121.437 -19.38,217.179 l -27.65,-136.402 c -7.81,-39.18 -11.72,-63.867 -11.72,-74.058 0,-1.801 6.44,-3.36 19.37,-4.692 13.01,-1.367 24.46,-2.027 34.38,-2.027 z" /><path
         id="path84"
         style="fill:#8a916f;fill-opacity:1;fill-rule:nonzero;stroke:none"
         d="m 3546.45,196.641 c -2.74,0 -5.24,0.82 -7.5,2.5 -2.19,1.64 -3.29,3.668 -3.29,6.089 0,3.442 10.79,6.758 32.35,10 21.64,3.211 40,4.848 55,4.848 2.81,0 5.35,-0.898 7.65,-2.656 2.39,-1.684 3.6,-3.711 3.6,-6.094 0,-3.359 -10.74,-6.637 -32.19,-9.848 -21.48,-3.242 -40,-4.839 -55.62,-4.839 z" /><path
         id="path86"
         style="fill:#8a916f;fill-opacity:1;fill-rule:nonzero;stroke:none"
         d="m 3696.37,20.8594 c -3.75,0.6211 -7.35,2.1094 -10.78,4.3711 -3.36,2.1914 -5.16,4.7695 -5.47,7.8203 l 2.5,4.0586 c 1.33,0 4.41,-0.4688 9.22,-1.4102 3.75,-1.3594 6.79,-2.0273 9.21,-2.0273 7.5,0 14.11,2.9687 19.85,8.9062 5.82,5.9414 10.23,13.6719 13.28,23.2813 4.77,17.6914 7.19,34.3706 7.19,49.9996 0,23.52 -7.15,48.75 -21.41,75.621 -8.87,15.629 -15.7,28.008 -20.47,37.192 -4.8,9.258 -9.06,19.848 -12.81,31.719 -4.38,13.949 -6.56,27.418 -6.56,40.468 0,12.192 3.04,26.641 9.22,43.442 3,7.808 7.34,14.14 12.96,19.058 5.63,5 11.65,7.5 18.13,7.5 4.45,0 8.79,-1.558 12.97,-4.687 4.26,-3.051 6.4,-6.25 6.4,-9.692 0,-2.73 -2.18,-4.058 -6.56,-4.058 -1.36,0 -3.08,0.508 -5.15,1.558 -2,1.02 -3.87,1.571 -5.63,1.571 -5.12,0 -9.69,-2.11 -13.75,-6.25 -4.06,-4.071 -7.15,-9.34 -9.22,-15.781 -4.06,-12.622 -6.09,-24.18 -6.09,-34.692 0,-6.488 0.82,-13.129 2.5,-20 0.31,-2.109 0.62,-3.828 0.94,-5.156 0.39,-1.371 0.62,-2.344 0.62,-2.973 l 3.13,-10.308 2.5,-9.063 4.06,-9.219 c 1.01,-2.418 2.11,-4.531 3.28,-6.41 1.25,-1.871 2.38,-3.711 3.44,-5.469 l 6.09,-10.621 c 1.33,-2.109 4.22,-6.988 8.59,-14.687 4.46,-7.621 8.6,-15.703 12.35,-24.223 3.44,-7.109 5.98,-13.82 7.65,-20.148 1.65,-6.25 3.17,-13.832 4.54,-22.66 1.01,-8.551 1.56,-17.93 1.56,-28.121 0,-16.3716 -2.19,-31.7192 -6.56,-46.0981 -6.18,-16.9922 -15,-28.8711 -26.57,-35.6211 -6.48,-4.1406 -13.98,-6.25 -22.5,-6.25 z M 3737.3,353.98 c 0,0.321 -0.15,0.469 -0.46,0.469 v -0.469 z" /><path
         id="path88"
         style="fill:#8a916f;fill-opacity:1;fill-rule:nonzero;stroke:none"
         d="m 3826.33,20.2305 c -6.17,0 -9.61,3.5976 -10.31,10.789 v 6.711 c 0.31,1.6484 0.46,3.6797 0.46,6.0976 l -2.03,2.0313 c 2.82,7.1914 4.22,14.1406 4.22,20.9414 0,7.8086 -0.55,19.0586 -1.56,33.7502 l -1.09,33.75 c 0,16.949 0.5,42.5 1.56,76.558 1.33,30.313 2.03,56.02 2.03,77.192 l -0.94,30.621 c -0.74,9.137 -1.09,19.379 -1.09,30.629 0,5.078 1.17,8.75 3.59,10.929 2.38,2.27 6.13,3.442 11.25,3.442 3.44,0 6.13,-1.051 8.13,-3.121 0.7,-0.321 5.66,-1.02 14.84,-2.031 8.52,-1.059 15.86,-2.579 22.03,-4.54 6.45,-2.101 9.69,-4.64 9.69,-7.652 0,-3.437 -3.24,-6.879 -9.69,-10.308 -19.49,6.441 -33.28,9.679 -41.4,9.679 l -2.66,-2.969 c 0.39,-3.121 0.62,-10.46 0.62,-22.031 0,-14.609 -0.39,-27.73 -1.09,-39.371 -0.31,-11.879 -0.47,-25.156 -0.47,-39.848 0,-9.492 2.38,-14.21 7.19,-14.21 l 8.12,0.46 c 2.7,0.321 5.63,0.469 8.75,0.469 13.21,0 19.85,-3.039 19.85,-9.058 0,-3.75 -0.9,-6.95 -2.66,-9.532 -1.68,-2.5 -4.18,-3.75 -7.5,-3.75 -5.12,0 -9.06,1.332 -11.87,4.063 l -16.25,2.5 h -2.66 l -2.5,-2.5 v -1.563 c 0.7,-5.859 1.09,-19.3 1.09,-40.308 0,-13.36 -0.23,-25.473 -0.62,-36.41 l -0.47,-36.2504 c 0,-13.2422 0.51,-26.8398 1.56,-40.7812 0.32,-7.9297 1.96,-13.1992 5,-15.7813 3.13,-2.5 8.79,-3.75 17.03,-3.75 l 9.07,0.6211 c 3.12,0.3203 6.56,0.4727 10.31,0.4727 9.88,0 14.84,-2.2617 14.84,-6.7227 0,-6.1289 -7.5,-9.2187 -22.5,-9.2187 z" /><path
         id="path90"
         style="fill:#8a916f;fill-opacity:1;fill-rule:nonzero;stroke:none"
         d="m 4048.01,22.4219 c -5.12,0 -8.4,0.5898 -9.85,1.7187 -1.36,1.168 -2.34,4.3008 -2.96,9.5313 -3.13,24.7695 -5,40.2383 -5.63,46.4062 l -2.5,20.4729 c -7.5,1.64 -16.05,2.5 -25.62,2.5 l -18.44,1.09 c -8.13,1.019 -14.06,1.558 -17.81,1.558 -2.11,0 -3.29,-0.898 -3.6,-2.648 0,-1.063 -0.15,-1.571 -0.47,-1.571 l -1.09,-10.1519 c -0.31,-6.1679 -2.19,-18.3984 -5.63,-36.7187 -1.68,-9.3008 -3.71,-16.4883 -6.09,-21.5586 -2.73,-5.75 -5.27,-8.6016 -7.66,-8.6016 -2.11,0 -4.33,0.9414 -6.71,2.8203 -2.31,1.8711 -3.44,3.7813 -3.44,5.7813 l 0.94,3.1211 c 6.13,24.1367 11.25,48.1679 15.31,72.0271 l 6.09,31.723 6.25,38.75 c 0,0 1.88,11.25 5.63,33.75 1.64,9.137 4.68,23.988 9.06,44.527 4.76,23.129 7.69,38.949 8.75,47.5 0.31,0.942 0.98,7.231 2.03,18.91 1.33,12.891 2.54,22.422 3.59,28.59 1.02,8.832 2.07,13.949 3.13,15.321 h 3.59 c 0.94,-0.321 2.07,-0.469 3.44,-0.469 4.14,0 7.23,0.969 9.22,2.969 2.38,0 4.53,-0.79 6.41,-2.348 1.87,-1.481 2.81,-3.242 2.81,-5.313 0,-16.371 1.17,-35.121 3.59,-56.25 1.33,-10.859 2.38,-19.839 3.13,-27.031 3.75,-43.988 13.28,-126.406 28.59,-247.3475 v -1.4024 c 0,-3.4375 -1.37,-5.9765 -4.06,-7.6562 z m -23.6,91.8791 c -3.36,49.058 -9.8,121.437 -19.37,217.179 l -27.66,-136.402 c -7.81,-39.18 -11.72,-63.867 -11.72,-74.058 0,-1.801 6.45,-3.36 19.38,-4.692 13.01,-1.367 24.45,-2.027 34.37,-2.027 z" /><path
         id="path92"
         style="fill:#8a916f;fill-opacity:1;fill-rule:nonzero;stroke:none"
         d="m 4185.16,20.8594 c -4.07,4.3711 -8.52,16.0898 -13.28,35.1601 -4.81,19.1407 -9.22,40.6211 -13.29,64.3715 -2.73,19.449 -6.64,38.75 -11.71,57.808 -4.18,16.961 -8.13,25.473 -11.88,25.473 h -1.56 c -7.42,0 -11.1,-2.344 -11.1,-7.031 0,-24.61 1.33,-61.871 4.07,-111.8715 1.32,-30.75 2.85,-48.6797 4.53,-53.75 l -4.06,-8.5976 h -7.19 l -4.07,4.0586 c -5.42,157.2695 -8.12,264.5705 -8.12,321.8785 0,3.75 0.23,6.801 0.78,9.219 0.51,2.383 1.6,4.57 3.28,6.563 1.33,2.379 3.75,3.589 7.19,3.589 17.27,0 31.17,-4.289 41.72,-12.808 10.62,-8.442 15.94,-20.703 15.94,-36.723 v -37.34 c 0,-6.48 -2.15,-15.16 -6.41,-26.089 -4.3,-10.86 -8.98,-20.899 -14.06,-30.161 l -6.56,-12.66 c 3.74,-17.418 11.13,-48.711 22.18,-93.898 11.02,-45.1213 17.07,-69.0315 18.13,-71.7229 0.31,-0.3086 0.7,-1.1679 1.25,-2.5 0.51,-1.3672 1.64,-3.3984 3.44,-6.0976 2.38,-4.8008 3.59,-8.9024 3.59,-12.3399 0,-4.7695 -1.88,-7.1914 -5.63,-7.1914 z M 4124.84,216.48 c 6.45,0 12.23,3.211 17.35,9.692 5.08,6.449 9.22,14.848 12.34,25.156 5.39,20.703 8.13,37.223 8.13,49.531 0,7.813 -0.43,14.262 -1.25,19.371 -0.86,5.079 -2.31,10.551 -4.38,16.411 -4.06,11.879 -13.75,17.808 -29.06,17.808 -1.8,0 -3.2,-1.48 -4.22,-4.371 -0.94,-2.93 -1.41,-5.898 -1.41,-8.906 0,-22.813 0.32,-43.442 0.94,-61.871 0.31,-18.36 0.47,-38.91 0.47,-61.723 z" /><path
         id="path94"
         style="fill:#8a916f;fill-opacity:1;fill-rule:nonzero;stroke:none"
         d="m 4293.4,23.3594 c -6.49,2.1094 -11.99,5 -16.56,8.75 -4.61,3.75 -8.91,9.3711 -12.97,16.8711 -7.19,13.5195 -11.49,33.1289 -12.82,58.7495 -0.74,11.571 -1.09,21.758 -1.09,30.629 v 58.282 c 0,22.07 0.7,43.519 2.19,64.379 0.94,15.308 2.42,28.199 4.53,38.75 2.07,10.621 5.31,21.171 9.69,31.71 4.76,10.942 10.04,18.598 15.78,22.969 2.38,2.071 7.03,4.461 13.9,7.192 4.38,1.64 8.64,3.519 12.82,5.629 h 21.87 c 0.31,-0.321 0.82,-0.469 1.56,-0.469 l 2.5,-0.629 2.04,-1.563 c 1.01,-0.937 1.56,-1.64 1.56,-2.031 0.31,-0.629 0.47,-1.637 0.47,-2.969 l -6.57,-7.66 h -21.4 c -6.56,0 -12.5,-3.199 -17.81,-9.527 -5.24,-6.25 -9.18,-14.184 -11.88,-23.75 -2.73,-8.551 -4.96,-18.594 -6.72,-30.152 -1.68,-11.571 -2.65,-21.641 -2.97,-30.161 -0.74,-10.859 -1.09,-18.359 -1.09,-22.5 l -0.94,-2.5 c 0,-19.058 -0.39,-36.25 -1.09,-51.558 l -0.94,-51.571 c 0,-15 0.98,-28.82 2.97,-41.4019 1.76,-13.6679 6.72,-25.9375 14.84,-36.8789 7.82,-10.8594 19.89,-16.25 36.25,-16.25 5.08,0 9.38,1.4922 12.82,4.5313 5.07,0 7.65,-1.8711 7.65,-5.6211 0,-2.418 -2.15,-5.2305 -6.4,-8.4375 -4.3,-3.2031 -8.6,-5.6602 -12.97,-7.3438 h -16.88 z" /><path
         id="path96"
         style="fill:#8a916f;fill-opacity:1;fill-rule:nonzero;stroke:none"
         d="m 4493.32,21.3281 c 0,3.4414 -5.12,5.1524 -15.31,5.1524 -1.68,63.0078 -2.5,108.6405 -2.5,136.8785 l -1.56,2.032 2.03,4.687 c 0,6.012 -0.71,12.344 -2.03,18.902 l -7.66,2.04 c -3.13,-1.059 -6.56,-1.571 -10.31,-1.571 -2.74,0 -8.36,0.821 -16.88,2.5 -5.74,1.762 -11.01,2.66 -15.78,2.66 l -5.62,-2.187 c 0,-11.871 -0.16,-22.621 -0.47,-32.192 -0.32,-9.492 -0.47,-20.23 -0.47,-32.179 l 0.94,-2.031 c 0,-9.5 0.5,-23.75 1.56,-42.8208 1.01,-18.75 1.56,-32.9297 1.56,-42.5 0,-3.75 -0.7,-6.9492 -2.03,-9.5273 -1.37,-2.5 -3.44,-3.75 -6.25,-3.75 -7.5,0 -11.25,10.1992 -11.25,30.6289 0,17.3789 0.19,33.039 0.62,47.0272 l 0.47,46.563 c 0,30.937 -0.54,47.578 -1.56,50 1.76,3.437 2.66,14.687 2.66,33.75 0,16.328 -0.75,36.289 -2.19,59.839 l -0.94,19.848 -1.09,39.844 c 0,2.379 0.82,4.566 2.5,6.558 1.76,2.071 3.83,3.129 6.25,3.129 6.76,0 10.15,-9.839 10.15,-29.531 0,-23.238 -0.15,-44.18 -0.46,-62.808 -0.63,-18.75 -0.94,-39.379 -0.94,-61.879 0,-4.063 12.89,-6.09 38.75,-6.09 h 2.03 c 6.44,0 11.13,1.25 14.06,3.75 2.89,2.57 4.38,6.949 4.38,13.121 0,18.008 -1.21,41.488 -3.6,70.469 -2.11,31.328 -3.12,54.839 -3.12,70.468 0,2.071 0.82,3.832 2.5,5.313 1.76,1.558 3.83,2.348 6.25,2.348 l 4.53,-1.571 c 2.38,-0.308 3.94,-0.777 4.69,-1.398 0,-26.68 0.97,-66.371 2.97,-119.071 2.07,-53.121 3.12,-93.039 3.12,-119.679 0,-40.1213 1.17,-73.8322 3.59,-101.1018 z m -32.19,189.9999 1.1,-0.937 h -1.1 z" /><path
         id="path98"
         style="fill:#8a916f;fill-opacity:1;fill-rule:nonzero;stroke:none"
         d="m 4665.59,20.2305 c -6.18,0 -9.61,3.5976 -10.32,10.789 v 6.711 c 0.32,1.6484 0.47,3.6797 0.47,6.0976 l -2.03,2.0313 c 2.81,7.1914 4.22,14.1406 4.22,20.9414 0,7.8086 -0.55,19.0586 -1.56,33.7502 l -1.1,33.75 c 0,16.949 0.51,42.5 1.57,76.558 1.32,30.313 2.03,56.02 2.03,77.192 l -0.94,30.621 c -0.74,9.137 -1.09,19.379 -1.09,30.629 0,5.078 1.17,8.75 3.59,10.929 2.38,2.27 6.13,3.442 11.25,3.442 3.44,0 6.13,-1.051 8.12,-3.121 0.71,-0.321 5.67,-1.02 14.85,-2.031 8.51,-1.059 15.86,-2.579 22.03,-4.54 6.44,-2.101 9.69,-4.64 9.69,-7.652 0,-3.437 -3.25,-6.879 -9.69,-10.308 -19.49,6.441 -33.28,9.679 -41.41,9.679 l -2.65,-2.969 c 0.39,-3.121 0.62,-10.46 0.62,-22.031 0,-14.609 -0.39,-27.73 -1.09,-39.371 -0.31,-11.879 -0.47,-25.156 -0.47,-39.848 0,-9.492 2.38,-14.21 7.19,-14.21 l 8.12,0.46 c 2.7,0.321 5.63,0.469 8.75,0.469 13.21,0 19.85,-3.039 19.85,-9.058 0,-3.75 -0.9,-6.95 -2.66,-9.532 -1.68,-2.5 -4.18,-3.75 -7.5,-3.75 -5.12,0 -9.06,1.332 -11.88,4.063 l -16.25,2.5 h -2.65 l -2.5,-2.5 v -1.563 c 0.7,-5.859 1.09,-19.3 1.09,-40.308 0,-13.36 -0.23,-25.473 -0.62,-36.41 l -0.47,-36.2504 c 0,-13.2422 0.51,-26.8398 1.56,-40.7812 0.31,-7.9297 1.95,-13.1992 5,-15.7813 3.13,-2.5 8.79,-3.75 17.03,-3.75 l 9.06,0.6211 c 3.13,0.3203 6.57,0.4727 10.32,0.4727 9.88,0 14.84,-2.2617 14.84,-6.7227 0,-6.1289 -7.5,-9.2187 -22.5,-9.2187 z" /><path
         id="path100"
         style="fill:#8a916f;fill-opacity:1;fill-rule:nonzero;stroke:none"
         d="m 4916.8,24.9219 c -2.74,0 -4.69,1.0195 -5.94,2.9687 -1.17,2.0703 -2.27,5.1602 -3.28,9.2188 -0.31,2.8125 -1.02,5.1914 -2.03,7.1914 l 0.62,1.5586 c -2.81,16.0195 -8.67,35.6211 -17.5,58.7496 l -9.06,26.563 c -0.74,0.707 -4.02,9.418 -9.84,26.098 l -4.07,12.179 c -30.62,94.692 -49.84,145.981 -57.65,153.91 -2.74,-9.3 -4.07,-21.211 -4.07,-35.781 0,-7.93 0.16,-14.769 0.47,-20.469 l 0.47,-20 -0.47,-12.187 c -0.31,-3.75 -0.47,-7.891 -0.47,-12.344 0,-7.5 0.32,-13.988 0.94,-19.379 0.7,-10.859 1.1,-16.25 1.1,-16.25 h -1.57 c 0,-56.988 1.17,-88.3592 3.6,-94.0584 V 46.9492 c 1.33,-2.8086 2.03,-6.3984 2.03,-10.7773 0,-2.7305 -0.94,-5.1211 -2.81,-7.1914 -1.88,-2.0703 -4.18,-3.1211 -6.88,-3.1211 -7.19,0 -10.78,9.2187 -10.78,27.6601 l 1.09,16.4024 c 0.63,5.0781 0.94,10.6992 0.94,16.8789 0,16.3202 -0.55,40.8202 -1.56,73.4292 -0.94,32.7 -1.41,57.231 -1.41,73.598 0,9.883 0.47,25.043 1.41,45.473 1.01,20.078 1.56,35.078 1.56,45 v 6.719 c 0,16.64 3.05,27.531 9.22,32.652 l 1.56,-1.563 5.16,1.09 c 1.33,-0.429 2.85,-1.48 4.53,-3.121 1.33,-1.367 2.03,-2.887 2.03,-4.527 l 1.09,-3.129 c 0,-0.742 0.04,-1.371 0.16,-1.871 0.2,-0.43 0.31,-0.629 0.31,-0.629 5.39,-24.301 17.66,-58.203 36.72,-101.723 19.46,-46.051 31.56,-76.519 36.25,-91.398 3.44,-12 6.17,-22.582 8.28,-31.723 6.45,-28.9882 14.1,-51.328 22.97,-67.0272 l 0.94,1.5586 c 7.89,75.6206 11.87,168.4416 11.87,278.4416 l -0.62,6.25 c -0.31,1.64 -0.47,3.82 -0.47,6.558 0,7.192 2.38,10.782 7.19,10.782 3.01,0 5.62,-1.563 7.81,-4.692 2.27,-3.039 3.44,-6.398 3.44,-10.148 v -34.223 l -2.66,-4.058 c 0,-32.43 -1.87,-85.59 -5.62,-159.54 -3.68,-73.8589 -7.19,-114.0191 -10.63,-120.4605 l -8.75,-2.039 v -0.6211 l -0.47,0.6211 z" /><path
         id="path102"
         style="fill:#8a916f;fill-opacity:1;fill-rule:nonzero;stroke:none"
         d="m 5081.33,23.3594 c -15.63,0 -27.19,1.8711 -34.69,5.6211 -7.5,3.75 -13.09,10.9804 -16.72,21.7187 -3.55,10.711 -6.68,27.8516 -9.37,51.4098 -4.07,34.371 -6.1,61.09 -6.1,80.161 0,11.558 0.67,24.839 2.03,39.839 l 3.13,32.192 c 1.64,25.5 3.59,44.84 5.78,57.969 2.19,13.121 7.11,24.679 14.84,34.679 7.7,10.082 19.54,15.981 35.47,17.66 1.76,0.391 4.53,0.621 8.28,0.621 10.51,0 15.79,-2.421 15.79,-7.179 0,-2.11 -1.1,-3.91 -3.29,-5.473 -2.18,-1.488 -4.49,-2.187 -6.87,-2.187 l -5.16,0.468 -4.68,0.469 c -5.75,0 -10.9,-1.879 -15.47,-5.629 -4.61,-3.668 -8.44,-9.058 -11.57,-16.25 -7.11,-17.109 -11.68,-33.828 -13.75,-50.148 -2.73,-21.492 -4.45,-40.16 -5.15,-56.102 l -0.47,-39.371 c 0,-16.68 0.51,-29.137 1.56,-37.348 2.38,-3.75 3.99,-9.492 4.85,-17.179 0.82,-7.621 1.6,-18.051 2.34,-31.2502 0.62,-12 2.11,-22.1524 4.53,-30.4727 2.38,-8.3593 6.64,-15.2383 12.81,-20.6289 6.76,-5.8594 16.14,-8.75 28.13,-8.75 9.76,0 16.76,5.4727 20.94,16.4102 4.68,11.5625 7.38,23.4414 8.12,35.6211 1.02,15.3905 1.56,28.3595 1.56,38.9105 v 28.129 c -3.43,3.429 -9.45,5.152 -17.97,5.152 h -4.06 c -1.68,-0.434 -3.55,-0.621 -5.62,-0.621 -8.13,0 -12.19,2.07 -12.19,6.25 0,5.699 4.06,8.59 12.19,8.59 5.82,0 10.62,-0.161 14.37,-0.469 l 11.25,-0.473 c 6.45,-1.051 11.56,-2.258 15.31,-3.59 4.07,-1.371 6.1,-3.238 6.1,-5.629 0,-4.492 -1.06,-10.781 -3.13,-18.902 -1.68,-9.609 -2.5,-16.098 -2.5,-19.527 0,-14.301 0.35,-27.192 1.1,-38.7502 0.31,-12 0.47,-25.1211 0.47,-39.3789 -17.43,-17.7305 -34.81,-26.5625 -52.19,-26.5625 z" /><path
         id="path104"
         style="fill:#8a916f;fill-opacity:1;fill-rule:nonzero;stroke:none"
         d="m 5221.29,26.9492 c -7.81,0 -12.42,1.7227 -13.75,5.1602 -1.8,0 -3.13,-0.2305 -4.06,-0.6289 h -4.22 c -7.5,0 -12.27,1.7187 -14.22,5.1601 0,2.3789 1.33,4.4102 4.06,6.0899 l 2.5,2.6601 h 14.85 l 2.03,2.0313 1.09,4.5273 0.47,6.1016 c 0,20.8203 -0.55,39.4101 -1.56,55.7772 l -0.94,18.902 -1.09,37.348 c 0,13.203 0.5,33.121 1.56,59.692 l 1.09,59.371 c 0,25.82 -0.9,45.55 -2.65,59.218 -3.05,1.02 -8.13,1.563 -15.32,1.563 l -5.62,-0.621 c -1.99,-0.321 -4.18,-0.473 -6.56,-0.473 -6.57,0 -9.85,2.891 -9.85,8.75 0,1.332 1.49,2.692 4.53,4.063 3.13,1.328 5.71,2.031 7.82,2.031 12.89,0 25.82,-0.703 38.75,-2.031 7.89,-0.313 15.78,-1.871 23.59,-4.692 6.13,-1.988 9.22,-4.84 9.22,-8.59 0,-0.738 -0.55,-2.109 -1.56,-4.058 l -11.72,-1.102 c -2.43,2.071 -7.35,3.129 -14.85,3.129 l -2.5,-1.558 c 0.94,-3.051 1.41,-12.04 1.41,-27.04 0,-22.5 -0.16,-42.769 -0.47,-60.781 l -0.94,-60.929 c 0,-15.321 0.67,-33.872 2.03,-55.629 0.94,-24.922 1.41,-43.6722 1.41,-56.2504 v -6.5625 c -0.31,-2.4179 -0.47,-5.4687 -0.47,-9.2187 0,-7.8086 0.51,-12.6211 1.56,-14.3789 l -0.46,-0.9297 c 0,-3.4414 3.75,-5.1602 11.25,-5.1602 3,0 5.54,0.1602 7.65,0.4688 h 7.66 c 9.88,0 14.84,-2.3399 14.84,-7.0313 0,-3.1289 -1.05,-5.6289 -3.12,-7.5 -2.11,-1.8789 -4.81,-2.8086 -8.13,-2.8086 -3.12,0 -5.9,0.3516 -8.28,1.0899 -2.73,0.3125 -5.59,0.4687 -8.59,0.4687 -2.11,0 -5.16,-0.8593 -9.22,-2.5 -4.06,-2.1093 -7.15,-3.1289 -9.22,-3.1289 z" /><path
         id="path106"
         style="fill:#8a916f;fill-opacity:1;fill-rule:nonzero;stroke:none"
         d="m 5444.73,24.9219 c -2.74,0 -4.69,1.0195 -5.94,2.9687 -1.17,2.0703 -2.27,5.1602 -3.28,9.2188 -0.31,2.8125 -1.02,5.1914 -2.03,7.1914 l 0.62,1.5586 c -2.81,16.0195 -8.67,35.6211 -17.5,58.7496 l -9.06,26.563 c -0.74,0.707 -4.02,9.418 -9.84,26.098 l -4.07,12.179 c -30.62,94.692 -49.84,145.981 -57.65,153.91 -2.74,-9.3 -4.07,-21.211 -4.07,-35.781 0,-7.93 0.16,-14.769 0.47,-20.469 l 0.47,-20 -0.47,-12.187 c -0.31,-3.75 -0.47,-7.891 -0.47,-12.344 0,-7.5 0.32,-13.988 0.94,-19.379 0.7,-10.859 1.1,-16.25 1.1,-16.25 h -1.57 c 0,-56.988 1.17,-88.3592 3.6,-94.0584 V 46.9492 c 1.32,-2.8086 2.03,-6.3984 2.03,-10.7773 0,-2.7305 -0.94,-5.1211 -2.81,-7.1914 -1.88,-2.0703 -4.18,-3.1211 -6.88,-3.1211 -7.19,0 -10.78,9.2187 -10.78,27.6601 l 1.09,16.4024 c 0.63,5.0781 0.94,10.6992 0.94,16.8789 0,16.3202 -0.55,40.8202 -1.56,73.4292 -0.94,32.7 -1.41,57.231 -1.41,73.598 0,9.883 0.47,25.043 1.41,45.473 1.01,20.078 1.56,35.078 1.56,45 v 6.719 c 0,16.64 3.05,27.531 9.22,32.652 l 1.56,-1.563 5.16,1.09 c 1.33,-0.429 2.85,-1.48 4.53,-3.121 1.33,-1.367 2.03,-2.887 2.03,-4.527 l 1.09,-3.129 c 0,-0.742 0.04,-1.371 0.16,-1.871 0.2,-0.43 0.31,-0.629 0.31,-0.629 5.39,-24.301 17.66,-58.203 36.72,-101.723 19.45,-46.051 31.56,-76.519 36.25,-91.398 3.44,-12 6.17,-22.582 8.28,-31.723 6.45,-28.9882 14.1,-51.328 22.97,-67.0272 l 0.94,1.5586 c 7.89,75.6206 11.87,168.4416 11.87,278.4416 l -0.62,6.25 c -0.31,1.64 -0.47,3.82 -0.47,6.558 0,7.192 2.38,10.782 7.19,10.782 3.01,0 5.62,-1.563 7.81,-4.692 2.27,-3.039 3.44,-6.398 3.44,-10.148 v -34.223 l -2.66,-4.058 c 0,-32.43 -1.87,-85.59 -5.62,-159.54 -3.68,-73.8589 -7.19,-114.0191 -10.63,-120.4605 l -8.75,-2.039 v -0.6211 l -0.47,0.6211 z" /><path
         id="path108"
         style="fill:#8a916f;fill-opacity:1;fill-rule:nonzero;stroke:none"
         d="m 5558.75,20.2305 c -6.17,0 -9.61,3.5976 -10.31,10.789 v 6.711 c 0.31,1.6484 0.47,3.6797 0.47,6.0976 l -2.03,2.0313 c 2.81,7.1914 4.21,14.1406 4.21,20.9414 0,7.8086 -0.54,19.0586 -1.56,33.7502 l -1.09,33.75 c 0,16.949 0.51,42.5 1.56,76.558 1.33,30.313 2.03,56.02 2.03,77.192 l -0.94,30.621 c -0.74,9.137 -1.09,19.379 -1.09,30.629 0,5.078 1.17,8.75 3.59,10.929 2.39,2.27 6.14,3.442 11.25,3.442 3.44,0 6.14,-1.051 8.13,-3.121 0.7,-0.321 5.66,-1.02 14.84,-2.031 8.52,-1.059 15.86,-2.579 22.03,-4.54 6.45,-2.101 9.69,-4.64 9.69,-7.652 0,-3.437 -3.24,-6.879 -9.69,-10.308 -19.49,6.441 -33.28,9.679 -41.4,9.679 l -2.66,-2.969 c 0.39,-3.121 0.63,-10.46 0.63,-22.031 0,-14.609 -0.39,-27.73 -1.1,-39.371 -0.31,-11.879 -0.47,-25.156 -0.47,-39.848 0,-9.492 2.39,-14.21 7.19,-14.21 l 8.13,0.46 c 2.69,0.321 5.62,0.469 8.75,0.469 13.2,0 19.84,-3.039 19.84,-9.058 0,-3.75 -0.9,-6.95 -2.66,-9.532 -1.68,-2.5 -4.18,-3.75 -7.5,-3.75 -5.11,0 -9.06,1.332 -11.87,4.063 l -16.25,2.5 h -2.66 l -2.5,-2.5 v -1.563 c 0.71,-5.859 1.1,-19.3 1.1,-40.308 0,-13.36 -0.24,-25.473 -0.63,-36.41 l -0.47,-36.2504 c 0,-13.2422 0.51,-26.8398 1.57,-40.7812 0.31,-7.9297 1.95,-13.1992 5,-15.7813 3.12,-2.5 8.78,-3.75 17.03,-3.75 l 9.06,0.6211 c 3.12,0.3203 6.56,0.4727 10.31,0.4727 9.88,0 14.84,-2.2617 14.84,-6.7227 0,-6.1289 -7.5,-9.2187 -22.5,-9.2187 z" /></g></g></svg>