\relax 
\catcode `:\active 
\catcode `;\active 
\catcode `!\active 
\catcode `?\active 
\select@language{french}
\@writefile{toc}{\select@language{french}}
\@writefile{lof}{\select@language{french}}
\@writefile{lot}{\select@language{french}}
\@writefile{toc}{\contentsline {section}{\numberline {1}Contexte}{2}}
\@writefile{toc}{\contentsline {section}{\numberline {2}Probl\IeC {\`e}me}{2}}
\@writefile{toc}{\contentsline {section}{\numberline {3}Solutions possibles}{2}}
\@writefile{toc}{\contentsline {section}{\numberline {4}Solution retenue}{2}}
\@writefile{toc}{\contentsline {section}{\numberline {5}Mise en \IeC {\oe }uvre}{2}}
\@writefile{toc}{\contentsline {subsection}{\numberline {5.1}Ressources mat\IeC {\'e}rielles}{2}}
\@writefile{toc}{\contentsline {subsection}{\numberline {5.2}Ressources Technologiques}{3}}
\@writefile{toc}{\contentsline {subsection}{\numberline {5.3}Ressources Humaines}{3}}
\@writefile{toc}{\contentsline {subsection}{\numberline {5.4}Ressources Temporelles}{3}}
\@writefile{toc}{\contentsline {section}{\numberline {6}Critiques/Am\IeC {\'e}liorations}{3}}
