<svg width="206" height="368" viewBox="0 0 206 368" fill="none" xmlns="http://www.w3.org/2000/svg">
<path d="M58.6022 91.4459C54.8805 87.9272 51.1485 84.4086 47.2535 80.722C46.6621 82.5601 45.9585 84.1776 45.6628 85.8686C45.5098 86.7929 45.8463 87.9588 46.3256 88.799C47.3758 90.6476 48.0692 92.5697 48.3139 94.6809C48.4261 95.6157 48.3751 96.4874 47.5797 97.2017C47.2942 97.4643 47.1311 98.126 47.2229 98.5251C47.437 99.4179 47.1005 99.9746 46.4887 100.479C45.6628 101.161 44.8063 101.813 44.0415 102.558C43.4501 103.136 43.0321 103.052 42.5019 102.516C42.043 102.044 41.523 101.655 40.9826 101.182C40.4626 101.603 39.9935 102.002 39.5245 102.38C38.0562 103.577 37.893 103.556 36.7306 102.023C35.2215 102.772 34.0931 102.681 33.3454 101.75C32.3767 102.464 31.408 103.199 30.317 104.008C29.695 102.968 29.0832 101.949 28.4103 100.825C27.0337 102.191 25.7082 103.441 24.7905 105.216C24.0665 106.613 22.7104 107.673 21.6398 108.881C21.4766 108.829 21.3135 108.776 21.1503 108.724C20.3244 106.193 19.4883 103.661 18.6216 100.993C18.1016 101.34 17.7447 101.571 17.3878 101.813C15.9909 102.758 15.3077 102.653 14.5838 101.077C13.9822 99.7645 13.5641 98.3465 13.197 96.9391C12.6464 94.7964 12.2284 92.6117 11.6981 90.4585C11.6166 90.1119 11.3209 89.6183 11.0456 89.5658C9.68941 89.3032 9.40391 88.2423 9.08782 87.129C7.80305 82.539 7.43598 77.8231 7.05871 73.0966C6.92615 71.4895 6.40613 69.9035 6.11043 68.307C5.27431 63.9062 4.45859 59.5053 3.63267 55.1044C3.5409 54.6212 3.44913 54.1381 3.33697 53.5814C2.3683 54.054 1.4914 54.4847 0.40037 55.0203C0.247422 53.7704 -0.0380814 52.6676 -0.00749177 51.5647C0.145456 46.4181 0.40037 41.2715 0.563514 36.1144C0.6043 34.917 0.410566 33.7091 0.33919 32.5117C0.298404 31.766 0.196439 31.0097 0.257618 30.264C0.553318 26.966 0.777641 23.6469 1.26708 20.3804C1.4914 18.8889 1.98083 17.2714 2.82715 16.074C4.57075 13.6162 6.4877 11.2425 8.62897 9.14182C9.67922 8.1125 11.3616 7.72388 12.7892 7.14619C13.0849 7.03066 13.5641 7.25123 13.9006 7.42978C14.8998 7.95495 15.8583 8.56414 16.8678 9.0788C17.0615 9.18384 17.4388 9.0788 17.6529 8.95276C20.2428 7.26173 23.1896 7.33525 26.0549 7.30374C29.1648 7.26173 31.8567 6.8416 33.6411 3.73261C34.569 2.1046 36.2412 1.12779 38.0052 0.43457C38.9331 0.0669533 39.6978 0.192993 40.33 0.917722C41.0642 1.75799 41.7881 2.60876 42.4101 3.54355C42.8995 4.28929 43.4399 4.6464 44.327 4.53086C46.5907 4.22627 48.7523 4.39432 50.7713 5.74925C51.3321 6.12737 52.2599 5.95932 53.0247 5.95932C53.7079 5.95932 54.3706 6.09586 54.3808 6.87311C54.4012 8.86874 54.3298 10.8749 54.1871 12.86C54.1463 13.3957 53.7996 14.0154 53.4122 14.3935C52.5658 15.2127 52.7902 15.7694 53.4835 16.5677C57.2461 20.895 61.1513 25.0439 65.8213 28.3524C66.2292 28.6465 66.79 28.9406 67.2387 28.8986C68.3603 28.783 69.0129 29.2557 69.4717 30.2325C71.2459 34.0242 74.0601 36.4925 77.7207 38.5406C84.5932 42.3743 91.9449 44.7166 99.317 47.0693C101.061 47.626 102.845 48.0356 104.629 48.4453C109.085 49.4641 112.399 52.384 115.55 55.493C116.62 56.5433 117.497 57.1525 119.088 56.9634C123.778 56.4068 128.499 56.1547 133.19 55.598C134.046 55.493 134.974 54.6632 135.586 53.9175C137.268 51.8693 138.767 49.6636 140.409 47.584C142.581 44.8111 144.824 42.1012 147.027 39.3494C148.525 37.4693 150.075 35.6312 151.462 33.6566C152.084 32.7638 152.431 31.6399 152.747 30.5686C153.695 27.3651 154.582 24.1406 155.459 20.916C155.816 19.5821 156.581 18.8259 157.916 18.6683C160.17 18.4058 162.423 18.0907 164.687 17.9121C166.838 17.744 168.99 17.7545 171.141 17.6075C171.621 17.576 172.1 17.2294 172.538 16.9668C172.956 16.7147 173.283 16.3051 173.711 16.1055C175.791 15.1497 176.617 15.2758 178.034 17.0928C179.645 19.1515 181.246 20.9265 184.03 21.5042C186.671 22.0504 189.148 23.3738 191.738 24.2456C192.768 24.5922 193.89 24.6972 194.971 24.7498C196.714 24.8338 198.07 25.7056 199.284 26.8504C200.089 27.6172 200.925 27.9533 202.027 27.9113C203.882 27.8482 204.545 28.2999 204.668 30.243C204.973 35.043 205.31 39.8535 204.515 44.6641C203.995 47.8046 203.719 50.9871 203.454 54.1591C203.281 56.2702 203.546 58.4444 203.199 60.5241C202.598 64.1372 200.732 67.2462 198.754 70.2396C197.51 72.1197 196.582 74.0629 196.531 76.3841C196.51 77.3504 195.97 78.0121 195.093 78.3902C194.308 78.7263 193.553 79.199 192.738 79.4301C191.106 79.9027 190.454 81.0476 190.433 82.6756C190.413 84.1566 189.709 85.0703 188.384 85.606C187.629 85.9106 186.977 86.4988 186.222 86.7614C184.529 87.3496 184.06 88.6835 183.795 90.322C183.296 93.452 183.795 96.5085 184.173 99.5859C184.468 101.96 184.733 104.333 185.019 106.707C185.151 107.8 184.754 108.556 183.805 109.07C182.796 109.617 181.858 110.289 180.828 110.793C180.206 111.098 179.492 111.161 178.789 111.161C177.351 112.022 175.944 112.946 174.465 113.702C174.017 113.933 173.354 113.734 172.793 113.681C172.477 113.65 172.151 113.387 171.876 113.44C170.468 113.713 169.673 112.862 168.929 111.864C167.522 109.984 166.869 107.8 166.482 105.499C166.369 104.806 166.237 104.113 166.104 103.294C164.972 103.357 163.881 103.451 162.801 103.462C160.884 103.462 160.17 102.758 160.608 100.836C161.128 98.5671 161.985 96.3824 162.678 94.1557C162.852 93.62 162.974 93.0634 163.198 92.2546C161.608 92.8743 160.323 93.4835 158.977 93.8721C158.212 94.0927 157.029 94.3238 156.601 93.9141C155.796 93.1684 156.326 92.034 156.825 91.1413C157.356 90.2065 157.957 89.3242 158.6 88.2949C157.264 88.1163 157.294 87.318 157.56 86.3623C157.865 85.2489 158.131 84.125 158.436 82.9277C156.876 83.1062 155.806 83.6629 155.316 85.2174C154.878 86.6143 153.899 87.5386 152.319 87.8642C152.319 89.7548 152.298 91.6349 152.339 93.5045C152.339 93.8091 152.543 94.1347 152.716 94.4078C157.774 102.653 161.74 111.339 163.463 121.034C164.269 125.561 165.778 129.951 166.502 134.478C168.011 143.952 170.01 153.342 170.713 162.942C171.529 174.023 172.701 185.083 173.456 196.164C174.037 204.64 173.731 213.116 169.826 220.868C166.533 227.411 162.923 233.797 159.273 240.141C156.968 244.143 154.399 247.987 151.788 251.779C150.646 253.428 148.943 254.657 147.751 256.285C143.947 261.484 138.89 264.971 133.445 268.017C132.048 268.794 130.732 269.719 129.397 270.601C127.419 271.914 125.461 273.258 123.401 274.645C124.686 275.821 126.307 275.685 127.745 276.052C127.857 276.084 127.99 276.094 128.112 276.084C131.874 275.748 134.556 277.974 137.238 280.201C138.258 281.041 138.125 282.585 137.238 284.213C136.636 285.316 136.157 286.535 135.872 287.763C135.576 289.034 134.995 289.896 133.863 290.4C132.976 290.799 132.099 291.198 131.212 291.587C131.283 291.755 131.293 291.87 131.334 291.881C135.117 292.931 136.31 294.664 136.412 298.729C136.453 300.231 136.891 301.754 137.319 303.214C137.829 304.947 137.89 306.648 137.126 308.224C136.789 308.928 135.974 309.505 135.239 309.852C132.313 311.217 129.346 312.488 126.389 313.759C125.573 314.106 125.379 314.61 125.451 315.503C125.665 318.044 125.777 320.607 125.93 323.16C126.001 324.346 125.502 325.25 124.655 326.006C122.769 327.687 120.444 328.107 118.099 328.464C117.375 328.579 116.62 328.621 115.937 328.863C114.234 329.462 112.562 329.903 110.89 328.59L110.656 328.884C111.655 331.174 112.654 333.463 113.684 335.816C114.102 335.659 114.438 335.554 114.755 335.396C116.753 334.419 118.364 335.102 118.915 337.392C119.353 339.219 119.506 341.11 119.781 342.979C120.108 345.248 120.414 347.527 120.74 349.88C122.035 349.554 122.463 350.416 122.473 351.456C122.494 354.638 122.453 357.831 122.341 361.014C122.32 361.486 121.851 362.2 121.433 362.358C117.508 363.85 113.653 365.824 109.585 366.528C103.528 367.568 97.1859 368.439 91.486 364.963C88.58 363.188 85.9901 363.429 83.0535 364.595C78.5364 366.391 73.9072 366.16 69.2474 365.026C67.7281 364.658 66.117 364.469 64.557 364.511C60.4784 364.606 56.8178 363.377 53.6365 360.846C50.1697 358.083 49.3947 353.472 51.587 349.554C53.1878 346.687 55.5126 344.555 58.2045 342.801C60.2336 341.477 62.5483 341.824 64.7405 341.614C67.6159 341.341 70.5219 341.414 73.3974 341.162C74.57 341.057 75.763 340.648 76.8438 340.143C79.4745 338.936 82.0542 337.602 84.6441 336.289C86.8262 335.186 88.9981 334.041 91.4452 332.77C90.2624 330.522 89.1612 328.348 87.9682 326.227C87.8051 325.943 87.1525 325.733 86.7956 325.817C81.7076 327.004 76.6807 326.479 71.6742 325.302C70.2874 324.977 68.8497 324.84 67.514 324.378C66.4535 324.01 65.4339 323.391 64.5366 322.697C62.6196 321.227 62.3443 320.439 63.16 318.16C63.6189 316.889 63.4761 316.038 62.3647 315.345C61.5694 314.862 61.1513 314.263 61.3655 313.181C61.4776 312.583 61.1921 311.869 60.978 311.238C58.8673 305.251 56.6954 299.296 54.6052 293.309C51.5054 284.444 48.4261 275.569 45.3671 266.683C43.7866 262.104 42.0838 257.566 40.7787 252.913C38.8107 245.876 36.802 238.807 35.4561 231.623C34.1407 224.596 33.5595 217.423 32.7642 210.301C32.132 204.598 31.4182 198.874 31.1531 193.15C30.6433 181.963 30.2762 170.746 31.5508 159.581C32.0606 155.128 33.1516 150.706 33.2638 146.252C33.4677 138.522 35.762 131.369 37.893 124.111C39.6876 117.967 41.3802 111.791 44.2251 106.045C44.8879 104.701 45.5302 103.252 46.5397 102.222C47.9672 100.773 49.7108 99.6489 51.3423 98.4096C51.8317 98.0419 52.4741 97.8529 52.8921 97.4327C54.8805 95.3951 56.8178 93.3049 58.6022 91.4144V91.4459ZM65.4951 313.57C66.3108 313.612 66.8002 313.675 67.2794 313.665C70.4914 313.581 73.7135 313.549 76.9152 313.36C83.4715 312.971 89.9565 312.131 96.1458 309.642C98.4401 308.718 98.7562 308.203 98.1546 305.672C98.0118 305.062 97.7977 304.474 97.6039 303.876C97.0023 302.048 96.3906 300.231 95.789 298.403C94.1065 293.341 92.5465 288.247 90.4256 283.321C86.9893 275.349 82.2989 268.133 78.2509 260.539C75.2429 254.909 71.8985 249.51 67.9422 244.511C66.1476 242.232 64.5264 239.805 62.844 237.442C61.2839 235.247 59.7544 233.052 58.2249 230.835C58.1128 230.678 58.072 230.289 58.1739 230.174C58.7449 229.512 58.3167 229.029 57.9904 228.504C56.3182 225.825 54.6867 223.116 52.9737 220.458C52.5658 219.828 51.8521 219.418 51.4238 218.799C51.1383 218.389 50.8834 217.727 50.9854 217.276C51.5564 214.828 52.1274 212.381 52.9125 210.007C56.1346 200.25 59.4485 190.524 62.691 180.777C65.4441 172.5 67.9422 164.118 70.9196 155.926C73.6421 148.437 76.8642 141.137 79.8314 133.743C80.1577 132.913 80.4942 131.915 80.3412 131.085C79.7396 127.976 77.7717 125.613 75.7426 123.397C75.141 122.735 74.6719 122.179 74.6311 121.307C74.5904 120.509 74.6311 119.71 74.5904 118.912C74.57 118.565 74.4578 117.998 74.2539 117.925C72.4287 117.284 71.9597 115.572 71.46 114.028C69.8082 108.955 66.2088 105.636 62.12 102.768C60.5599 101.676 58.8163 100.951 56.8586 101.025C55.686 101.067 54.4828 101.245 53.3306 101.067C52.0356 100.867 51.3423 101.35 50.9344 102.516C50.8528 102.747 50.7101 102.968 50.6285 103.199C46.6824 113.828 43.5827 124.72 41.1457 135.801C39.9731 141.148 39.657 146.672 38.7088 152.082C37.0977 161.24 36.6083 170.494 36.4757 179.758C36.3432 188.612 37.1181 197.424 37.7911 206.258C38.5252 215.879 40.0445 225.3 42.4305 234.606C44.3474 242.063 46.6722 249.363 49.2112 256.621C51.4034 262.881 53.0859 269.33 55.0436 275.674C58.439 286.65 61.8855 297.605 65.3115 308.581C65.8009 310.146 66.6575 311.69 65.5256 313.56L65.4951 313.57ZM83.9406 124.71C84.5116 123.376 85.154 121.884 85.7862 120.393C89.0388 112.757 92.261 105.111 96.6047 98.0209C98.4299 95.0485 100.021 91.908 101.438 88.715C105.098 80.4699 109.513 72.7289 115.142 65.7442C117.181 63.2129 119.547 61.1333 122.596 60.0409C123.248 59.8098 124.064 60.1039 124.808 60.1565C124.594 60.7867 124.421 61.4379 124.166 62.0576C124.003 62.4357 123.727 62.7613 123.493 63.1079C117.701 71.4475 112.736 80.2808 108.382 89.5132C104.813 97.0861 100.612 104.354 97.2063 112.001C90.395 127.262 83.7673 142.618 77.4046 158.089C74.519 165.095 72.4899 172.468 70.0223 179.653C66.321 190.429 62.5788 201.195 58.8265 211.961C58.3269 213.389 57.6947 214.755 56.9707 216.53C58.592 219.334 60.4478 222.58 62.3647 225.794C62.8541 226.613 63.6087 226.697 64.353 226.067C64.924 225.594 65.4747 225.09 66.0049 224.575C69.125 221.508 72.1534 218.326 75.3755 215.375C78.1999 212.791 80.7899 210.018 82.8598 206.783C87.6113 199.336 91.7205 191.585 94.2085 182.961C95.2893 179.201 96.982 175.63 98.3585 171.964C99.0315 170.189 100.092 168.404 100.133 166.597C100.184 164.559 101.672 163.236 101.744 161.272C101.815 159.507 102.335 157.722 102.845 156.01C105.69 146.441 108.382 136.81 111.522 127.336C114.673 117.82 116.315 107.831 120.23 98.5776C120.312 98.3886 120.342 98.1785 120.393 97.9684C122.167 90.7106 124.951 83.8204 127.653 76.8988C128.296 75.2497 129.121 73.6742 130.682 72.7499C131.395 72.3298 132.262 72.1828 133.333 71.8257C133.118 72.96 133.078 73.6847 132.853 74.3465C130.488 81.4152 129.223 88.778 127.388 95.9938C125.379 103.882 122.789 111.612 120.363 119.385C119.088 123.449 117.61 127.451 116.243 131.485C115.897 132.514 115.611 133.554 115.387 134.31C117.406 131.957 119.537 129.447 121.688 126.958C123.554 124.804 125.43 122.641 127.337 120.53C128.989 118.691 130.732 116.927 132.384 115.099C133.373 113.996 134.342 112.862 135.229 111.675C136.167 110.415 136.973 109.049 137.911 107.779C140.001 104.932 142.091 102.086 144.243 99.3023C146.17 96.8026 147.057 94.0927 146.547 90.8682C146.201 88.6415 146.058 86.3727 145.895 84.1145C145.701 81.3942 145.711 78.6633 145.385 75.964C145.089 73.5167 144.957 70.8594 143.896 68.7587C142.04 65.114 139.4 61.963 135.433 60.44C133.944 59.8729 132.466 59.2847 130.947 58.833C129.886 58.5179 128.765 58.2344 127.674 58.2659C126.175 58.3079 124.676 58.5915 123.207 58.8856C119.139 59.7048 115.101 60.7867 111.002 61.4064C102.396 62.7088 94.7897 66.2904 88.0804 71.8782C83.3594 75.8064 78.8933 80.0498 74.2335 84.0515C69.0434 88.5049 64.2817 93.494 58.5104 97.2017C58.3167 97.3277 58.1637 97.5273 57.9802 97.6848C57.9904 97.7899 58.0108 97.8949 58.021 98.0104C58.9183 98.0104 59.8258 98.126 60.7027 97.9894C63.1702 97.6113 65.4237 98.105 67.4018 99.6384C68.8599 100.773 70.1447 102.149 71.664 103.178C74.2437 104.932 75.8853 107.348 76.854 110.278C77.7819 113.093 78.567 115.961 79.4337 118.797C79.6173 119.385 79.7702 120.057 80.1373 120.498C81.3303 121.937 82.6252 123.292 83.9304 124.752L83.9406 124.71ZM109.269 277.25C111.532 276.367 113.776 275.496 116.019 274.613C117.875 273.878 119.853 273.353 121.535 272.324C125.655 269.803 129.652 267.051 133.679 264.352C134.352 263.9 135.015 263.354 135.535 262.724C139.002 258.491 142.56 254.331 145.803 249.93C147.74 247.315 149.076 244.238 150.84 241.475C152.828 238.356 155.041 235.383 157.04 232.274C159.619 228.262 162.23 224.25 164.544 220.08C165.798 217.811 166.971 215.28 167.297 212.738C167.98 207.434 168.205 202.056 167.838 196.668C167.471 191.406 167.358 186.112 167.307 180.829C167.256 175.661 167.216 170.504 165.972 165.452C165.003 161.514 163.943 157.596 163.086 153.626C161.72 147.282 160.568 140.895 159.14 134.562C158.426 131.39 157.07 128.365 156.448 125.183C154.98 117.652 152.92 110.299 150.524 103.042C150.198 102.044 149.637 101.13 149.209 100.216C147.679 102.59 146.252 104.827 144.794 107.043C144.294 107.81 143.621 108.461 143.203 109.27C141.755 112.064 139.736 114.301 137.35 116.255C136.565 116.895 135.923 117.736 135.27 118.534C132.629 121.779 130.049 125.077 127.388 128.292C125.033 131.127 122.749 134.005 121.372 137.24C122.178 138.028 123.014 138.606 123.513 139.404C126.419 144.11 129.244 148.868 132.099 153.605C132.293 153.93 132.527 154.235 132.741 154.55C132.864 154.518 132.996 154.487 133.118 154.455C133.118 153.384 133.098 152.313 133.118 151.241C133.149 149.403 133.822 148.815 135.708 148.983C135.923 149.75 136.188 150.548 136.381 151.357C138.727 161.261 138.604 171.324 138.186 181.407C138.094 183.56 137.116 185.797 138.635 187.845C138.696 187.929 138.696 188.087 138.696 188.213C138.614 192.362 138.757 196.521 138.39 200.638C138.064 204.294 137.126 207.886 136.545 211.509C136.259 213.326 135.943 215.186 136.453 217.192C137.523 216.635 138.502 216.194 139.4 215.637C143.06 213.368 146.721 211.089 150.351 208.757C151.86 207.791 153.41 207.487 155.133 207.907C156.163 208.159 156.509 208.768 156.397 209.829C156.203 211.625 155.449 213.106 154.236 214.366C150.922 217.78 147.22 220.626 142.897 222.548C140.868 223.452 139.236 224.796 137.738 226.466C136.748 227.569 135.392 228.325 134.179 229.207C133.088 229.995 131.895 230.657 130.896 231.55C129.927 232.432 129.172 233.556 128.285 234.543C125.512 237.621 122.433 240.446 120.006 243.786C116.1 249.143 112.603 254.804 108.983 260.371C108.086 261.747 107.046 262.682 105.374 262.818C104.334 262.902 103.294 263.154 101.886 263.396C104.395 268.112 106.822 272.67 109.259 277.25H109.269ZM135.912 55.577C136.942 57.016 138.135 57.6987 139.502 58.0663C145.874 59.7783 149.045 64.6519 150.442 70.7018C151.411 74.9031 151.37 79.346 151.788 83.6839C151.839 84.2196 151.9 84.7552 151.962 85.2909C152.064 85.2909 152.176 85.3119 152.278 85.3224C152.563 84.7342 153.053 84.1565 153.083 83.5474C153.226 80.6379 154.083 77.9281 154.857 75.1552C155.714 72.0777 155.938 68.8112 156.458 65.6392C156.754 63.8431 157.396 63.2864 159.487 63.0764C159.925 68.0444 159.946 73.023 160.007 78.0856C161.353 77.4869 162.637 76.8567 163.963 76.3421C164.493 76.132 165.115 76.174 165.686 76.1005C165.686 76.7412 165.788 77.4029 165.656 78.0016C165.513 78.6003 165.115 79.115 164.85 79.6821C164.493 80.4384 164.167 81.2156 163.708 82.2449C164.656 81.9509 165.299 81.6673 165.972 81.5622C166.563 81.4572 167.185 81.5412 167.787 81.5307C167.705 82.2029 167.746 82.9172 167.511 83.5369C167.297 84.0935 166.828 84.5662 166.431 85.0388C165.564 86.0472 164.646 86.9925 163.81 88.0323C163.412 88.5364 163.178 89.1771 162.862 89.7653C162.954 89.8494 163.045 89.9334 163.137 90.0069C164.677 89.3767 166.206 88.7255 167.756 88.1268C169.377 87.5071 170.132 88.0533 169.785 89.7653C169.367 91.845 168.704 93.8721 168.123 95.9098C167.94 96.5505 167.603 97.1492 167.471 97.8004C167.307 98.6406 167.532 99.2183 168.562 99.0398C169.326 98.9137 170.101 98.8612 170.866 98.7877C172.498 98.6301 173.13 99.1343 173.323 100.804C173.415 101.592 173.446 102.39 173.548 103.189C173.711 104.491 174.129 105.667 174.996 106.497C175.74 105.51 176.27 104.354 177.157 103.735C178.177 103.031 178.32 102.275 178.106 101.235C177.198 96.7815 177.861 92.4752 179.176 88.2213C179.319 87.7592 179.543 87.2025 179.9 86.9609C181.195 86.0997 182.49 85.1124 183.928 84.6502C185.182 84.2511 185.529 83.5264 185.794 82.413C186.589 79.0309 187.548 75.6909 188.231 72.2878C188.894 68.9687 192.625 67.0992 194.981 67.4248C196.572 65.3136 198.101 61.711 197.938 58.5284C197.581 51.2706 199.58 44.0969 198.539 36.8286C198.488 36.461 198.55 36.0723 198.529 35.6942C198.448 34.3498 198.407 33.0159 198.244 31.682C198.203 31.3038 197.826 30.6946 197.571 30.6736C196.001 30.5476 194.4 30.3585 193.054 31.5979C192.483 32.1126 191.81 32.5432 191.116 32.8688C189.301 33.7196 187.853 34.9905 186.997 36.8181C186.365 38.173 185.386 38.9923 184.091 39.4964C183.102 39.885 182.103 40.2317 181.093 40.5573C179.431 41.0929 177.769 41.5971 176.087 42.1118C176.372 43.7713 176.678 45.2943 176.892 46.8172C177.168 48.7919 176.413 50.0628 174.618 50.735C173.629 51.1026 172.599 51.3967 171.6 51.7223C168.388 52.7831 164.799 51.7223 162.688 49.0649C161.842 47.9936 162.189 46.5967 163.453 46.1135C164.779 45.6094 166.002 45.6094 167.267 46.4916C168.817 47.5735 170.152 49.1385 172.222 49.233C173.538 47.1638 173.028 45.6514 170.907 44.7271C170.01 44.3385 169.194 43.6242 168.48 42.91C167.878 42.3113 168.042 41.6181 168.919 41.4185C171.09 40.9039 173.262 40.3472 175.475 40.0426C177.218 39.801 178.575 39.2128 179.441 37.5638C180.604 35.3686 182.347 33.8036 184.397 32.4802C186.324 31.2408 188.088 29.7493 189.903 28.3314C190.229 28.0793 190.454 27.6907 190.535 27.5857C188.261 26.7559 186.049 25.9892 183.877 25.1279C182.245 24.4872 180.706 23.6049 179.064 23.0272C177.881 22.6071 176.974 21.9979 176.321 20.9055C175.832 20.0968 175.251 19.3511 174.72 18.5738C173.436 19.1095 172.294 19.6451 171.101 20.0653C170.642 20.2228 169.948 20.3069 169.612 20.0653C168.817 19.4876 168.113 19.6346 167.318 19.9392C166.553 20.2333 165.778 20.4749 164.983 20.6535C164.616 20.7375 164.004 20.748 163.851 20.5379C163.005 19.33 161.903 19.8237 160.853 19.9182C160.027 19.9918 159.538 20.3804 159.303 21.2416C158.763 23.2163 158.008 25.1384 157.57 27.134C156.744 30.8837 154.939 34.0347 152.594 36.9546C148.811 41.6706 145.028 46.3971 141.337 51.1971C139.889 53.0877 138.645 55.1359 135.892 55.5665L135.912 55.577ZM10.9538 11.148C10.811 11.1059 10.6785 11.0744 10.5357 11.0324C9.4345 12.5239 8.2517 13.9628 7.26264 15.5383C6.57947 16.6307 5.81473 17.8806 5.69237 19.12C5.24372 23.4894 4.57075 27.8272 4.79508 32.2701C4.95822 35.4316 4.44839 38.6246 4.23427 41.8072C4.11191 43.6137 4.00994 45.4203 3.87739 47.5C4.63193 47.1218 5.06019 46.9118 5.48844 46.6912C6.76301 46.0505 7.01792 46.1555 7.17087 47.647C7.30342 48.9809 7.21166 50.3464 7.41559 51.6593C8.10895 56.2492 8.88389 60.8392 9.63843 65.4186C9.93413 67.2147 10.24 69.0108 10.5765 71.0169C11.5044 70.4287 12.2182 69.9771 13.0033 69.4834C14.1045 70.7123 14.4512 72.2038 14.6347 73.7478C15.2873 79.241 15.8889 84.7447 16.6027 90.2275C16.8984 92.4857 17.4184 94.7019 17.8568 97.0756C18.3259 96.8131 18.5808 96.687 18.8153 96.54C20.202 95.6787 20.3244 95.7102 21.2217 97.1071C21.4358 97.4433 21.7621 97.6848 22.0272 97.9894C22.3637 98.3885 22.8531 98.7667 22.9755 99.2393C23.312 100.605 23.4853 102.012 23.7606 103.577C25.1576 102.359 26.0549 101.098 25.7082 99.2603C25.4431 97.8739 25.647 96.7185 26.8502 95.8152C27.9514 94.9855 28.9609 94.5653 30.0927 95.9833C30.0927 95.2271 30.0621 94.6914 29.9499 94.1662C29.4707 92.0445 28.9201 89.9334 28.4714 87.8117C27.3294 82.497 26.218 77.1718 25.0964 71.8467C24.8721 70.7858 25.1576 69.9561 26.1262 69.4204C26.4831 69.2208 26.789 68.9372 27.1255 68.6957C28.502 67.6873 29.5625 68.055 30.0417 69.746C30.1539 70.1451 30.215 70.5653 30.266 70.9854C30.5311 73.3591 30.6229 75.7749 31.0919 78.1066C31.7853 81.5412 31.2857 85.2279 33.7736 88.2844C36.1086 91.1518 37.9746 94.4183 40.0445 97.5168C40.7685 97.1387 41.2375 96.8866 41.7065 96.6345C44.0619 95.3426 44.1945 95.2586 42.8078 92.8743C41.3089 90.3115 41.3497 87.8537 42.4713 85.2069C43.3482 83.1272 43.6133 80.9635 43.1035 78.6843C42.9505 77.9911 43.0933 77.0353 43.4603 76.4261C45.0816 73.7688 45.5302 71.2375 43.5113 68.5486C42.6446 67.3932 42.8282 66.9731 44.0721 66.1329C44.9388 65.5447 45.8157 64.967 46.6315 64.4313C46.2338 63.4545 45.724 62.6773 45.622 61.837C45.5404 61.1333 45.7138 60.0199 46.1726 59.7153C47.4982 58.8225 47.2127 57.7932 46.7946 56.6694C46.4887 55.8501 45.9789 55.0939 45.7648 54.2641C45.4079 52.9092 45.0714 51.5227 45.0204 50.1363C45 49.4956 45.6832 48.8444 46.0503 48.1932C46.3562 47.6365 46.8252 47.1113 46.9272 46.5231C47.1923 44.9477 47.8143 43.6978 49.1806 42.826C50.4042 42.0382 50.4654 41.3975 49.6292 39.9796C48.579 40.1791 47.9876 40.9039 47.5084 41.8387C46.7946 43.2251 45.3773 43.9393 43.96 43.6662C43.9906 41.1665 45.8259 39.6855 47.2738 37.6688C46.5295 37.6688 45.9891 37.6899 45.4487 37.6688C43.236 37.5428 40.9826 37.6899 39.0452 36.2194C38.7801 36.0198 38.2091 36.0408 37.8726 36.1879C35.8537 37.0807 33.8756 38.068 31.8669 38.9818C29.8684 39.8955 25.3921 37.6793 24.8109 35.5052C24.7905 35.4211 24.7701 35.3476 24.7497 35.2636C24.403 33.6881 24.1481 32.1441 25.0964 30.6316C25.4227 30.1065 25.4533 29.3502 25.5042 28.6885C25.6674 26.4828 24.505 24.9178 23.1284 23.3948C22.1292 22.2815 21.028 22.6071 19.8554 22.7646C18.8255 22.9012 17.7957 22.6911 17.3062 21.6723C16.3987 19.7712 14.8794 18.5528 13.2174 17.4605C12.0448 16.6937 11.5554 15.6224 11.484 14.2044C11.433 13.1856 11.1475 12.1773 10.964 11.1585L10.9538 11.148ZM109.942 155.894C108.494 157.05 107.923 158.552 107.566 160.243C107.158 162.207 106.801 164.213 106.108 166.072C104.619 170.011 102.865 173.844 101.336 177.773C100.031 181.113 98.9805 184.558 97.6141 187.856C96.5129 190.513 95.0854 193.023 93.8414 195.618C89.8546 203.936 84.6747 211.247 77.3128 216.782C76.3849 217.475 75.6814 218.484 74.7841 219.429C79.7498 222.737 83.1758 227.201 86.1023 232.085C88.4067 235.94 90.497 239.931 92.6994 243.849C93.3826 245.078 94.1167 246.275 94.8713 247.536C95.2791 247.21 95.5952 247.021 95.8501 246.758C98.0832 244.385 100.204 241.895 102.559 239.669C104.599 237.736 105.985 235.436 107.026 232.852C108.851 228.325 110.737 223.819 112.45 219.25C113.735 215.826 115.56 212.822 117.956 210.123C119.771 208.075 121.433 205.89 123.309 203.905C126.705 200.302 128.785 195.786 131.487 191.711C132.333 190.44 131.915 189.253 130.641 188.392C130.274 188.139 129.907 187.877 129.57 187.583C127.306 185.577 126.623 182.142 123.727 180.703C123.666 180.672 123.626 180.577 123.575 180.504C121.729 177.626 119.996 174.706 119.323 171.25C119.21 170.683 118.854 170.137 118.507 169.654C116.926 167.427 115.183 165.305 113.735 162.994C112.328 160.747 111.216 158.31 109.952 155.915L109.942 155.894ZM112.46 58.5284C112.46 58.3709 112.46 58.2133 112.47 58.0663C110.747 56.8059 109.065 55.493 107.301 54.3166C106.434 53.7389 105.445 53.2663 104.456 52.9932C102.182 52.3735 99.8574 51.9008 97.5632 51.3652C89.0287 49.3906 80.8 46.6177 73.2954 41.8282C70.6749 40.1581 68.5642 38.1835 67.8403 34.938C67.6159 33.9402 67.0857 32.9844 66.5351 32.1126C66.3312 31.787 65.6072 31.5139 65.2605 31.6294C62.4157 32.6167 59.6015 33.6881 56.7872 34.7699C55.1762 35.3896 54.8703 36.0513 55.3291 37.7529C55.6758 39.0448 55.5738 40.2317 54.4114 40.9984C52.9431 41.9647 52.3925 43.3932 52.0254 45.0527C51.8215 45.9875 51.1893 46.8172 50.8426 47.7205C50.6285 48.2982 50.4042 48.9704 50.4959 49.5481C50.6183 50.2623 51.0262 50.945 51.3627 51.6068C52.2701 53.4133 52.6678 55.3249 52.3211 57.3206C52.1376 58.3709 52.4843 58.9066 53.3816 59.3582C54.0647 59.6943 54.6153 60.3035 55.2373 60.7762C57.2359 62.3096 56.0938 64.3368 54.5848 65.3346C53.9526 65.7547 52.9635 66.2274 52.8717 66.7946C52.6066 68.4646 51.8419 69.725 50.8222 70.9644C50.1799 71.7416 50.5265 72.3298 51.5258 72.5189C54.9009 73.1806 58.0822 74.3885 61.0188 76.2581C62.5788 77.2559 62.6604 78.2747 61.2125 79.4931C60.3662 80.2073 59.4995 80.8795 58.5818 81.6147C59.9889 83.6629 61.3349 85.627 62.7318 87.6647C63.2008 87.2445 63.5679 86.9189 63.935 86.5828C69.9713 81.1421 75.8139 75.4598 82.095 70.3342C89.2224 64.5153 97.4816 61.0492 106.536 59.6733C108.524 59.3687 110.492 58.9171 112.46 58.5284ZM37.4444 3.02889C36.4655 3.98469 35.6906 4.71992 34.936 5.47616C32.6622 7.7974 30.0927 9.35189 26.7584 9.40441C24.2807 9.44642 21.8029 9.73001 19.3353 9.95058C17.3266 10.1291 17.1329 10.3392 17.6427 12.3663C17.918 13.4482 18.3055 14.8976 19.1008 15.3703C20.5895 16.2526 21.5378 17.4184 22.221 18.9204C22.6492 19.8552 23.2814 20.1703 24.2705 20.0758C24.8822 20.0128 25.7082 20.0443 26.116 20.4014C27.5537 21.6933 28.9303 23.1007 29.4401 25.0964C29.6032 25.7266 29.6236 26.3883 29.7154 27.1025C30.5005 27.029 31.1633 26.966 31.8363 26.8924C31.9383 26.9975 32.0402 27.113 32.1422 27.218C31.7955 27.7222 31.51 28.2999 31.0919 28.72C30.0621 29.7388 29.5625 32.2386 30.2456 33.373C30.99 34.6124 33.7125 35.4842 34.9564 34.9065C36.9957 33.9612 39.0146 32.9739 41.0947 32.1441C42.2877 31.6609 43.5521 31.4614 44.3882 32.9634C44.5616 33.2785 45.0204 33.541 45.3875 33.6251C46.091 33.7931 46.8456 33.7511 47.539 33.9297C49.4253 34.3918 51.2403 34.2133 53.0757 33.6461C56.104 32.7113 59.163 31.85 62.2016 30.9362C62.7624 30.7682 63.2926 30.4846 64.0675 30.1695C58.9795 27.4281 55.064 23.6154 51.3932 19.4141C50.0677 21.1051 49.252 23.1848 46.9781 23.983C46.9781 23.5629 46.8966 23.2898 46.9883 23.1007C48.2527 20.4329 49.3743 17.681 50.8528 15.1497C52.0356 13.1121 52.576 11.127 52.056 8.82672C51.8929 8.09149 51.6074 7.72387 50.7916 7.92344C49.5885 8.21753 48.5076 7.87092 47.386 7.35626C46.3765 6.89411 45.2141 6.67354 44.1027 6.55801C43.185 6.46348 42.2368 6.65254 41.3191 6.78908C40.4524 6.91512 39.9323 6.67354 39.4735 5.81227C38.9433 4.80395 38.1377 3.95318 37.4444 3.01839V3.02889ZM97.4918 288.698C99.317 287.07 100.908 285.642 102.508 284.224C103.069 283.72 103.222 283.152 102.927 282.428C102.09 280.39 101.489 278.195 100.398 276.315C98.124 272.408 96.4109 268.259 94.7591 264.078C91.7817 256.548 87.3054 249.867 83.4817 242.809C80.5655 237.421 77.4964 232.127 73.5503 227.453C72.5409 226.256 71.4804 225.111 70.4404 223.935C67.9422 225.815 65.7194 227.485 63.5577 229.123C77.5983 247.294 89.8138 266.431 97.502 288.698H97.4918ZM93.0359 335.795C91.7817 336.845 90.8844 337.896 89.7526 338.473C87.1117 339.839 84.3688 340.994 81.6566 342.223C81.5138 342.286 81.3405 342.318 81.1875 342.339C73.6319 343.526 66.0865 344.712 58.5308 345.878C57.4092 346.057 56.9504 346.582 57.0829 347.737C57.2257 348.935 58.1535 348.935 58.9897 349.103C60.5395 349.407 62.2118 349.449 63.5883 350.122C65.7092 351.161 67.8504 351.655 70.1651 351.697C71.8271 351.729 73.5197 351.771 75.1308 352.107C77.4454 352.59 79.6988 352.558 82.0236 352.17C84.2465 351.802 86.5305 351.792 88.7839 351.634C89.8342 351.561 90.8946 351.592 91.9449 351.477C93.8414 351.267 95.738 350.699 97.6039 350.783C101.57 350.972 105.527 351.508 109.493 351.865C111.94 352.086 114.367 352.086 116.61 350.741C117.548 350.174 117.936 349.575 117.61 348.389C116.804 345.49 116.111 342.559 115.366 339.639C115.275 339.293 115.132 338.967 114.969 338.505C114.102 339.23 113.327 339.828 112.603 340.501C110.013 342.906 106.975 343.967 103.498 344.198C101.428 344.334 99.786 343.778 98.4604 342.286C96.5639 340.143 93.4947 339.093 93.0155 335.785L93.0359 335.795ZM119.282 351.193C119.108 351.161 118.925 351.13 118.752 351.098C117.569 351.823 116.427 352.632 115.193 353.231C113.959 353.829 112.654 354.565 111.349 354.638C107.342 354.848 103.324 354.817 99.3068 354.796C97.6039 354.796 95.8909 354.481 94.1881 354.502C92.7402 354.523 91.3025 354.806 89.8648 355.016C87.8255 355.3 85.7964 355.667 83.757 355.909C81.8299 356.14 79.8416 356.056 77.9552 356.445C75.4469 356.97 72.9793 357.18 70.4506 356.76C69.0434 356.529 67.6261 356.319 66.2088 356.245C63.5679 356.098 61.0596 355.562 58.8061 354.029C58.3269 353.703 57.6947 353.64 56.9198 353.378C57.0421 353.892 57.0523 354.06 57.1237 354.197C57.2461 354.46 57.3684 354.733 57.5316 354.964C60.3764 359.102 64.455 360.53 69.1556 360.614C70.4506 360.635 71.7557 360.656 73.0405 360.814C75.4061 361.108 77.7513 361.581 80.1271 361.864C82.9515 362.2 85.725 361.885 88.3863 360.772C90.6499 359.827 92.7708 360.005 94.8509 361.497C97.4816 363.387 100.367 364.826 103.64 364.879C106.189 364.91 108.79 364.879 111.288 364.427C114.031 363.934 116.702 362.967 119.363 362.074C119.781 361.927 120.261 361.024 120.22 360.52C119.985 357.411 119.608 354.302 119.282 351.204V351.193ZM89.3447 319.599C90.0687 321.689 90.6907 323.685 91.435 325.628C92.8524 329.304 94.3003 332.97 95.8399 336.604C96.0643 337.14 96.829 337.465 97.3898 337.801C98.3177 338.358 99.5005 338.621 100.204 339.377C103.528 342.969 106.975 343.263 110.635 340.102C112.001 338.925 112.256 337.78 111.512 336.089C110.921 334.755 110.339 333.411 109.677 332.119C106.975 326.815 104.242 321.532 101.509 316.238C101.458 316.133 101.336 316.08 101.214 315.975C97.298 317.173 93.3724 318.381 89.3447 319.609V319.599ZM118.578 303.812C117.161 304.548 117.069 304.527 116.355 303.319C115.387 301.67 114.438 300.01 113.47 298.351C111.889 295.63 110.309 292.9 108.861 290.41C105.588 291.723 102.508 292.963 99.3373 294.223C100.592 297.878 101.907 301.691 103.11 305.22C105.078 305.43 106.791 305.661 108.524 305.777C109.85 305.871 111.176 305.84 112.501 305.808C113.511 305.777 114.53 305.567 115.529 305.609C116.61 305.651 117.487 305.377 118.354 304.695C118.905 304.264 119.659 303.97 120.342 303.886C122.106 303.686 123.891 303.707 125.655 303.518C128.357 303.224 130.692 301.859 132.945 300.977C132.262 299.643 131.65 298.498 131.079 297.321C130.284 295.662 129.754 295.378 127.99 295.672C127.357 295.777 126.674 295.872 126.062 295.746C121.912 294.895 117.813 293.824 113.99 291.881C113.592 291.681 113.143 291.587 112.45 291.345C114.581 295.683 116.549 299.716 118.568 303.823L118.578 303.812ZM100.112 258.785C100.551 257.923 100.908 257.272 101.214 256.6C102.162 254.51 102.988 252.367 104.028 250.33C107.311 243.944 111.227 238.083 117.13 233.86C118.252 233.062 119.272 231.833 119.873 230.573C120.801 228.63 122.116 227.222 123.819 226.077C124.39 225.689 125.033 225.279 125.39 224.712C126.756 222.527 128.632 221.004 130.763 219.691C131.242 219.397 131.599 218.62 131.691 218C131.874 216.856 131.762 215.658 131.905 214.492C132.354 210.795 132.853 207.108 133.312 203.611C132.068 205.113 130.641 206.835 129.223 208.558C127.021 211.247 124.431 213.705 122.708 216.687C119.894 221.561 117.518 226.729 115.213 231.896C114.408 233.713 113.572 235.425 112.318 236.927C111.757 237.589 111.196 238.261 110.645 238.923C106.72 243.692 102.529 248.166 97.7161 252.01C97.5224 252.168 97.3898 252.682 97.4816 252.913C98.2871 254.794 99.1436 256.642 100.112 258.764V258.785ZM121.831 166.293C124.268 164.276 126.46 162.417 128.703 160.621C130.834 158.919 130.834 158.972 129.203 156.692C125.787 151.913 121.861 147.492 119.577 141.925C119.557 141.883 119.435 141.883 119.414 141.883C117.202 145.296 114.999 148.689 112.878 151.945C113.5 152.638 114.102 153.09 114.428 153.71C115.631 155.936 116.651 158.278 117.915 160.453C119.098 162.49 120.526 164.37 121.811 166.282L121.831 166.293ZM131.385 183.066C131.915 182.384 132.282 181.837 132.721 181.365C133.873 180.125 134.189 178.697 134.067 176.985C133.802 173.435 133.557 169.874 133.567 166.314C133.567 164.15 133.088 162.28 131.773 160.327C128.683 163.184 125.644 165.998 122.555 168.855C123.156 172.363 125.053 175.441 126.939 178.518C127.123 178.823 127.439 179.149 127.755 179.243C129.611 179.8 130.661 181.155 131.385 183.066ZM106.506 319.147C107.678 321.826 108.708 324.22 109.809 326.594C109.911 326.815 110.533 326.993 110.798 326.888C112.195 326.332 113.5 326.552 114.836 327.109C115.244 327.277 115.733 327.434 116.131 327.35C118.323 326.899 120.516 326.458 122.657 325.806C123.156 325.649 123.789 324.683 123.748 324.126C123.595 321.815 123.207 319.515 122.861 316.858C117.783 320.429 112.236 318.916 106.516 319.147H106.506ZM102.192 309.631C102.203 309.778 102.223 309.925 102.233 310.083C103.151 310.514 104.079 310.923 104.986 311.375C106.108 311.942 106.149 312.488 105.16 313.307C104.976 313.455 104.793 313.612 104.589 313.77C104.894 314.515 105.211 315.198 105.445 315.902C105.659 316.532 105.996 316.69 106.638 316.564C110.319 315.839 114.01 315.23 117.783 315.902C118.752 316.07 120.974 314.043 120.73 313.223C120.098 311.123 119.323 309.075 118.619 307.037C117.12 307.52 115.835 308.161 114.489 308.329C110.91 308.77 107.311 309.001 103.722 309.327C103.212 309.369 102.712 309.526 102.203 309.621L102.192 309.631ZM66.6065 317.078C66.0253 318.339 66.1068 319.189 66.8308 320.009C68.3399 321.71 70.2466 322.719 72.3879 323.202C74.8453 323.758 77.3128 324.283 79.8008 324.693C82.2174 325.092 84.6034 324.767 86.9486 324.189C86.4285 322.655 85.9595 321.259 85.4293 319.662C79.1278 319.935 72.6938 320.061 66.6167 317.078H66.6065ZM118.415 282.092C123.197 282.386 127.908 282.585 132.598 283.016C134.148 283.152 134.118 282.102 134.352 281.23C134.617 280.243 134.21 279.466 133.22 279.193C132.731 279.056 132.17 279.088 131.65 279.119C128.357 279.277 125.267 278.563 122.463 276.777C121.79 276.357 121.352 276.399 120.893 276.956C120.373 277.596 120.016 278.489 119.363 278.888C118.099 279.665 118.252 280.726 118.405 282.102L118.415 282.092ZM124.645 307.646C125.002 308.739 125.369 309.978 125.848 311.175C125.961 311.448 126.552 311.764 126.817 311.69C128.836 311.06 130.834 310.388 132.802 309.621C133.19 309.474 133.577 308.949 133.7 308.518C134.077 307.153 134.097 305.756 133.659 304.516C130.62 305.577 127.663 306.606 124.645 307.657V307.646ZM115.071 287.837C116.519 289.602 118.181 288.856 119.883 288.562C121.464 288.289 123.116 288.1 124.696 288.278C127.245 288.572 129.376 287.606 131.538 286.535C131.681 286.461 131.762 286.251 131.915 286.051C131.681 285.988 131.579 285.936 131.467 285.936C127.898 285.915 124.319 285.936 120.75 285.841C119.894 285.82 119.047 285.4 118.191 285.222C117.864 285.159 117.365 285.117 117.181 285.306C116.396 286.135 115.703 287.06 115.071 287.837ZM108.565 284.14C109.972 284.77 110.757 286.829 112.858 285.4C114.765 284.108 114.826 284.276 114.112 281.997C113.878 281.241 113.521 281.031 112.797 281.104C110.89 281.314 109.646 282.501 108.555 284.14H108.565Z" fill="black"/>
<path d="M65.4951 313.57C66.6269 311.7 65.7704 310.167 65.2809 308.591C61.8549 297.626 58.4085 286.66 55.013 275.684C53.0451 269.34 51.3626 262.891 49.1806 256.631C46.6417 249.374 44.3066 242.074 42.3999 234.616C40.0139 225.31 38.4946 215.889 37.7605 206.268C37.0875 197.435 36.3126 188.622 36.4451 179.768C36.5879 170.504 37.0773 161.251 38.6782 152.092C39.6264 146.693 39.9425 141.158 41.1151 135.812C43.5521 124.731 46.6518 113.839 50.5979 103.209C50.6897 102.978 50.8222 102.758 50.9038 102.527C51.3117 101.361 52.005 100.878 53.3 101.077C54.4522 101.256 55.6452 101.077 56.828 101.035C58.7857 100.962 60.5293 101.686 62.0894 102.779C66.1884 105.657 69.7776 108.965 71.4294 114.038C71.9291 115.582 72.3981 117.294 74.2233 117.935C74.4272 118.009 74.5394 118.576 74.5598 118.922C74.6108 119.721 74.5598 120.519 74.6006 121.317C74.6515 122.189 75.1104 122.746 75.712 123.407C77.7411 125.623 79.709 127.987 80.3106 131.096C80.4738 131.915 80.1373 132.923 79.8008 133.753C76.8438 141.147 73.6115 148.447 70.889 155.936C67.9116 164.129 65.4135 172.5 62.6604 180.787C59.4179 190.534 56.104 200.26 52.8819 210.018C52.0968 212.391 51.5258 214.849 50.9548 217.286C50.8528 217.738 51.0975 218.389 51.3932 218.809C51.8215 219.429 52.5454 219.838 52.9431 220.468C54.6561 223.126 56.2876 225.825 57.9598 228.514C58.2861 229.039 58.7144 229.533 58.1433 230.184C58.0414 230.3 58.0924 230.688 58.1943 230.846C59.7238 233.062 61.2533 235.257 62.8134 237.452C64.4958 239.826 66.117 242.252 67.9116 244.521C71.8577 249.521 75.2123 254.919 78.2203 260.549C82.2785 268.143 86.9588 275.359 90.395 283.331C92.5159 288.257 94.0861 293.34 95.7584 298.414C96.36 300.241 96.9718 302.058 97.5734 303.886C97.7671 304.485 97.9812 305.073 98.124 305.682C98.7256 308.213 98.4095 308.728 96.1152 309.652C89.926 312.141 83.441 312.982 76.8846 313.37C73.6727 313.559 70.4608 313.591 67.2488 313.675C66.7696 313.685 66.2802 313.633 65.4645 313.58L65.4951 313.57Z" fill="#E58252"/>
<path d="M83.9406 124.71C82.6252 123.26 81.3405 121.905 80.1475 120.456C79.7804 120.004 79.6275 119.342 79.4439 118.754C78.5772 115.918 77.8023 113.051 76.8642 110.236C75.8955 107.306 74.2641 104.89 71.6742 103.136C70.1549 102.106 68.8701 100.731 67.412 99.5962C65.4237 98.0627 63.1805 97.569 60.7129 97.9472C59.836 98.0837 58.9285 97.9682 58.0312 97.9682C58.021 97.8631 58.0006 97.7581 57.9904 97.6426C58.1638 97.485 58.3167 97.2854 58.5206 97.1594C64.2919 93.4517 69.0537 88.4522 74.2437 84.0092C78.9035 80.0075 83.3798 75.7641 88.0906 71.8359C94.7999 66.2481 102.407 62.677 111.012 61.3641C115.111 60.7444 119.139 59.6625 123.218 58.8433C124.696 58.5492 126.195 58.2656 127.684 58.2236C128.775 58.1921 129.896 58.4757 130.957 58.7908C132.476 59.2424 133.965 59.8306 135.443 60.3978C139.41 61.9208 142.061 65.0718 143.906 68.7164C144.977 70.8171 145.11 73.4744 145.395 75.9217C145.721 78.621 145.701 81.3519 145.905 84.0723C146.068 86.3305 146.201 88.5992 146.558 90.8259C147.067 94.0504 146.18 96.7603 144.253 99.2601C142.102 102.054 140.011 104.89 137.921 107.736C136.993 109.007 136.188 110.373 135.239 111.633C134.352 112.82 133.394 113.965 132.395 115.057C130.732 116.895 128.999 118.649 127.347 120.487C125.44 122.609 123.564 124.762 121.698 126.915C119.547 129.405 117.406 131.915 115.397 134.268C115.621 133.522 115.907 132.472 116.253 131.442C117.62 127.409 119.098 123.407 120.373 119.342C122.8 111.57 125.39 103.84 127.398 95.9515C129.234 88.7462 130.498 81.3834 132.864 74.3042C133.088 73.6425 133.129 72.9177 133.343 71.7834C132.272 72.1405 131.405 72.2875 130.692 72.7077C129.132 73.632 128.306 75.197 127.663 76.8565C124.961 83.7782 122.167 90.6578 120.403 97.9261C120.352 98.1257 120.322 98.3358 120.24 98.5353C116.335 107.799 114.693 117.788 111.532 127.293C108.392 136.767 105.7 146.388 102.855 155.967C102.345 157.68 101.815 159.465 101.754 161.23C101.683 163.194 100.194 164.517 100.143 166.555C100.102 168.361 99.0315 170.147 98.3687 171.922C96.982 175.588 95.2995 179.159 94.2187 182.919C91.7409 191.542 87.6215 199.304 82.87 206.741C80.8103 209.976 78.2101 212.748 75.3857 215.332C72.1636 218.284 69.1352 221.466 66.0151 224.533C65.4849 225.058 64.9343 225.552 64.3632 226.025C63.6189 226.644 62.8644 226.571 62.3749 225.752C60.4682 222.538 58.6124 219.292 56.981 216.488C57.7049 214.713 58.3371 213.337 58.8367 211.919C62.5891 201.153 66.321 190.387 70.0325 179.61C72.5001 172.426 74.5394 165.053 77.4148 158.047C83.7774 142.576 90.4052 127.22 97.2165 111.959C100.622 104.312 104.823 97.0439 108.392 89.471C112.746 80.2386 117.712 71.4053 123.503 63.0656C123.738 62.7295 124.013 62.3934 124.176 62.0153C124.431 61.4061 124.615 60.7549 124.819 60.1142C124.074 60.0617 123.248 59.7676 122.606 59.9987C119.557 61.0805 117.191 63.1707 115.152 65.702C109.524 72.6867 105.109 80.4381 101.448 88.6727C100.031 91.8657 98.4299 95.0062 96.6149 97.9787C92.2712 105.068 89.0491 112.715 85.7964 120.351C85.1642 121.842 84.5218 123.334 83.9508 124.668L83.9406 124.71Z" fill="white"/>
<path d="M109.269 277.25C106.832 272.67 104.405 268.112 101.897 263.396C103.304 263.154 104.334 262.892 105.384 262.818C107.056 262.681 108.096 261.757 108.994 260.371C112.614 254.804 116.111 249.132 120.016 243.786C122.443 240.446 125.522 237.621 128.296 234.543C129.183 233.556 129.937 232.432 130.906 231.55C131.905 230.646 133.098 229.995 134.189 229.207C135.403 228.325 136.759 227.569 137.748 226.466C139.247 224.796 140.878 223.452 142.907 222.548C147.221 220.626 150.932 217.78 154.246 214.366C155.459 213.106 156.214 211.614 156.408 209.829C156.52 208.768 156.173 208.148 155.143 207.907C153.42 207.497 151.86 207.791 150.361 208.757C146.731 211.079 143.081 213.368 139.41 215.637C138.513 216.194 137.534 216.624 136.463 217.192C135.953 215.185 136.259 213.326 136.555 211.509C137.136 207.875 138.074 204.283 138.401 200.638C138.768 196.521 138.635 192.362 138.706 188.213C138.706 188.087 138.706 187.929 138.645 187.845C137.126 185.797 138.105 183.56 138.197 181.407C138.605 171.324 138.737 161.261 136.392 151.357C136.198 150.548 135.943 149.75 135.719 148.983C133.822 148.815 133.16 149.403 133.129 151.241C133.109 152.313 133.129 153.384 133.129 154.455C133.007 154.487 132.874 154.518 132.752 154.55C132.538 154.235 132.313 153.93 132.109 153.604C129.254 148.867 126.43 144.109 123.524 139.404C123.034 138.606 122.188 138.039 121.383 137.24C122.759 133.995 125.043 131.127 127.399 128.291C130.07 125.067 132.65 121.779 135.28 118.534C135.933 117.736 136.575 116.895 137.361 116.255C139.757 114.312 141.765 112.064 143.213 109.27C143.631 108.461 144.304 107.81 144.804 107.043C146.262 104.827 147.69 102.59 149.219 100.216C149.658 101.14 150.208 102.054 150.534 103.041C152.931 110.299 154.99 117.652 156.459 125.182C157.081 128.365 158.437 131.39 159.151 134.562C160.568 140.895 161.72 147.281 163.097 153.625C163.953 157.596 165.014 161.513 165.982 165.452C167.226 170.504 167.267 175.661 167.318 180.829C167.369 186.112 167.481 191.395 167.848 196.668C168.225 202.056 167.991 207.434 167.308 212.738C166.981 215.269 165.809 217.811 164.555 220.08C162.24 224.26 159.63 228.262 157.05 232.274C155.052 235.383 152.839 238.356 150.851 241.475C149.097 244.248 147.751 247.315 145.813 249.93C142.561 254.331 139.002 258.491 135.546 262.723C135.026 263.354 134.373 263.9 133.69 264.351C129.662 267.051 125.675 269.803 121.546 272.324C119.863 273.353 117.885 273.878 116.029 274.613C113.796 275.496 111.553 276.367 109.279 277.25H109.269Z" fill="#E88AB7"/>
<path d="M135.913 55.5769C138.666 55.1463 139.91 53.0981 141.358 51.2075C145.049 46.4075 148.832 41.6915 152.615 36.965C154.96 34.0451 156.765 30.8836 157.59 27.1444C158.029 25.1488 158.783 23.2267 159.324 21.2521C159.558 20.3803 160.048 20.0022 160.874 19.9287C161.924 19.8446 163.025 19.3405 163.872 20.5484C164.024 20.7584 164.636 20.7479 165.003 20.6639C165.799 20.4853 166.574 20.2438 167.338 19.9497C168.134 19.6451 168.837 19.498 169.633 20.0757C169.969 20.3173 170.662 20.2333 171.121 20.0757C172.314 19.6556 173.466 19.1199 174.741 18.5842C175.281 19.351 175.863 20.1072 176.342 20.916C176.994 22.0083 177.902 22.6175 179.085 23.0376C180.726 23.6153 182.276 24.4976 183.898 25.1383C186.069 25.9996 188.282 26.7663 190.556 27.5961C190.464 27.7011 190.24 28.0897 189.924 28.3418C188.109 29.7493 186.334 31.2512 184.418 32.4906C182.358 33.814 180.614 35.379 179.462 37.5742C178.595 39.2233 177.239 39.8114 175.496 40.053C173.293 40.3576 171.121 40.9248 168.939 41.429C168.062 41.639 167.899 42.3217 168.501 42.9204C169.214 43.6347 170.03 44.3384 170.928 44.7375C173.059 45.6723 173.558 47.1743 172.243 49.2434C170.173 49.1489 168.837 47.5839 167.287 46.5021C166.023 45.6198 164.799 45.6198 163.474 46.1239C162.22 46.6071 161.863 48.004 162.709 49.0754C164.83 51.7327 168.409 52.7935 171.621 51.7327C172.63 51.3966 173.65 51.113 174.639 50.7454C176.444 50.0732 177.188 48.8023 176.913 46.8277C176.699 45.2942 176.393 43.7817 176.107 42.1222C177.78 41.6075 179.452 41.1034 181.114 40.5677C182.123 40.2421 183.123 39.8955 184.112 39.5068C185.407 39.0027 186.385 38.1834 187.018 36.8285C187.874 35.0009 189.322 33.73 191.137 32.8793C191.83 32.5536 192.514 32.123 193.074 31.6083C194.42 30.3795 196.021 30.558 197.591 30.6841C197.846 30.7051 198.224 31.3143 198.264 31.6924C198.428 33.0263 198.468 34.3707 198.55 35.7046C198.57 36.0828 198.509 36.4714 198.56 36.839C199.6 44.1073 197.602 51.2811 197.959 58.5389C198.111 61.7109 196.592 65.324 195.002 67.4352C192.656 67.1096 188.914 68.9792 188.251 72.2982C187.568 75.7013 186.61 79.0413 185.814 82.4234C185.56 83.5368 185.203 84.251 183.948 84.6606C182.511 85.1228 181.216 86.1101 179.921 86.9714C179.564 87.2129 179.34 87.7696 179.197 88.2318C177.882 92.4856 177.219 96.792 178.126 101.245C178.34 102.285 178.187 103.031 177.178 103.745C176.291 104.365 175.761 105.52 175.016 106.508C174.15 105.678 173.732 104.501 173.568 103.199C173.466 102.411 173.436 101.613 173.344 100.815C173.14 99.1447 172.518 98.6405 170.887 98.7981C170.112 98.8716 169.337 98.9136 168.582 99.0502C167.552 99.2287 167.318 98.6511 167.491 97.8108C167.624 97.1596 167.96 96.5609 168.144 95.9202C168.725 93.8825 169.388 91.8554 169.806 89.7757C170.153 88.0532 169.398 87.5175 167.777 88.1372C166.227 88.7254 164.697 89.3871 163.158 90.0173C163.066 89.9333 162.974 89.8493 162.882 89.7757C163.188 89.1981 163.423 88.5469 163.831 88.0427C164.657 87.0029 165.585 86.0576 166.451 85.0492C166.849 84.5766 167.328 84.104 167.532 83.5473C167.767 82.9381 167.726 82.2134 167.807 81.5411C167.206 81.5411 166.584 81.4676 165.992 81.5727C165.33 81.6882 164.687 81.9613 163.729 82.2554C164.188 81.226 164.514 80.4488 164.871 79.6926C165.136 79.1254 165.534 78.6002 165.676 78.012C165.819 77.4133 165.707 76.7411 165.707 76.1109C165.126 76.1845 164.514 76.1424 163.984 76.3525C162.658 76.8672 161.373 77.4869 160.027 78.0961C159.966 73.0335 159.946 68.0549 159.507 63.0868C157.417 63.2969 156.775 63.8535 156.479 65.6496C155.949 68.8216 155.735 72.0882 154.878 75.1656C154.103 77.9385 153.247 80.6484 153.104 83.5578C153.073 84.1565 152.574 84.7342 152.298 85.3328C152.196 85.3328 152.084 85.3118 151.982 85.3013C151.921 84.7657 151.86 84.23 151.809 83.6943C151.391 79.3564 151.432 74.9135 150.463 70.7122C149.066 64.6728 145.895 59.7888 139.522 58.0767C138.156 57.7091 136.963 57.0264 135.933 55.5874L135.913 55.5769Z" fill="#4DB276"/>
<path d="M10.9538 11.1478C11.1373 12.1666 11.433 13.1644 11.4738 14.1937C11.5452 15.6117 12.0346 16.6725 13.2072 17.4498C14.8693 18.5421 16.3885 19.75 17.296 21.6616C17.7855 22.6804 18.8153 22.8905 19.8452 22.7539C21.0076 22.5964 22.119 22.2708 23.1182 23.3841C24.4846 24.9071 25.6572 26.4721 25.494 28.6778C25.4431 29.3395 25.4125 30.1063 25.0862 30.6209C24.1379 32.1334 24.3928 33.6774 24.7395 35.2529C24.7599 35.3369 24.7803 35.4104 24.8007 35.4945C25.3819 37.6582 29.8582 39.8849 31.8567 38.9711C33.8654 38.0573 35.8435 37.07 37.8624 36.1772C38.1989 36.0301 38.7699 36.0091 39.035 36.2087C40.9724 37.6792 43.2258 37.5426 45.4385 37.6582C45.9789 37.6897 46.5193 37.6582 47.2636 37.6582C45.8157 39.6748 43.9906 41.1453 43.9498 43.6556C45.3569 43.9181 46.7742 43.2039 47.4982 41.828C47.9774 40.9037 48.579 40.179 49.619 39.9689C50.4552 41.3868 50.394 42.0275 49.1704 42.8153C47.8143 43.6871 47.1923 44.937 46.917 46.5125C46.815 47.1006 46.346 47.6363 46.0401 48.1825C45.6832 48.8337 44.9898 49.4954 45.0102 50.1256C45.0612 51.512 45.3977 52.8985 45.7546 54.2534C45.9687 55.0937 46.4785 55.8394 46.7844 56.6587C47.2127 57.7825 47.4982 58.8118 46.1624 59.7046C45.7036 60.0092 45.5302 61.1226 45.6118 61.8263C45.7138 62.6561 46.2134 63.4438 46.6213 64.4206C45.8055 64.9668 44.9286 65.5445 44.0619 66.1222C42.818 66.9624 42.6344 67.3826 43.5011 68.5379C45.52 71.2268 45.0714 73.7686 43.4501 76.4154C43.0831 77.0141 42.9403 77.9804 43.0933 78.6736C43.6031 80.9529 43.338 83.1165 42.4611 85.1962C41.3395 87.843 41.2987 90.2903 42.7976 92.8636C44.1843 95.2479 44.0517 95.3319 41.6963 96.6238C41.2273 96.8759 40.7583 97.1175 40.0343 97.5061C37.9542 94.4076 36.0882 91.1306 33.7634 88.2737C31.2755 85.2172 31.7649 81.5305 31.0817 78.0959C30.6127 75.7642 30.5209 73.3484 30.2558 70.9747C30.2048 70.5546 30.1437 70.1344 30.0315 69.7353C29.5523 68.0443 28.502 67.6767 27.1153 68.685C26.7788 68.9266 26.4729 69.2101 26.116 69.4097C25.1474 69.9559 24.8619 70.7751 25.0862 71.836C26.2078 77.1612 27.3192 82.4863 28.4612 87.801C28.9201 89.9332 29.4605 92.0339 29.9397 94.1555C30.0621 94.6702 30.0825 95.2164 30.0825 95.9726C28.9609 94.5547 27.9412 94.9748 26.84 95.8046C25.6368 96.7078 25.4329 97.8632 25.698 99.2496C26.0447 101.088 25.1474 102.348 23.7504 103.567C23.4853 102.002 23.3018 100.594 22.9653 99.2286C22.8531 98.756 22.3535 98.3884 22.017 97.9787C21.7621 97.6741 21.4256 97.4221 21.2115 97.0965C20.3142 95.6995 20.202 95.668 18.8051 96.5293C18.5706 96.6763 18.3157 96.8024 17.8466 97.0649C17.4082 94.7017 16.8882 92.475 16.5925 90.2168C15.8787 84.7341 15.2771 79.2303 14.6245 73.7371C14.441 72.1931 14.0943 70.7016 12.9931 69.4727C12.208 69.9664 11.4942 70.418 10.5663 71.0062C10.2298 69.0001 9.92393 67.204 9.62823 65.4079C8.87369 60.818 8.09875 56.2385 7.40539 51.6486C7.20146 50.3252 7.29322 48.9702 7.16067 47.6363C7.00772 46.1448 6.75281 46.0293 5.47824 46.6805C5.04999 46.9011 4.61153 47.1111 3.86719 47.4893C3.99974 45.4096 4.10171 43.603 4.22407 41.7965C4.428 38.614 4.93782 35.4209 4.78488 32.2594C4.56055 27.8165 5.23352 23.4682 5.68217 19.1093C5.81473 17.8699 6.56927 16.6305 7.25244 15.5277C8.2415 13.9522 9.4243 12.5237 10.5255 11.0217C10.6683 11.0637 10.8008 11.0953 10.9436 11.1373L10.9538 11.1478Z" fill="#E88AB7"/>
<path d="M112.461 58.5177C110.482 58.9064 108.525 59.3685 106.536 59.6626C97.492 61.0385 89.2227 64.5046 82.0953 70.3235C75.8142 75.4491 69.9716 81.1419 63.9352 86.5721C63.5682 86.8977 63.2011 87.2338 62.7321 87.6539C61.3351 85.6163 59.9892 83.6627 58.5821 81.604C59.4998 80.8688 60.3665 80.1966 61.2128 79.4824C62.6607 78.264 62.5791 77.2452 61.019 76.2473C58.0824 74.3777 54.9113 73.1699 51.5261 72.5082C50.5268 72.3086 50.1801 71.7309 50.8225 70.9537C51.8422 69.7143 52.6069 68.4539 52.872 66.7838C52.9638 66.2167 53.9426 65.744 54.585 65.3239C56.0941 64.3366 57.2361 62.2989 55.2376 60.7654C54.6156 60.2928 54.065 59.6836 53.3818 59.3475C52.4845 58.9064 52.1379 58.3602 52.3214 57.3099C52.6681 55.3037 52.2704 53.3921 51.3629 51.596C51.0264 50.9238 50.6084 50.2516 50.4962 49.5374C50.4044 48.9597 50.6288 48.2875 50.8429 47.7098C51.1896 46.796 51.8218 45.9768 52.0257 45.042C52.3826 43.3824 52.9332 41.954 54.4117 40.9877C55.5639 40.2209 55.676 39.0341 55.3294 37.7422C54.8705 36.0406 55.1866 35.3789 56.7875 34.7592C59.6017 33.6774 62.416 32.606 65.2608 31.6187C65.6075 31.4927 66.3314 31.7763 66.5354 32.1019C67.086 32.9736 67.6162 33.9295 67.8405 34.9273C68.5747 38.1833 70.6752 40.1474 73.2957 41.8174C80.8003 46.607 89.0289 49.3798 97.5634 51.3545C99.8678 51.8901 102.182 52.3523 104.456 52.9825C105.456 53.2556 106.434 53.7282 107.301 54.3059C109.065 55.4823 110.758 56.7952 112.471 58.0556C112.471 58.2131 112.471 58.3707 112.461 58.5177Z" fill="#E88AB7"/>
<path d="M37.4445 3.02881C38.1378 3.9636 38.9434 4.81437 39.4736 5.82269C39.9222 6.68396 40.4423 6.92554 41.3192 6.7995C42.247 6.66296 43.1953 6.4739 44.1028 6.56843C45.2142 6.68396 46.3766 6.90453 47.3861 7.36668C48.5077 7.88134 49.5987 8.23846 50.7917 7.93386C51.6075 7.7343 51.893 8.10191 52.0561 8.83715C52.5761 11.1374 52.0459 13.133 50.8529 15.1601C49.3744 17.6914 48.2426 20.4433 46.9884 23.1112C46.8967 23.3002 46.9782 23.5733 46.9782 23.9934C49.2419 23.1952 50.0678 21.1155 51.3933 19.4245C55.0641 23.6258 58.9796 27.4385 64.0676 30.1799C63.3029 30.5055 62.7625 30.7786 62.2017 30.9466C59.1631 31.8604 56.1041 32.7217 53.0758 33.6565C51.2404 34.2237 49.4152 34.4022 47.539 33.9401C46.8355 33.772 46.0809 33.8035 45.3876 33.6355C45.0205 33.541 44.5617 33.2889 44.3883 32.9738C43.5522 31.4613 42.2878 31.6714 41.0948 32.1545C39.0147 32.9843 36.9958 33.9716 34.9565 34.9169C33.7227 35.4841 30.9901 34.6123 30.2457 33.3834C29.5625 32.2491 30.0622 29.7493 31.092 28.7304C31.5203 28.3103 31.7956 27.7326 32.1423 27.2285C32.0403 27.1234 31.9383 27.0079 31.8364 26.9029C31.1736 26.9659 30.5006 27.0289 29.7155 27.1129C29.6237 26.3987 29.5931 25.737 29.4402 25.1068C28.9304 23.1007 27.5538 21.6932 26.1161 20.4118C25.7083 20.0442 24.8823 20.0232 24.2705 20.0862C23.2713 20.1807 22.6391 19.8656 22.221 18.9308C21.5379 17.4289 20.5998 16.263 19.1009 15.3807C18.3056 14.9081 17.9181 13.4691 17.6428 12.3768C17.133 10.3496 17.3267 10.1501 19.3354 9.961C21.8132 9.74043 24.2807 9.45684 26.7585 9.41483C30.0928 9.36231 32.6623 7.80782 34.9361 5.48659C35.6805 4.71984 36.4656 3.99511 37.4445 3.03931V3.02881Z" fill="#4DB276"/>
<path d="M97.5024 288.688C89.8142 266.431 77.5987 247.294 63.5581 229.113C65.73 227.485 67.9426 225.804 70.4408 223.924C71.4808 225.1 72.5412 226.256 73.5507 227.443C77.4968 232.117 80.5659 237.41 83.4821 242.799C87.3058 249.857 91.7923 256.537 94.7595 264.068C96.4113 268.259 98.1244 272.407 100.398 276.304C101.489 278.184 102.091 280.379 102.927 282.417C103.223 283.142 103.07 283.709 102.509 284.213C100.908 285.631 99.3174 287.06 97.4922 288.688H97.5024Z" fill="#E58252"/>
<path d="M93.0363 335.784C93.5156 339.103 96.5847 340.143 98.4813 342.286C99.8068 343.777 101.448 344.334 103.518 344.198C106.995 343.967 110.034 342.906 112.624 340.5C113.338 339.828 114.123 339.23 114.989 338.505C115.153 338.977 115.306 339.303 115.387 339.639C116.131 342.559 116.815 345.489 117.63 348.388C117.957 349.565 117.569 350.174 116.631 350.741C114.388 352.086 111.961 352.075 109.514 351.865C105.547 351.508 101.591 350.972 97.6248 350.783C95.7486 350.699 93.852 351.266 91.9657 351.476C90.9154 351.592 89.855 351.571 88.8048 351.634C86.5513 351.781 84.2673 351.791 82.0445 352.17C79.7196 352.558 77.4662 352.59 75.1516 352.107C73.5303 351.77 71.8479 351.718 70.1859 351.697C67.8713 351.655 65.73 351.161 63.6091 350.121C62.2326 349.449 60.5502 349.407 59.0105 349.103C58.1744 348.935 57.2465 348.935 57.1037 347.737C56.9712 346.582 57.43 346.046 58.5516 345.878C66.1073 344.712 73.6527 343.525 81.2083 342.339C81.3715 342.318 81.5346 342.286 81.6774 342.223C84.3795 340.994 87.1325 339.839 89.7734 338.473C90.9052 337.885 91.8025 336.835 93.0567 335.795L93.0363 335.784Z" fill="#4DB276"/>
<path d="M119.282 351.182C119.608 354.291 119.985 357.39 120.22 360.499C120.261 361.014 119.782 361.917 119.364 362.053C116.702 362.946 114.031 363.912 111.288 364.406C108.79 364.858 106.19 364.889 103.64 364.858C100.357 364.816 97.4817 363.366 94.851 361.476C92.7709 359.984 90.6501 359.806 88.3864 360.751C85.7149 361.864 82.9517 362.179 80.1272 361.843C77.7616 361.56 75.4062 361.098 73.0406 360.793C71.7559 360.635 70.4507 360.614 69.1558 360.593C64.4552 360.509 60.3765 359.07 57.5317 354.943C57.3686 354.701 57.2462 354.438 57.1239 354.176C57.0627 354.029 57.0423 353.871 56.9199 353.357C57.6949 353.609 58.3372 353.682 58.8063 354.008C61.0597 355.531 63.5681 356.077 66.209 356.224C67.6263 356.298 69.0436 356.508 70.4507 356.739C72.9795 357.159 75.447 356.959 77.9554 356.424C79.8417 356.024 81.8301 356.109 83.7572 355.888C85.7965 355.646 87.8256 355.279 89.8649 354.995C91.3026 354.796 92.7404 354.501 94.1883 354.48C95.8911 354.459 97.5939 354.764 99.3069 354.775C103.324 354.796 107.342 354.838 111.349 354.617C112.654 354.544 113.97 353.808 115.193 353.21C116.427 352.611 117.569 351.792 118.752 351.077C118.925 351.109 119.109 351.14 119.282 351.172V351.182Z" fill="white"/>
<path d="M89.3452 319.588C93.3728 318.349 97.2985 317.151 101.214 315.954C101.336 316.059 101.459 316.122 101.51 316.217C104.242 321.51 106.965 326.794 109.677 332.098C110.34 333.39 110.921 334.734 111.512 336.068C112.257 337.77 112.002 338.904 110.636 340.08C106.975 343.252 103.539 342.958 100.205 339.355C99.501 338.599 98.3182 338.326 97.3903 337.78C96.8295 337.444 96.0647 337.118 95.8404 336.583C94.3007 332.959 92.8528 329.293 91.4355 325.607C90.6912 323.664 90.0692 321.668 89.3452 319.578V319.588Z" fill="white"/>
<path d="M118.589 303.802C116.57 299.685 114.602 295.662 112.471 291.324C113.164 291.566 113.613 291.66 114.01 291.86C117.834 293.813 121.933 294.874 126.083 295.725C126.695 295.851 127.378 295.756 128.01 295.651C129.764 295.368 130.294 295.651 131.1 297.3C131.661 298.477 132.283 299.622 132.966 300.955C130.712 301.838 128.377 303.203 125.675 303.497C123.911 303.686 122.127 303.665 120.363 303.865C119.669 303.938 118.925 304.243 118.374 304.674C117.508 305.356 116.631 305.629 115.55 305.587C114.541 305.545 113.531 305.766 112.522 305.787C111.196 305.819 109.871 305.85 108.545 305.756C106.812 305.64 105.099 305.409 103.131 305.199C101.917 301.67 100.612 297.857 99.3579 294.202C102.519 292.931 105.608 291.692 108.881 290.389C110.329 292.878 111.91 295.609 113.49 298.33C114.449 299.989 115.397 301.649 116.376 303.298C117.09 304.516 117.181 304.527 118.599 303.791L118.589 303.802Z" fill="white"/>
<path d="M100.123 258.774C99.1542 256.652 98.2977 254.804 97.4922 252.924C97.3902 252.693 97.5228 252.178 97.7267 252.02C102.539 248.187 106.73 243.702 110.656 238.933C111.207 238.261 111.778 237.599 112.328 236.938C113.582 235.436 114.418 233.724 115.224 231.907C117.528 226.739 119.904 221.582 122.718 216.698C124.442 213.715 127.021 211.257 129.234 208.568C130.651 206.846 132.079 205.123 133.323 203.621C132.864 207.119 132.364 210.805 131.916 214.503C131.773 215.658 131.885 216.855 131.702 218.011C131.6 218.62 131.253 219.408 130.774 219.702C128.643 221.015 126.766 222.538 125.4 224.722C125.043 225.289 124.411 225.699 123.83 226.088C122.127 227.233 120.812 228.64 119.884 230.583C119.282 231.844 118.263 233.062 117.141 233.871C111.237 238.082 107.332 243.943 104.038 250.34C102.988 252.367 102.162 254.52 101.224 256.61C100.918 257.283 100.551 257.934 100.123 258.795V258.774Z" fill="#E88AB7"/>
<path d="M121.841 166.282C120.557 164.37 119.129 162.48 117.946 160.452C116.672 158.268 115.662 155.936 114.459 153.709C114.133 153.1 113.531 152.638 112.909 151.945C115.03 148.678 117.222 145.286 119.445 141.883C119.466 141.883 119.588 141.883 119.608 141.925C121.892 147.491 125.818 151.913 129.234 156.692C130.865 158.961 130.865 158.908 128.734 160.62C126.491 162.417 124.299 164.276 121.862 166.292L121.841 166.282Z" fill="#E88AB7"/>
<path d="M131.396 183.045C130.672 181.134 129.621 179.779 127.766 179.222C127.45 179.127 127.133 178.802 126.95 178.497C125.064 175.42 123.167 172.342 122.565 168.834C125.655 165.977 128.694 163.162 131.783 160.305C133.088 162.259 133.578 164.129 133.578 166.292C133.578 169.853 133.812 173.414 134.077 176.964C134.21 178.665 133.894 180.104 132.731 181.344C132.293 181.816 131.926 182.362 131.396 183.045Z" fill="#4DB276"/>
<path d="M106.516 319.126C112.247 318.885 117.783 320.408 122.861 316.836C123.208 319.494 123.595 321.794 123.748 324.105C123.789 324.661 123.157 325.628 122.657 325.785C120.516 326.436 118.324 326.878 116.131 327.329C115.724 327.413 115.234 327.256 114.836 327.088C113.511 326.531 112.196 326.321 110.799 326.867C110.533 326.972 109.912 326.794 109.81 326.573C108.708 324.21 107.678 321.804 106.506 319.126H106.516Z" fill="white"/>
<path d="M102.203 309.61C102.712 309.505 103.212 309.358 103.722 309.316C107.311 308.991 110.91 308.759 114.489 308.318C115.835 308.15 117.12 307.51 118.619 307.026C119.323 309.064 120.097 311.112 120.73 313.213C120.974 314.022 118.762 316.059 117.783 315.891C114.01 315.229 110.329 315.828 106.638 316.553C105.996 316.679 105.659 316.521 105.445 315.891C105.2 315.187 104.894 314.505 104.589 313.759C104.792 313.591 104.976 313.444 105.16 313.297C106.149 312.488 106.108 311.931 104.986 311.364C104.079 310.913 103.151 310.503 102.233 310.072C102.223 309.925 102.203 309.778 102.192 309.621L102.203 309.61Z" fill="#4DB276"/>
<path d="M66.6069 317.057C72.684 320.04 79.118 319.904 85.4195 319.641C85.9497 321.237 86.429 322.634 86.9388 324.168C84.5936 324.735 82.2076 325.071 79.791 324.672C77.3031 324.262 74.8355 323.748 72.3781 323.181C70.2369 322.687 68.3403 321.689 66.821 319.988C66.0971 319.168 66.0053 318.318 66.5967 317.057H66.6069Z" fill="white"/>
<path d="M118.415 282.081C118.252 280.705 118.099 279.644 119.374 278.867C120.026 278.468 120.383 277.586 120.903 276.934C121.352 276.367 121.801 276.325 122.474 276.756C125.278 278.541 128.367 279.266 131.661 279.098C132.181 279.077 132.731 279.035 133.231 279.172C134.21 279.445 134.628 280.222 134.363 281.209C134.128 282.081 134.159 283.142 132.609 282.995C127.919 282.575 123.218 282.365 118.426 282.07L118.415 282.081Z" fill="white"/>
<path d="M124.646 307.625C127.664 306.575 130.621 305.545 133.659 304.485C134.098 305.724 134.077 307.121 133.7 308.486C133.578 308.917 133.19 309.442 132.803 309.589C130.835 310.345 128.836 311.028 126.817 311.658C126.552 311.742 125.961 311.427 125.849 311.144C125.369 309.957 125.002 308.707 124.646 307.615V307.625Z" fill="#E58252"/>
<path d="M115.071 287.826C115.703 287.049 116.396 286.125 117.181 285.295C117.355 285.106 117.854 285.148 118.191 285.211C119.047 285.389 119.894 285.799 120.75 285.831C124.319 285.925 127.898 285.904 131.467 285.925C131.579 285.925 131.691 285.978 131.915 286.041C131.763 286.24 131.681 286.461 131.538 286.524C129.377 287.585 127.235 288.561 124.696 288.267C123.116 288.089 121.464 288.267 119.884 288.551C118.181 288.845 116.509 289.591 115.071 287.826Z" fill="#E58252"/>
<path d="M108.555 284.129C109.646 282.491 110.88 281.314 112.797 281.094C113.511 281.01 113.878 281.23 114.112 281.986C114.816 284.266 114.755 284.098 112.858 285.39C110.747 286.818 109.962 284.759 108.565 284.129H108.555Z" fill="white"/>
</svg>
