<svg width="296" height="215" viewBox="0 0 296 215" fill="none" xmlns="http://www.w3.org/2000/svg">
<path d="M22.4075 152.515C7.87971 144.454 0.77503 140.899 0.2205 122.273C-0.33403 103.646 83.473 33.1718 117.09 7.19945C150.706 -18.7729 228.104 37.1995 277.188 69.6507C301.622 85.8052 296.321 105.54 291.303 120.453C286.285 135.366 279.96 153.911 274.571 172.606C269.183 191.302 229.053 205.18 218.477 209.457C207.902 213.734 201.423 218.749 170.29 208.211C139.157 197.672 36.9353 160.577 22.4075 152.515Z" fill="#E58252"/>
</svg>
