<svg width="303" height="237" viewBox="0 0 303 237" fill="none" xmlns="http://www.w3.org/2000/svg">
<path d="M160.861 8.3995C127.993 19.7216 63.5333 54.4886 31.3195 68.7644C-0.894334 83.0402 -10.8063 118.91 13.6675 142.975C38.1413 167.041 50.8375 178.475 97.4239 214.975C144.01 251.475 171.162 244.161 270.884 178.975C314.497 150.467 301.885 131.619 297.029 114.121C292.173 96.6234 287.715 81.9754 280.903 52.9526C274.09 23.9297 258.494 19.4754 223.169 8.3995C187.844 -2.6764 193.728 -2.92257 160.861 8.3995Z" fill="#E88AB7"/>
</svg>
