<svg width="13" height="20" viewBox="0 0 13 20" fill="none" xmlns="http://www.w3.org/2000/svg">
<path d="M9.26358 0.181562C10.1267 0.416849 12.7383 3.10932 12.7383 3.76393C12.7383 4.41853 4.29088 8.45984 4.29089 9.73454C4.29091 11.0092 12.51 15.493 12.51 16.1875C12.51 17.3761 9.67009 19.3275 9.26358 19.2875C8.85707 19.2475 0.0423622 10.5784 -0.0022831 9.73454C-0.0469284 8.8907 8.40045 -0.0537251 9.26358 0.181562Z" fill="#E58252"/>
</svg>
