<svg width="138" height="204" viewBox="0 0 138 204" fill="none" xmlns="http://www.w3.org/2000/svg">
<path d="M13.2822 61.9696L6.78223 71.9696V73.9697V76.9697L11.2822 79.9697L16.2822 76.9697V94.9697C16.2822 99.7697 14.2822 108.636 13.2822 112.47V127.97C13.2822 126.97 14.4822 124.57 19.2822 122.97C24.0822 121.37 29.2822 120.636 31.2822 120.47L36.2822 137.97H42.7822L48.7822 120.47V79.9697V68.9696L45.7822 56.9696C44.6156 56.3029 41.5822 55.8696 38.7822 59.4696C37.7822 63.9696 40.2822 63.9697 34.7822 66.9697C30.3822 69.3697 26.4489 67.9696 26.7822 65.9696L19.2822 59.4696L13.2822 61.9696Z" fill="#E88AB7"/>
<path d="M79.2822 36.4697L76.7822 43.9697L83.2822 50.9697L86.2822 47.4697L89.7822 61.9696L86.2822 71.9696L89.7822 76.9697L86.2822 79.9697V83.4697V112.97C87.2822 112.803 89.8822 111.77 92.2822 108.97C94.6822 106.17 100.949 107.803 103.782 108.97V122.97L116.282 120.47L122.282 90.9697V83.4697C122.282 79.8697 120.616 62.9697 119.782 54.9697L124.782 52.4697V49.4697H131.282V43.9697L127.782 32.4697L112.782 26.9697V28.9697L108.782 32.4697H103.782L99.2822 30.4697L96.2822 26.9697L84.7822 32.4697L79.2822 36.4697Z" fill="#E88AB7"/>
<path d="M19.2822 197.47L13.2822 194.47L17.2822 184.97H21.7822C22.9822 184.97 24.2822 185.636 24.7822 185.97V190.47C24.7822 192.87 26.1156 194.136 26.7822 194.47L28.2822 201.97L23.7822 203.47L19.2822 201.47V197.47Z" fill="#E88AB7"/>
<path d="M84.7822 172.47C84.7822 170.47 83.1156 166.303 82.2822 164.47V162.97L86.7822 161.97V167.47C86.7822 169.07 87.7822 170.47 88.2822 170.97L91.2822 170.47L93.7822 186.47L94.7822 183.97C95.1156 183.636 96.0822 182.97 97.2822 182.97C98.4822 182.97 99.7822 183.636 100.282 183.97L103.782 194.47L103.282 198.97L97.2822 200.47C95.9489 200.136 92.9822 199.17 91.7822 197.97C90.5822 196.77 91.2822 191.47 91.7822 188.97H88.7822C87.9489 187.97 85.9822 185.57 84.7822 183.97C83.2822 181.97 84.7822 174.97 84.7822 172.47Z" fill="#E88AB7"/>
<path d="M121 89.5C117.167 90 107.3 90.7 98.5 89.5C90.5622 88.4176 87.452 85.6265 86.6741 83.989L86.5 113C88 112 91.6 109.5 94 107.5C96.4 105.5 101 108.333 103 110L105 121.5H117L121 89.5Z" fill="#4DB276"/>
<path d="M94.5371 27.8682C94.5371 27.7755 94.5371 27.6827 94.4909 27.6363C93.567 26.1525 93.2436 24.4832 93.0588 22.7675C93.0126 22.3038 92.874 21.8401 92.5044 21.4692C92.3197 21.2373 92.2273 20.8664 92.1349 20.5882C92.0887 20.3563 92.1349 20.0781 92.0887 19.7999C92.0425 19.058 91.9963 18.3624 91.6267 17.7132C91.3033 17.0641 91.2109 16.4149 91.2571 15.673C91.3033 15.0238 91.2571 14.3282 91.2109 13.6791C91.0261 11.0824 91.0261 8.53203 92.1811 6.1208C93.0126 4.35875 94.2599 2.96766 96.0616 2.13301C96.7546 1.80842 97.4475 1.39109 98.1867 1.0665C99.0182 0.741916 99.896 0.463697 100.774 0.278218C101.698 0.0927396 102.668 0 103.638 0C104.239 0 104.885 0.0927392 105.486 0.185479C105.717 0.231848 105.948 0.231849 106.179 0.278218C106.595 0.370958 107.057 0.463697 107.472 0.649176C108.165 0.973764 108.858 1.39109 109.551 1.76205C110.152 2.04027 110.66 2.45759 111.029 2.96766C111.769 3.94143 112.462 4.91519 113.201 5.93532C113.478 6.30628 113.57 6.76998 113.524 7.23368C113.432 8.48566 113.339 9.78401 112.924 10.9896C112.877 11.1287 112.831 11.3606 112.924 11.4533C113.293 12.2416 113.155 13.0763 113.108 13.8645C113.062 14.6065 112.877 15.3484 112.739 16.0439C112.554 16.9713 112.138 17.8523 111.584 18.6406C111.491 18.7797 111.399 19.0116 111.445 19.1507C111.722 21.2373 112.046 23.324 112.323 25.4106C112.323 25.457 112.369 25.5497 112.415 25.6425C112.554 25.6425 112.693 25.7352 112.785 25.6888C113.339 25.5961 113.755 25.7816 114.171 26.1061C114.356 26.2916 114.587 26.338 114.818 26.2453C115.695 26.0134 116.481 26.2453 117.312 26.5235C119.068 27.0799 120.777 27.7755 122.44 28.6101C122.717 28.7492 123.041 28.842 123.318 28.8883C124.889 29.2129 126.367 29.7694 127.845 30.5113C128.815 31.0213 129.555 31.7169 130.155 32.6906C131.633 35.1019 132.188 37.7913 132.65 40.5271C132.973 42.2428 132.973 43.9585 132.927 45.6742C132.927 46.0915 132.881 46.5552 132.927 46.9725C132.927 47.3435 132.881 47.6217 132.419 47.8072C132.604 47.8999 132.696 47.9463 132.788 47.9927C133.189 48.1472 133.327 48.4409 133.204 48.8737C133.158 49.0128 133.204 49.1519 133.25 49.291C133.62 50.2184 133.943 51.1922 134.359 52.0732C135.144 53.8352 135.745 55.6437 136.115 57.5448C136.299 58.5649 136.669 59.4923 137.223 60.4197C137.778 61.3935 137.916 62.3673 137.593 63.4801C137.316 64.3148 137.177 65.1958 137.593 66.0768C137.685 66.3087 137.731 66.5869 137.731 66.8651C137.731 68.1171 137.5 69.2764 136.761 70.3429C136.623 70.5747 136.438 70.7602 136.346 71.0384C136.022 71.7339 135.468 71.9658 134.729 71.9658C134.359 71.9658 133.943 71.9658 133.574 72.0585C132.188 72.2904 130.94 72.0585 129.832 71.0848C129.139 70.5283 128.492 69.9255 127.753 69.4155C126.783 68.6735 126.367 67.5607 125.813 66.4942C125.72 66.2623 125.72 65.8914 125.813 65.6595C126.228 64.964 125.997 64.3612 125.674 63.8511C124.611 63.7584 123.549 63.6656 122.486 63.5729C122.486 63.6656 122.44 63.7584 122.44 63.8047C122.764 65.1494 122.717 66.5405 122.81 67.8853C122.948 70.5283 123.226 73.1714 123.918 75.7681C124.565 78.133 124.796 80.5906 124.75 83.0481C124.75 83.8364 124.704 84.5784 124.75 85.3666C124.842 86.8505 124.565 88.2879 124.103 89.679C124.011 90.0036 123.688 90.2818 123.503 90.56C123.364 91.3483 123.226 92.1366 123.041 92.8785C122.81 93.8523 122.486 94.7797 122.302 95.7071C122.209 96.078 122.255 96.449 122.255 96.82C122.255 97.33 122.302 97.8865 122.209 98.3965C121.932 99.7412 121.516 101.086 121.193 102.431C120.869 103.729 120.546 105.027 120.315 106.372C120.13 107.578 119.946 108.783 119.899 110.035C119.853 112.122 119.484 114.162 119.253 116.202C119.114 117.223 119.068 118.289 118.975 119.356C119.206 119.402 119.345 119.448 119.53 119.495C119.899 119.587 120.038 119.866 120.084 120.19C120.13 120.515 119.899 120.654 119.668 120.793C119.576 120.839 119.437 120.886 119.345 120.932C119.068 121.025 118.883 121.164 118.929 121.489C118.975 122.045 118.606 122.277 118.144 122.37C117.22 122.602 116.296 122.787 115.326 122.972C115.049 123.019 114.818 123.065 114.587 123.158C114.263 124.224 114.032 125.291 113.617 126.265C112.739 128.444 111.907 130.67 110.752 132.757C109.505 134.936 108.258 137.115 107.472 139.526C107.057 140.871 106.502 142.123 106.04 143.422C105.393 145.276 104.839 147.085 104.192 148.94C104.054 149.357 103.823 149.774 103.592 150.145C103.361 150.516 103.222 150.887 103.176 151.351C103.13 153.808 103.084 156.266 102.991 158.677C102.945 160.022 102.806 161.367 102.622 162.665C102.437 163.871 102.113 165.123 101.79 166.328C101.698 166.653 101.42 167.024 101.143 167.256C100.728 167.627 100.543 168.044 100.543 168.554C100.497 169.76 100.45 170.965 100.358 172.171C100.312 173.237 100.173 174.304 100.173 175.417C100.173 176.9 100.127 178.338 100.266 179.822C100.358 181.027 100.728 182.187 100.959 183.346C101.005 183.67 101.19 183.949 100.959 184.227C100.912 184.32 100.912 184.505 100.959 184.644C101.097 185.062 101.236 185.479 101.467 185.85C102.16 186.824 102.622 187.89 102.991 189.003C103.592 190.672 104.192 192.342 104.793 194.011C105.116 194.892 105.209 195.773 105.209 196.7V198.277C105.624 198.37 105.994 198.509 106.548 198.648C105.763 199.529 105.347 200.549 104.192 200.781C103.961 200.827 103.73 200.92 103.546 201.013C102.76 201.523 101.882 201.569 101.005 201.523C100.358 201.523 99.665 201.476 99.0182 201.43C98.1867 201.384 97.4937 201.755 96.7546 201.986C95.8768 202.265 94.9991 202.357 94.0752 202.218C93.1512 202.079 92.6892 201.523 92.3659 200.781C91.8577 199.575 91.3495 198.37 90.8876 197.118C90.7028 196.608 90.5642 196.051 90.5642 195.495C90.518 194.057 90.518 192.666 90.518 191.229V189.559C90.056 189.884 89.6864 190.069 89.4092 190.301C89.0397 190.58 88.7163 190.58 88.2543 190.394C86.9146 189.838 86.083 188.817 85.4825 187.612C84.5585 185.757 83.6808 183.856 83.496 181.769C83.4036 180.425 83.4036 179.033 83.3574 177.689C83.3574 176.9 83.3574 176.159 83.3112 175.37C83.3112 175.185 83.265 174.999 83.2188 174.814C82.7107 173.608 82.3411 172.356 81.6943 171.243C80.5856 169.203 80.1698 167.07 80.5856 164.798C80.7704 163.778 81.2324 162.897 82.2025 162.526C83.4036 162.016 84.6047 161.459 85.9445 161.274C86.314 161.228 86.6836 161.227 87.0994 161.181C87.7461 161.135 88.0233 160.81 87.9771 160.161C87.7923 157.657 87.6076 155.153 87.469 152.603C87.4228 151.768 87.5152 150.98 87.6999 150.192C87.9771 148.893 88.2081 147.548 88.4853 146.25C88.9011 144.395 89.363 142.587 89.825 140.732C90.287 138.97 90.8414 137.254 90.4718 135.446C90.3332 134.843 90.1484 134.287 90.056 133.684C89.6402 131.505 89.1783 129.325 88.7625 127.099C88.3467 124.781 87.9309 122.416 87.469 120.098C87.3304 119.309 87.007 118.614 86.7298 117.825C86.4526 117.037 86.2678 116.342 85.9907 115.461C85.7135 115.368 85.4363 115.229 85.1129 115.182C84.7895 115.136 84.6509 114.951 84.6047 114.672C84.5585 114.301 84.5585 113.93 84.5585 113.513C84.8357 110.035 84.8819 106.511 84.4661 103.034C84.3738 102.292 84.42 101.55 84.3738 100.808C84.1428 98.0256 83.8656 95.197 83.6808 92.4148C83.5422 90.3746 83.265 88.3343 82.9416 86.3404C82.8031 85.3666 82.8031 84.3465 83.4498 83.4655C83.6346 83.1873 83.4498 82.8163 83.1264 82.6772C82.1563 82.2599 81.1862 81.8889 80.2622 81.4252C79.7078 81.147 79.1535 80.776 78.7377 80.4051C78.3681 80.0341 78.0447 79.6168 77.86 79.1067C77.5828 78.3184 77.4442 77.4838 77.5828 76.6028C77.7214 75.7681 77.629 74.9798 77.398 74.1915C76.6126 71.363 75.4577 68.6272 74.3028 65.8914C73.1017 63.1555 72.4087 60.327 71.4848 57.4984C71.4848 57.4521 71.4386 57.4057 71.4386 57.3593C70.5146 55.18 71.0228 53.0933 71.9005 51.0067C72.7783 48.92 73.7484 46.8334 74.6724 44.7468C74.7186 44.6077 74.811 44.4686 74.7648 44.3294C74.5338 43.8194 74.7648 43.4021 74.9495 42.9384C75.6425 41.0836 76.1969 39.136 76.5202 37.1885C76.6588 36.4002 76.8898 35.6583 77.1208 34.9164C77.167 34.7309 77.398 34.5454 77.5366 34.4063C77.7214 34.2209 77.9986 34.1281 78.2295 33.989C79.5693 33.3862 80.909 32.8298 82.2025 32.227C83.496 31.6241 84.7895 31.0677 85.9907 30.3722C87.469 29.5375 88.9935 28.8883 90.5642 28.3319C91.4419 28.0537 92.3659 27.9146 93.2898 27.7755C93.7056 27.9609 94.1214 27.9146 94.5371 27.8682ZM79.2459 43.2629C80.9552 44.5613 82.1563 46.3697 83.958 47.529C84.0966 47.4362 84.189 47.3435 84.2814 47.2507C84.6047 46.787 84.9281 46.3233 85.2515 45.8133C85.4363 45.5351 85.6211 45.2568 85.9907 45.1641C86.9608 44.8859 87.8847 44.5613 88.8549 44.2831C89.363 44.144 89.5478 44.3758 89.5016 44.8859C89.363 46.1842 89.2245 47.4362 89.1321 48.7346C89.0859 49.3837 89.0397 50.0793 89.1321 50.7285C89.4554 53.0933 89.825 55.4118 90.1946 57.7767C90.4256 59.3069 90.8414 60.8371 90.287 62.4136C90.1946 62.6918 90.1022 62.9701 90.056 63.2483C89.6402 64.6857 89.2245 66.1696 88.8549 67.607C88.6701 68.349 88.4391 69.1372 88.2543 69.8792C88.1619 70.2965 87.9309 70.5747 87.5614 70.7138C87.2842 70.8529 87.007 71.0384 86.5912 71.2702C87.2842 71.9658 87.9309 72.6613 88.6239 73.3105C89.1783 73.867 89.825 74.3307 90.4256 74.8871C90.9338 75.3508 91.0723 75.9536 90.8414 76.6028C90.5642 77.2519 90.1484 77.8084 89.4092 77.9475C88.9935 77.9939 88.6239 78.0866 88.2081 78.133C88.2543 79.3849 87.6999 80.1269 86.4064 80.4051C86.6374 80.6369 86.8222 80.8688 86.9146 80.8688C87.469 80.8224 87.9771 81.0079 88.5315 81.0079C89.3168 81.0079 89.9174 81.3325 90.518 81.7498C90.9337 82.028 91.3033 82.2599 91.7191 82.4917C92.2735 82.8163 92.8278 83.0945 93.4284 83.3727C94.2137 83.7437 95.0453 84.1147 95.8306 84.4392C96.3388 84.6247 96.8932 84.7638 97.4013 84.9957C98.9258 85.5521 100.45 86.1549 101.929 86.7577C102.575 86.9896 103.176 87.2214 103.823 87.4533C104.331 87.6388 104.839 87.7315 105.347 87.8242C105.994 87.9633 106.687 88.0097 107.288 88.1952C109.043 88.798 110.845 88.798 112.646 89.0762C113.108 89.169 113.57 89.2153 114.079 89.2617C115.002 89.3544 115.926 89.5863 116.85 89.5399C118.421 89.4935 119.946 89.2617 121.516 89.0762C121.562 88.8444 121.562 88.7053 121.562 88.5198C121.516 86.294 121.609 84.1147 121.285 81.8889C121.008 80.1732 120.685 78.4576 120.361 76.6955C120.084 75.1653 119.761 73.6815 119.576 72.1513C119.437 70.7602 119.391 69.3227 119.437 67.9316C119.437 65.7986 119.484 63.6656 119.761 61.4862C118.744 60.9298 119.253 60.0488 119.391 59.2141C118.975 59.0286 118.837 58.6577 118.883 58.2867C118.975 57.7767 119.022 57.313 119.484 56.942C119.715 56.7565 119.899 56.4319 120.13 56.1537C119.715 55.9219 119.668 55.5973 119.668 55.2263C119.761 53.7889 119.853 53.1861 121.655 52.9542C121.701 52.9542 121.793 52.9078 121.886 52.9078C122.44 52.9078 122.81 52.676 122.902 52.0268C122.948 51.7022 123.179 51.424 123.272 51.0994C123.364 50.8676 123.41 50.6357 123.503 50.3575C123.318 50.3111 123.226 50.2648 123.087 50.2648C122.81 50.2648 122.579 50.2184 122.486 49.8938C122.394 49.5692 122.579 49.4301 122.764 49.2446C122.948 49.0592 123.179 48.92 123.318 48.6882C124.057 46.8798 124.981 45.1641 125.351 43.2629C125.443 42.892 125.489 42.5674 125.582 42.1964C125.72 41.64 125.813 41.5936 126.321 41.7791C126.598 41.8718 126.875 41.9646 127.152 42.0573C127.522 42.1501 127.66 42.3819 127.568 42.7529C127.429 43.5412 127.291 44.3294 127.152 45.0714C127.014 45.8133 127.106 46.5088 127.152 47.3435C128.215 47.0189 129.185 46.8798 130.155 47.2507C130.201 47.0653 130.247 46.9725 130.247 46.8334C130.155 45.9524 130.201 45.0714 129.97 44.2831C129.462 42.2428 128.862 40.2489 128.261 38.255C127.845 36.8639 127.291 35.5192 126.598 34.2672C126.413 33.8963 126.275 33.5253 126.182 33.108C126.09 32.737 125.905 32.5052 125.628 32.3197C125.351 32.1342 125.073 31.9487 124.75 31.8096C123.179 31.1141 121.609 30.4185 119.899 30.0012C119.391 29.9085 118.975 29.6766 118.467 29.4911C117.589 29.1202 116.758 28.7492 115.88 28.4246C115.511 28.2855 115.141 28.1928 114.679 28.0073C114.54 28.4246 114.402 28.7956 114.263 29.1202C113.986 29.9085 113.524 30.5576 112.785 31.0213C112.138 31.3923 111.445 31.7633 110.752 32.0878C108.489 33.2471 106.04 33.8035 103.546 34.1281C102.483 34.2672 101.374 34.2208 100.404 33.6644C99.6188 33.2007 98.8335 32.737 98.0943 32.2733C97.2628 31.7633 96.6622 31.1141 96.3388 30.1867C96.2464 29.9085 96.0616 29.6302 96.0616 29.352C96.0616 29.1202 96.2926 28.842 96.4312 28.6101C95.8768 28.3783 95.3225 28.5174 94.7681 28.7492C93.798 29.2129 92.7816 29.6766 91.8115 30.1867C89.8712 31.2532 87.9309 32.2733 85.8521 33.0616C84.8819 33.4326 83.9118 33.8963 82.9416 34.3136C82.5721 34.4991 82.2025 34.6382 82.1101 35.1019C81.9253 35.8438 81.6943 36.5393 81.5557 37.2349C81.1862 38.9042 80.6318 40.5271 79.8002 42.011C79.5693 42.5674 79.4307 42.892 79.2459 43.2629ZM87.8385 86.9432C87.7923 88.1488 87.7461 89.3544 87.6538 90.5137C87.5614 91.812 87.7923 93.064 87.8385 94.316C87.9309 96.449 88.0233 98.582 88.1619 100.715C88.3467 103.312 88.6239 105.908 88.5315 108.551C88.5315 108.691 88.5777 108.83 88.6239 109.015C89.0397 108.737 89.4092 108.459 89.825 108.227C90.8876 107.67 91.9039 107.068 93.0126 106.558C94.4447 105.955 95.8306 105.259 97.4475 105.213C98.7411 105.167 100.081 105.027 101.374 105.491C101.651 105.584 101.929 105.63 102.252 105.723C102.298 105.491 102.298 105.398 102.344 105.259C102.437 104.564 102.437 104.517 103.13 104.378C103.592 104.285 104.054 104.193 104.562 104.146C105.809 104.007 105.855 104.054 105.809 105.398C105.763 106.326 105.717 107.253 105.671 108.181C105.671 108.598 105.717 108.876 106.179 109.108C106.779 109.386 106.733 110.035 106.133 110.406C106.04 110.453 105.994 110.499 105.902 110.592V110.963C105.855 112.168 105.855 113.374 105.809 114.58C105.763 116.11 105.717 117.594 105.624 119.124C105.624 119.541 105.763 119.958 105.393 120.329C105.301 120.422 105.393 120.7 105.393 120.793C106.456 120.747 107.426 120.654 108.396 120.7C109.736 120.7 111.076 120.793 112.415 120.839C112.831 120.839 113.247 120.747 113.709 120.7C114.263 120.654 114.402 120.283 114.448 119.819C114.633 118.382 114.818 116.944 115.049 115.553C115.28 113.884 115.557 112.215 115.788 110.592C116.019 109.108 116.157 107.578 116.573 106.14C116.943 104.888 117.174 103.636 117.405 102.338C117.774 100.39 118.098 98.3965 118.421 96.449C118.606 95.4752 118.791 94.4551 118.929 93.4813C118.975 93.2495 118.975 93.0176 118.975 92.7394C118.467 92.7394 118.005 92.6931 117.589 92.7394C116.388 92.9713 115.141 93.1568 113.94 93.4813C112.646 93.8059 111.353 93.8059 110.013 93.8059C108.581 93.8059 107.103 93.7132 105.671 93.7132C104.654 93.7132 103.638 93.6204 102.622 93.3422C102.206 93.2495 101.836 93.064 101.42 93.064C99.7574 93.0176 98.2791 92.4148 96.8008 91.812C96.5698 91.7193 96.3388 91.6729 96.1078 91.5802C95.6921 91.4411 95.3225 91.2556 94.9067 91.0701C93.3822 90.3746 92.0425 89.3081 90.4718 88.7053C90.3332 88.6589 90.2408 88.5661 90.1022 88.4734C89.3168 87.917 88.6239 87.4533 87.8385 86.9432ZM99.4802 166.653C99.5264 166.421 99.5264 166.328 99.5264 166.189C99.7574 165.03 99.9884 163.871 99.9422 162.665C99.9422 162.155 100.035 161.691 100.035 161.181C100.035 160.254 99.9884 159.373 99.9884 158.445C99.9884 155.339 99.9884 152.185 100.035 149.079C100.081 147.224 100.081 145.323 100.219 143.468C100.358 141.659 100.589 139.897 100.82 138.089C100.959 137.069 101.19 136.049 101.374 135.029C101.605 133.869 101.882 132.757 102.113 131.597C102.206 131.18 102.252 130.809 102.252 130.392V127.424C102.252 123.436 102.206 119.448 102.206 115.461C102.206 114.348 102.252 113.188 102.298 112.076C102.298 111.566 102.252 111.473 101.79 111.38C101.42 111.334 101.005 111.287 100.635 111.334C99.7574 111.519 98.972 111.287 98.1867 111.009C97.8171 110.87 97.4475 110.824 97.078 110.638C96.0616 110.174 95.1839 110.406 94.3061 111.009C92.7816 112.029 91.4881 113.328 90.056 114.44C90.0098 114.487 89.9636 114.533 89.9174 114.626C90.3794 116.481 90.8876 118.336 91.3033 120.19C91.6267 121.628 91.9039 123.065 92.1349 124.503C92.5044 126.497 92.874 128.49 93.1512 130.438C93.336 131.597 93.4746 132.803 93.4746 133.962C93.4284 135.91 93.0588 137.857 92.5044 139.758C91.8115 142.123 91.3033 144.534 90.9799 146.992C90.8876 147.827 90.7028 148.661 90.7028 149.496C90.6104 151.443 90.8876 153.391 91.0723 155.292C91.2571 156.961 91.4881 158.631 91.7191 160.3C91.9963 162.062 92.2735 163.824 92.5968 165.54C92.6892 166.096 92.9202 166.653 93.105 167.302C94.4447 167.024 95.7382 166.838 96.9856 166.56C97.4475 166.467 97.8633 166.328 98.3253 166.421C98.6949 166.56 99.0644 166.606 99.4802 166.653ZM94.1213 15.8584C94.0289 17.0641 94.0751 17.7132 94.3985 18.1306C94.4447 18.0842 94.4909 18.0378 94.5371 17.9451C94.8143 17.2959 94.9529 16.5076 95.7382 16.1367C95.7844 16.1367 95.8306 16.0903 95.8306 16.0439C96.0154 15.302 96.5236 14.6992 96.5698 13.9109C96.616 13.4472 96.7084 13.3545 97.309 13.3081C97.4014 14.2819 97.1242 15.1629 96.8008 15.9976C96.4312 16.8322 96.0616 17.6669 95.6921 18.5015C95.6459 18.6406 95.5997 18.8261 95.5535 19.0116C96.8932 18.8261 97.9557 17.9451 99.2954 17.9451C99.3878 18.4551 99.1106 18.687 98.7411 18.8261C97.6323 19.1971 96.6622 19.7535 95.4611 19.8926C95.1377 19.939 94.8605 19.9853 94.5371 20.0317C94.4447 20.5418 94.8605 20.82 94.9991 21.2373C95.1377 21.701 95.5073 21.8865 95.923 21.8401C96.4312 21.7938 96.9856 21.7938 97.4475 21.6083C98.4177 21.2837 99.3878 20.82 100.358 20.4027C100.543 20.3099 100.728 20.1708 100.912 20.0781C101.051 20.0317 101.328 20.0317 101.374 20.0781C101.467 20.2172 101.467 20.449 101.42 20.5882C101.328 20.82 101.097 21.0055 101.005 21.2373C100.45 22.3966 99.4802 23.0457 98.2329 23.3703C97.5861 23.5558 96.9394 23.6486 96.2926 23.834C96.1078 23.8804 95.923 23.9731 95.6921 24.0195C95.7845 24.3441 95.8768 24.6223 95.9692 24.9005C96.1078 25.2715 96.2926 25.6425 96.4774 26.0134C97.2628 27.2654 97.6785 27.59 99.4802 27.3118C100.45 27.1727 101.282 26.709 102.021 26.0134C102.899 25.2251 104.008 24.9933 105.116 24.7614C105.301 24.7151 105.578 24.8542 105.717 24.9933C105.902 25.2251 105.809 25.5033 105.624 25.7352C105.44 25.9207 105.209 26.1061 104.978 26.2453C103.915 26.9408 102.668 27.2654 101.467 27.6827C100.959 27.8218 100.497 28.0073 100.081 28.1464C100.358 28.471 100.635 28.7492 100.774 29.0738C101.051 29.6766 101.467 30.0939 101.975 30.4649C102.991 31.1604 103.915 31.9024 105.07 32.3661C105.532 32.5515 105.948 32.6443 106.364 32.4124C107.288 31.9487 108.165 31.4387 109.043 30.9286C109.32 30.7431 109.597 30.4649 109.782 30.1867C110.152 29.5839 110.475 28.9347 110.799 28.2855C110.891 28.0537 110.983 27.8218 110.845 27.5436C110.66 27.59 110.475 27.6364 110.29 27.6827C110.059 27.7291 109.875 27.7755 109.644 27.7755C109.135 27.8218 108.951 27.7291 108.812 27.219C108.72 26.8481 108.627 26.5235 108.627 26.1525C108.581 24.205 108.535 22.2111 108.535 20.2636C108.535 19.939 108.673 19.568 108.858 19.3362C109.459 18.5943 109.967 17.8523 110.198 16.9249C110.383 16.0903 110.568 15.302 110.706 14.4674C110.752 14.2355 110.706 13.9573 110.706 13.7254H110.521C109.875 14.4674 109.043 14.6065 108.165 14.7919C107.888 14.8383 107.565 14.9774 107.426 14.6065C107.288 14.2819 107.519 14.05 107.703 13.8645C107.842 13.7718 107.98 13.6327 108.073 13.54C108.258 13.3081 108.489 13.1226 108.581 12.8444C108.858 12.3343 109.228 11.9634 109.782 11.8243C110.059 11.7779 110.198 11.6388 110.244 11.3606C110.337 10.7578 110.568 10.155 110.568 9.50579C110.614 7.41916 110.568 7.41915 109.459 5.70348C108.489 4.17327 107.241 2.92129 105.532 2.27212C104.978 2.04027 104.423 1.85479 103.823 1.76205C103.13 1.66931 102.437 1.66931 101.744 1.66931C101.42 1.66931 101.051 1.66931 100.774 1.76205C100.035 1.9939 99.3416 2.27212 98.6487 2.5967C97.0318 3.38499 95.7382 4.54423 95.0453 6.30628C94.3985 8.02196 94.1676 9.83038 94.0752 11.6388C94.0752 11.7315 94.1213 11.8243 94.1213 11.917M121.978 60.0951C122.486 59.956 122.856 59.8633 123.272 59.7242C124.242 59.3532 125.212 59.075 126.275 59.075C126.459 59.075 126.69 59.075 126.829 59.0286C127.845 58.6577 128.862 59.0286 129.878 59.1678C130.017 59.1678 130.155 59.3532 130.247 59.446C130.109 59.5851 130.017 59.7706 129.878 59.8169C129.277 59.9097 128.677 60.0488 128.122 60.0488C127.568 60.0488 127.014 60.1879 126.552 60.4197C126.275 60.5588 125.951 60.698 125.628 60.8371C124.981 61.208 124.334 61.5326 123.688 61.9036C123.503 61.9963 123.226 62.1818 123.41 62.46C123.595 62.7846 123.826 62.46 124.057 62.4136C124.935 62.1818 125.813 61.8572 126.69 61.8108C127.614 61.7645 128.538 61.9499 129.462 62.089C129.739 62.1354 130.155 62.089 130.201 62.5064C130.247 62.9237 129.878 62.9701 129.601 63.1555C129.046 63.4801 128.954 63.712 129.324 64.2684C129.647 64.7321 129.739 65.1958 129.647 65.7523C129.416 66.8187 129.924 67.7462 130.617 68.3953C131.31 69.0909 132.28 69.5546 133.158 70.1574C134.128 68.9054 134.451 67.5607 134.544 66.1232C134.544 66.0768 134.498 65.9841 134.498 65.8914C134.451 65.3349 134.359 64.7321 134.405 64.1757C134.405 63.5729 134.544 62.9701 134.636 62.3673C134.729 61.6717 134.682 61.0689 134.359 60.4197C133.989 59.7242 133.527 59.075 133.389 58.2867C133.019 56.2001 132.326 54.1598 131.356 52.2587C130.94 51.4704 130.478 50.7285 130.063 49.9402C129.277 50.172 128.584 50.3575 128.076 50.8676C127.614 51.2849 127.198 51.3313 126.644 51.1458C126.182 51.0067 125.72 50.9139 125.258 50.8212C125.12 51.2849 124.889 51.6559 125.027 52.1196C126.321 51.7486 127.614 51.7486 129.046 52.2123C128.769 52.3978 128.677 52.4441 128.538 52.4905C127.938 52.6296 127.337 52.7687 126.737 52.9078C126.136 53.0933 125.489 53.2788 124.889 53.5107C124.704 53.557 124.565 53.7889 124.473 53.928C124.196 54.438 124.057 54.4844 123.503 54.3917C123.318 54.3453 123.179 54.2989 122.995 54.2526C122.579 54.1598 122.533 54.2062 122.579 54.809C123.087 54.7626 123.595 54.8554 124.057 54.6699C125.166 54.2062 126.321 54.1135 127.476 53.7889C128.122 53.6034 128.723 53.8352 129.37 54.0671C129.185 54.4844 128.862 54.4844 128.584 54.5772C127.891 54.809 127.152 54.9945 126.459 55.2263C125.351 55.5973 124.242 55.9219 123.179 56.4319C122.81 56.6174 122.394 56.7102 122.024 56.8493C121.701 56.942 121.562 57.1739 121.47 57.5912C122.948 57.2666 124.334 56.9884 125.72 56.6638C126.136 56.5711 126.598 56.6174 126.968 56.4783C127.799 56.1537 128.584 56.4319 129.37 56.5711C129.508 56.5711 129.601 56.7102 129.786 56.8029C129.601 56.942 129.508 57.0347 129.416 57.0811C129.046 57.1739 128.677 57.2202 128.307 57.313C127.429 57.4984 126.506 57.5912 125.674 57.9158C124.658 58.2867 123.688 58.7504 122.717 59.2141C122.302 59.446 121.978 59.5387 121.978 60.0951ZM102.714 195.124C102.529 194.753 102.391 194.335 102.252 193.965C101.744 192.666 101.236 191.368 100.681 190.116C100.404 189.42 100.127 188.771 99.8036 188.076C99.5726 187.519 99.3416 186.963 99.1106 186.406C99.0182 186.128 98.972 185.757 98.7411 185.572C98.2791 185.062 97.7709 184.505 97.1704 184.227C96.154 183.717 95.4611 183.949 95.1839 185.062C95.1377 185.201 95.0915 185.34 95.1377 185.479C95.2763 186.453 94.8143 187.055 93.9828 187.473C93.8904 187.519 93.8442 187.612 93.7518 187.612C93.3822 187.797 93.2436 188.122 93.2436 188.586C93.2898 190.116 93.336 191.6 93.2436 193.13C93.1512 194.567 93.336 195.958 93.8904 197.303C94.0289 197.674 94.1676 197.999 94.3061 198.37C94.5833 198.972 95.1377 199.158 95.6459 198.741C95.8306 198.601 96.0154 198.416 96.154 198.231C97.1242 197.257 98.0943 196.283 99.3416 195.68C100.404 195.17 101.42 194.614 102.714 195.124ZM85.9907 162.526C85.6673 162.619 85.2977 162.711 84.9743 162.804C84.0966 162.943 83.958 163.082 83.9118 163.917C83.7732 165.494 83.9118 167.024 84.5123 168.508C84.6971 168.971 84.8819 169.389 85.0667 169.852C85.8983 171.893 86.5912 173.979 86.3602 176.251C86.314 176.483 86.314 176.669 86.314 176.9C86.2678 178.709 86.1292 180.517 86.6836 182.279C87.007 183.253 87.4228 184.134 87.7923 185.108C88.2081 186.221 88.9011 187.102 89.8712 187.797C90.287 188.076 90.7028 188.261 91.1185 187.983C91.5343 187.705 91.9501 187.426 92.3197 187.102C92.5044 186.963 92.643 186.777 92.4583 186.545C92.0887 186.731 91.7653 186.916 91.2571 187.195C91.3033 186.777 91.3033 186.499 91.3033 186.221C91.3495 185.664 91.4419 185.154 91.5343 184.598C91.5343 184.459 91.5343 184.366 91.5805 184.227C91.9039 183.16 91.8577 182.048 91.6267 180.935C91.4881 180.239 91.3033 179.59 91.1647 178.894C90.8875 177.55 90.518 176.205 90.5642 174.767C90.5642 173.794 90.3794 172.82 90.287 171.753C89.7326 171.985 89.2707 172.171 88.8087 172.403C88.4391 172.588 88.0695 172.588 87.6999 172.449C86.545 172.078 85.8983 171.197 85.4363 170.177C84.8819 168.971 84.9281 167.627 85.1129 166.328C85.2977 165.03 85.7135 163.824 85.9907 162.526ZM82.3873 74.4234C83.1726 73.9597 83.958 73.8206 84.7433 73.9133C84.9281 73.9133 85.1129 74.1452 85.2515 74.2379C85.5749 74.5161 85.8983 74.8407 86.2216 75.0726C86.776 75.4435 87.238 75.8608 87.5614 76.4173C87.6537 76.6028 87.7923 76.7419 87.9309 76.9274C88.4391 76.1391 88.3005 75.4899 87.7923 74.8407C87.0532 73.867 86.0369 73.2178 85.0667 72.5222C84.6047 72.1513 84.0966 72.0585 83.5422 72.0122C82.7107 71.9658 81.9253 71.873 81.14 71.7803C80.5394 71.7339 80.4008 71.5948 80.2622 70.992C79.8002 69.0445 79.6155 67.0042 79.5231 65.0103C79.4307 62.9237 79.3383 60.8371 79.1997 58.7504C79.1535 57.8694 79.0149 56.9884 78.9225 56.061C77.4442 55.69 75.9659 55.3191 74.5338 54.9481C74.3028 55.4118 74.2566 55.7828 74.349 56.2001C74.9033 58.3795 75.4577 60.5588 76.0583 62.7382C76.1969 63.2019 76.3355 63.712 76.5202 64.1757C76.936 65.2422 77.398 66.2623 77.7676 67.3288C78.0909 68.1635 78.3219 68.9981 78.5991 69.8792C79.2459 71.9658 79.8464 74.0988 80.4932 76.2318C81.3247 75.5826 82.2025 75.9072 83.0802 76.4173C83.8194 76.8346 84.5585 77.1592 85.2977 77.5765C85.4363 77.6229 85.5749 77.6693 85.8059 77.7156C85.4363 76.881 84.9281 76.3245 84.189 75.9536C83.727 75.7217 83.3112 75.4435 82.9416 75.1189C82.7569 74.8871 82.6183 74.6552 82.3873 74.4234ZM93.798 184.181C94.5833 183.624 95.3225 183.068 96.1078 182.511C96.616 182.14 97.1242 181.908 97.7709 181.955C97.8633 181.955 98.0019 181.908 98.1405 181.862C97.8171 177.781 98.3715 173.747 98.5563 169.713C96.4774 169.899 94.4909 170.084 92.5506 170.919C92.5506 171.151 92.5968 171.429 92.5968 171.661C92.6892 172.542 92.7816 173.469 92.9202 174.35C92.9664 174.767 93.0126 175.138 93.105 175.556C93.5208 177.411 93.8904 179.265 93.8442 181.166C93.8442 182.233 93.798 183.16 93.798 184.181ZM84.7433 70.8529C84.8357 70.482 84.9743 70.2037 85.0205 69.9719C85.5287 68.0244 86.0368 66.0768 86.545 64.1293C86.8222 62.9701 87.0532 61.8108 86.8222 60.5588C86.4064 58.3795 85.9907 56.2465 85.5287 54.0671C85.4363 53.5106 85.2977 52.9542 85.1129 52.2587C84.1428 53.7889 83.1726 55.0409 81.5557 55.8755C81.8329 55.9682 81.9715 56.0146 82.0639 56.1074C82.2025 56.2465 82.3873 56.3856 82.4335 56.5711C82.5721 58.0085 82.7569 59.4923 82.8492 60.9298C82.9416 62.4136 82.7569 63.8975 82.9878 65.3813C83.0802 66.0305 83.0802 66.6796 83.1726 67.3288C83.3112 68.4881 83.496 69.6009 83.6808 70.7602C84.0504 70.7138 84.3738 70.7602 84.7433 70.8529ZM112 124.132C111.953 124.085 111.907 124.039 111.861 123.946C109.828 124.827 107.703 124.827 105.578 124.41C105.532 124.549 105.486 124.595 105.486 124.642V125.013C105.624 127.702 105.532 130.299 104.978 132.942C104.562 134.936 104.285 136.93 103.961 138.97C103.915 139.248 103.915 139.573 103.869 139.851C103.915 139.851 103.961 139.897 104.008 139.897C104.1 139.712 104.192 139.48 104.239 139.248C104.47 138.692 104.608 138.089 104.885 137.579C105.948 135.724 107.103 133.962 108.211 132.107C108.72 131.226 109.182 130.299 109.597 129.372C109.967 128.63 110.244 127.841 110.614 127.099C111.076 126.126 111.538 125.105 112 124.132ZM76.8898 46.8798C75.9659 49.0128 74.8572 52.8151 74.811 53.8816C75.6887 54.1135 76.5664 54.3453 77.4442 54.5308C77.5828 54.5772 77.8138 54.4844 77.9524 54.3917C79.1535 53.3715 80.2622 52.2123 81.1862 50.9139C81.2324 50.8212 81.2785 50.7285 81.3247 50.6357C79.8464 49.3837 78.4143 48.1318 76.8898 46.8798ZM96.8008 199.019C97.4937 199.204 98.0943 199.065 98.6949 198.972C99.665 198.787 100.635 198.601 101.605 198.741C101.79 198.787 102.021 198.694 102.206 198.694C102.206 198.601 102.206 198.509 102.16 198.509C101.374 197.535 100.127 197.21 98.972 197.674C98.6949 197.767 98.3715 197.906 98.1405 198.045C97.6785 198.277 97.1704 198.462 96.8008 199.019ZM85.8521 79.2922V79.1067C83.9118 78.7358 81.9715 78.2721 80.3546 76.9274C80.4932 77.762 80.216 78.6894 80.8628 79.3849C81.14 79.2458 81.3709 79.1067 81.6019 79.014C81.8329 78.9212 82.1101 78.7821 82.3411 78.7821C83.034 78.7821 83.7732 78.5967 84.2352 79.2922C84.3276 79.3849 84.5123 79.4313 84.6971 79.4313C85.0205 79.4313 85.2977 79.4313 85.6211 79.3849C85.7135 79.4777 85.8059 79.3386 85.8521 79.2922ZM89.3168 169.852C89.2245 169.342 89.1321 168.878 89.0397 168.368C88.8549 166.885 88.6701 165.354 88.4853 163.871C88.4391 163.685 88.4853 163.407 88.1619 163.175C88.1157 164.612 88.0233 165.911 88.1157 167.256C88.1619 168.229 88.3467 169.203 89.3168 169.852ZM81.6481 80.0805C81.6019 80.1269 81.6019 80.1732 81.5557 80.266C81.7405 80.4051 81.9715 80.4978 82.1563 80.6369C82.2025 80.5906 82.2025 80.5442 82.2487 80.4978C82.0639 80.3587 81.8791 80.2196 81.6481 80.0805ZM82.9878 80.9615C82.9878 81.0079 82.9416 81.1006 82.9878 81.1006C83.1264 81.147 83.265 81.2397 83.4498 81.2861C83.4498 81.2397 83.496 81.1934 83.496 81.147C83.3112 81.0543 83.1726 81.0079 82.9878 80.9615Z" fill="black"/>
<path d="M63.5848 80.2195C63.4 79.3848 62.9843 78.5965 62.6147 77.8546C61.9679 76.5563 61.3212 75.2116 60.6744 73.9132C60.0276 72.6612 59.2885 71.4092 58.5955 70.1573C57.995 69.0908 57.3482 68.0706 56.9324 66.9114C56.5629 65.7521 56.1009 64.6393 55.6389 63.5728C55.3155 62.8772 54.8998 62.1817 54.484 61.4861C54.4378 61.4398 54.3916 61.347 54.3454 61.3006C53.6986 60.8833 53.4677 60.1878 53.3753 59.4459C53.2829 58.7039 53.2367 57.962 53.0981 57.2201C52.8671 56.0145 52.5899 54.7625 52.3127 53.5569C52.1741 53.0005 51.9431 52.5831 51.3426 52.4904C51.1116 52.444 50.9268 52.3049 50.6958 52.2122C50.2801 52.0267 49.8643 51.7949 49.4485 51.7021C48.8017 51.6094 48.1088 51.6557 47.462 51.934C47.1386 52.0731 46.7691 52.2586 46.5843 52.4904C46.3995 52.7686 46.4457 53.1859 46.3995 53.5569C46.1223 53.696 45.7065 53.8351 45.4756 54.067C45.2908 54.3452 45.337 54.7625 45.2446 55.1335C44.9674 54.9944 44.6902 54.8089 44.413 54.7625C43.7663 54.7161 43.3043 54.4379 42.9347 53.9279C42.5651 53.4642 42.057 53.2323 41.4102 53.3714C40.7634 53.5569 40.1167 53.2787 39.4237 52.9541C39.6085 52.8614 39.7471 52.815 39.8857 52.7686C40.3939 52.6759 40.8558 52.5831 41.364 52.444C42.5189 52.1658 42.8423 51.7485 42.8885 50.5429V49.0127C42.9501 48.3635 42.6575 47.9925 42.0108 47.8998C41.9184 47.8998 41.7798 47.8534 41.6412 47.7607C41.7798 47.5752 41.8722 47.4361 42.0108 47.297C41.9184 47.1579 41.826 47.0188 41.7336 46.8797C41.826 46.8797 42.0108 46.926 42.057 46.8797C42.4265 46.5087 42.5651 46.0914 42.5651 45.5813V44.8394C43.0733 44.6539 43.4891 44.5148 43.9048 44.3293C44.0896 44.2366 44.2744 44.0047 44.2744 43.8656C44.2744 43.4483 44.182 43.031 44.0434 42.7064C43.8125 42.1963 43.5353 41.6399 43.1657 41.2689C42.6113 40.6661 42.5189 39.9706 42.3803 39.2287C42.1494 37.9303 42.0108 36.632 41.8722 35.3336C41.826 34.7308 41.6874 34.0816 41.8722 33.5716C42.0108 33.1079 42.1032 32.6905 41.9646 32.2732C41.7798 31.6704 41.6412 31.0676 41.3178 30.5112C40.9482 29.8156 40.5325 29.0737 39.7933 28.7027C37.7606 27.6826 35.6356 27.2653 33.4181 27.9145C33.0485 28.0072 32.6328 28.1463 32.217 28.0999C31.3854 28.0999 30.5539 28.239 29.7223 28.4709C29.1218 28.61 28.5212 28.7491 27.9206 28.8882C27.4125 28.981 26.9043 29.0737 26.4885 29.2592C25.5184 29.7229 24.5483 30.2329 23.5781 30.7894C23.1161 31.0676 22.608 31.3458 22.2384 31.7168C21.5916 32.4123 21.0373 33.1542 20.4367 33.8498C20.2057 34.128 19.9747 34.4062 19.6976 34.5917C19.1432 35.0554 18.6812 35.6118 18.4964 36.261C18.2192 37.142 17.8035 37.9303 17.2953 38.7186C16.9257 39.275 16.6947 39.8778 16.8795 40.3415C16.6023 40.7589 16.3714 41.0371 16.1404 41.3617C15.4936 42.15 14.7083 42.6137 13.6457 42.5209C12.1212 42.3818 10.6891 44.3293 11.4745 46.045C11.6131 46.3232 11.6131 46.5551 11.5669 46.8333C11.5207 47.3897 11.3821 47.9925 11.4283 48.549C11.5207 50.0328 11.9826 51.4239 12.768 52.6759C13.1376 53.2323 13.4147 53.7888 13.5533 54.4379C13.6457 54.8089 13.7843 55.1335 13.8767 55.4581C14.1539 56.3391 14.5235 57.1737 15.0778 57.8693C15.5398 58.5185 15.6322 58.5185 16.4176 58.1011C16.279 57.6838 16.0942 57.3129 15.9556 56.8955C17.6649 58.2402 18.4964 58.4257 19.2356 57.7302C17.9421 56.9419 16.2328 54.6234 16.0942 53.5105C16.7409 54.4379 17.3877 55.3653 18.0345 56.2463C18.3116 56.6173 18.635 56.9419 18.9584 57.2201C19.2818 57.4983 19.6052 57.6838 20.0671 57.4983C20.3905 57.3592 20.7139 57.4056 21.0373 57.6374C20.7601 58.1475 20.2981 58.1475 19.8361 58.1939C17.9421 58.4721 16.0018 58.7503 14.2001 59.4922C13.5995 59.7241 12.999 60.0487 12.3984 60.4196C10.9663 61.347 9.58038 62.4135 8.56405 63.851C8.42546 64.0828 8.19447 64.2219 8.05588 64.4538C6.90095 65.7058 5.79222 66.9577 5.14546 68.5343C4.96067 68.9053 4.72968 69.2299 4.4987 69.6008C3.99053 70.3891 3.66715 71.2701 3.52856 72.1975C3.38997 73.4031 3.34377 74.5624 3.20518 75.768C3.11279 76.4172 3.11279 76.9736 3.89814 77.2518C3.34377 78.782 2.78941 80.3122 2.23504 81.7961C1.95786 82.5843 1.72687 83.3263 1.72687 84.1609C1.72687 86.6185 1.72687 89.1225 1.77307 91.5801C1.81927 93.5276 1.86546 95.4751 1.91166 97.4227C1.91166 97.8864 1.86546 98.3964 1.86546 98.8601C1.86546 100.019 1.86546 101.179 1.91166 102.291C1.91166 102.523 2.00406 102.755 2.09645 102.987C2.46603 103.636 2.37363 104.193 2.00406 104.842C1.44969 105.816 0.895324 106.789 0.294761 107.763C-0.074816 108.366 -0.121013 108.922 0.294761 109.525C0.618141 110.035 1.08011 110.267 1.58828 110.545C2.60462 111.055 3.66715 111.194 4.77588 111.287C5.37644 111.334 5.93081 111.241 6.39278 110.87C6.90095 110.499 7.50151 110.406 8.05588 110.313C9.02602 110.082 9.71898 109.525 8.97982 108.505C8.93363 108.412 8.88743 108.32 8.84123 108.273C8.51785 107.902 8.42546 107.439 8.37926 106.975C8.47165 106.928 8.51785 106.882 8.56405 106.836C9.53419 106.187 9.62658 105.908 9.39559 104.795C9.257 104.054 9.16461 103.265 9.02602 102.523C8.93362 101.967 8.79503 101.364 8.28687 100.993C7.7787 100.622 7.82489 100.251 7.91729 99.7411C8.14827 98.7674 8.37926 97.7936 8.61024 96.7735C8.74884 96.1243 8.88743 95.5215 9.02602 94.8723C9.90376 91.8119 10.7815 88.7515 11.6131 85.6447C12.1212 83.8827 12.6294 82.0743 13.1376 80.3122C13.1838 80.0804 13.3685 79.8022 13.5533 79.6631C13.8305 79.4776 14.1539 79.3848 14.5235 79.1994C14.5697 79.2921 14.5697 79.4312 14.6159 79.5239C14.7083 80.4977 14.8007 81.4251 14.8931 82.3989C15.124 85.4593 14.8931 88.4733 14.9392 91.5337C14.9854 94.6405 14.6621 97.6545 13.7843 100.622C13.4147 101.874 13.1376 103.126 12.9066 104.424C12.2598 107.439 11.7516 110.453 10.8739 113.42C10.7815 113.745 10.7815 114.069 11.0587 114.208C11.5207 114.44 11.6131 114.904 11.9364 115.136C11.844 115.6 11.7516 116.017 11.7516 116.434C11.7516 116.898 11.7978 117.408 11.7978 117.872C11.7516 120.561 12.1674 123.158 12.6294 125.801C12.768 126.589 12.999 127.331 13.2762 128.073C13.7843 129.464 14.3387 130.809 14.8931 132.154C15.5398 133.637 16.2328 135.121 16.9257 136.605C17.5725 137.996 18.2654 139.434 19.0046 140.778C19.7899 142.216 20.3443 143.792 21.4992 145.044C21.7764 145.369 21.915 145.786 22.146 146.157C22.3308 146.528 22.5156 146.899 22.7466 147.224C23.3933 148.105 23.4857 149.079 23.3009 150.099C23.2085 150.516 23.1161 150.887 23.0237 151.304C22.7466 152.788 22.5618 154.226 22.2846 155.709C21.7764 158.306 21.5454 160.903 21.3145 163.499C21.0835 166.56 20.8987 169.574 20.7139 172.634C20.5753 174.535 20.4829 176.437 20.3443 178.291C20.2981 178.941 20.2519 179.636 20.1595 180.285C20.1133 180.471 19.9747 180.749 19.8361 180.888C19.2818 181.259 18.9584 181.816 18.6812 182.418C18.5426 182.743 18.404 183.068 18.2192 183.392C18.1269 183.531 17.9883 183.717 17.8035 183.763C17.1567 183.856 16.7871 184.32 16.4176 184.737C16.1404 185.061 15.9094 185.479 15.6322 185.757C14.9854 186.36 14.6621 187.148 14.5697 187.983C14.4773 188.91 14.2925 189.791 14.1077 190.672C13.9691 191.46 13.8767 192.249 13.7843 193.037C13.7843 193.13 13.7843 193.315 13.7381 193.408C13.4609 193.872 13.2762 194.335 12.9066 194.753C12.6294 195.077 12.6756 195.309 12.9066 195.541C13.3224 196.005 13.7843 196.422 14.4311 196.561C14.7545 196.654 15.0778 196.7 15.4012 196.886C16.2328 197.349 17.1105 197.581 18.0807 197.628C18.0345 198.601 17.8959 199.482 18.0345 200.271C18.2192 201.523 18.8198 202.589 20.2519 202.867C20.4367 202.914 20.6215 203.007 20.8063 203.053C21.5454 203.285 22.2846 203.656 23.0237 203.656C24.4559 203.609 25.888 203.424 27.2739 203.192C27.8282 203.099 28.3826 202.867 28.8908 202.636C29.0756 202.589 29.2604 202.45 29.3066 202.265C29.3528 202.125 29.2142 201.94 29.168 201.894C29.3066 201.569 29.5375 201.291 29.5837 201.013C29.6299 200.503 29.7223 199.946 29.6299 199.436C29.2604 197.21 28.3364 195.17 27.1815 193.269C26.9505 192.852 26.7657 192.481 26.8119 191.97C26.9505 190.44 26.8119 188.956 26.4885 187.473C26.3961 186.963 26.3499 186.499 26.3037 185.989C26.7349 185.742 26.9967 185.371 27.0891 184.876C27.1353 184.69 27.1815 184.505 27.1815 184.319C27.2739 183.438 27.4587 182.511 27.1353 181.584C26.8119 181.537 26.5347 181.537 26.1652 181.491C26.4423 181.166 26.6733 180.934 26.9043 180.656C27.0891 180.424 27.2739 180.146 27.4125 179.868C27.782 179.172 28.0592 178.431 28.3826 177.689C28.9832 176.39 29.6299 175.138 30.2305 173.886C31.2006 171.8 32.1246 169.62 33.1871 167.58C34.2496 165.54 34.9426 163.407 35.4508 161.135C35.7742 159.697 36.0513 158.213 36.5133 156.776C37.2063 154.597 37.9454 152.464 38.7308 150.33C39.2851 148.893 39.9781 147.502 40.5787 146.018C41.2716 144.349 41.8722 142.587 42.5651 140.917C43.1195 139.573 43.4891 138.135 44.7364 137.208C44.8288 137.161 44.9212 137.022 44.9674 136.93C45.4755 136.002 46.0761 135.075 46.4919 134.101C47.231 132.478 47.7392 130.762 48.0626 129C48.1088 128.629 48.2012 128.305 48.2474 127.934C48.5708 126.357 48.9865 124.827 49.1713 123.297C49.3099 122.277 49.5871 121.674 50.6034 121.442C51.1116 121.349 51.5274 120.978 51.666 120.468C51.9431 119.541 52.2665 118.614 52.3589 117.686C52.4513 116.527 52.3589 115.368 52.3589 114.255C52.4051 111.194 51.7584 108.18 51.435 105.166C51.204 102.987 50.973 100.808 50.7882 98.6746C50.6496 97.0981 50.5572 95.5679 50.3724 93.9913C50.28 93.1103 50.0491 92.2756 50.0491 91.441C50.0029 89.4934 49.9567 87.5459 50.0029 85.5984C50.0491 84.4855 50.2339 83.3726 50.3263 82.2598C50.3724 81.7961 50.4186 81.3324 50.4648 80.915C50.511 80.4513 50.6034 79.9413 50.6496 79.4312C50.7882 79.4776 50.8344 79.4776 50.8806 79.5239C50.973 79.7094 51.0654 79.8485 51.1578 80.034C51.9893 81.6106 53.0057 83.0017 54.4378 84.0218C54.946 84.3928 55.4541 84.7174 55.8699 85.1347C56.6091 85.923 57.3944 86.6649 58.4107 87.0822C59.1961 87.4068 59.9352 87.9632 60.7668 87.1286C60.8592 87.0358 61.0902 86.9895 61.2288 86.9431C61.5059 86.8504 61.8293 86.7576 62.1527 86.7113C62.7995 86.6185 63.0305 86.2476 63.169 85.6911C63.3538 84.5782 63.6772 83.5117 63.8158 82.3989C63.7234 81.7497 63.7696 80.9614 63.5848 80.2195ZM17.5263 43.5874C17.5263 43.8193 17.5263 43.9584 17.5725 44.0511H17.1567C17.2953 43.8656 17.3877 43.7729 17.5263 43.5874ZM17.3877 48.2244C17.3415 48.178 17.3415 48.0853 17.3415 48.0389C17.3415 47.9925 17.3877 47.9462 17.4339 47.8534C17.4801 47.9462 17.5263 47.9925 17.5263 48.0389C17.5263 48.1316 17.4339 48.178 17.3877 48.2244ZM17.2029 45.5813C17.0643 45.8595 16.6023 45.9986 16.1404 46.2769C16.2328 46.045 16.2328 45.9059 16.3252 45.8132C16.6485 45.3958 16.9719 45.0712 17.2953 44.6539C17.4339 44.4684 17.4801 44.283 17.5725 44.0511C17.7573 44.3293 17.9421 44.6075 18.173 44.9785C17.7111 45.1176 17.3877 45.164 17.2029 45.5813ZM51.3426 55.9218C51.3888 56.0609 51.435 56.2463 51.5274 56.4782C50.1415 56.5709 48.8941 57.1274 47.5544 57.5911C47.6006 57.1274 47.6468 56.7564 47.6468 56.4318C48.8479 56.2463 50.0491 56.1072 51.3426 55.9218ZM47.4158 58.4257C47.2772 58.4721 47.0924 58.4721 46.9077 58.3794C47.0462 58.333 47.1848 58.2402 47.3234 58.1939C47.924 58.0084 48.5708 57.8693 49.1713 57.5911C49.8181 57.3129 50.4186 57.3592 51.0654 57.6838C51.0192 58.0548 50.973 58.3794 50.9268 58.7503C50.742 58.6576 50.6034 58.6112 50.511 58.4721C50.1877 58.0548 49.6795 57.962 49.2175 58.0548C48.617 58.1939 48.0164 58.333 47.4158 58.4257ZM48.2012 58.9822C47.8778 59.2604 47.5544 59.4459 47.1386 59.4459C47.1386 59.3531 47.0925 59.2604 47.0925 59.214C47.462 59.1676 47.8316 59.0749 48.2012 58.9822ZM46.8153 55.9218C46.7229 55.5044 46.7691 55.3189 47.1386 55.3189C47.8316 55.2726 48.5246 55.1798 49.2637 55.3653C48.386 55.5508 47.6006 55.7363 46.8153 55.9218ZM48.155 52.3513C48.8017 52.3513 49.3099 52.6295 49.9567 53.0005C49.2175 53.2787 48.5708 53.3251 48.0164 52.9541C47.924 52.9077 47.7854 52.6759 47.7854 52.5831C47.8316 52.4904 48.0164 52.3513 48.155 52.3513ZM50.6034 53.1859C51.0192 53.6033 51.0654 54.067 51.0654 54.6234C49.6333 54.4843 48.2012 54.4379 46.7691 54.8553C46.7229 54.6234 46.6767 54.3916 46.5843 54.1597C47.924 53.7887 49.3561 54.0206 50.6034 53.1859ZM40.9482 47.2043C40.6711 47.2661 40.4709 47.127 40.3477 46.7869C40.8558 46.6014 41.2254 46.8797 41.6874 46.9724C41.4102 47.0188 41.1792 47.1115 40.9482 47.2043ZM40.5325 38.0694C40.9482 38.394 41.595 42.9846 41.9184 43.4483C41.3178 43.9584 40.3477 43.8656 39.9319 44.7467C40.3477 45.0712 40.8558 44.6075 41.2254 44.8858C41.3178 45.1949 41.3178 45.6122 41.2254 46.1377C40.6711 46.2769 40.1629 46.2305 39.6085 46.0914C39.1927 45.9523 38.777 45.9059 38.3612 45.8132C38.084 45.7668 37.8992 45.9523 37.853 46.2305C37.7606 46.7869 37.8068 47.2506 38.315 47.6216C39.0542 48.2244 39.2851 48.3171 40.8558 48.6417V51.8876C40.5787 51.9803 40.2553 52.1194 39.8857 52.1194C38.4536 52.3049 37.1601 52.8614 35.9589 53.6033C35.8204 53.696 35.6356 53.8351 35.5894 54.0206C35.4508 54.6698 35.3584 55.319 35.6356 55.9218C35.7742 56.2463 36.0051 56.4318 36.3285 56.3855C36.6519 56.3855 36.9291 56.3391 37.2063 56.3391C37.2525 56.4318 37.2987 56.4318 37.2987 56.4782C37.0677 58.4257 36.8829 60.3732 36.1437 62.1817C35.728 63.2018 35.1736 64.2219 34.5268 65.1493C33.9263 65.9376 33.0947 66.5404 32.3556 67.236C32.1708 67.4215 31.9398 67.4214 31.7088 67.2823C30.5077 66.5868 29.3066 65.8913 28.2902 64.9175C27.0891 63.7582 25.8418 62.5526 24.6406 61.347C24.1787 60.8833 23.7167 60.3732 23.3009 59.8632C22.9776 59.4459 22.6542 59.0749 22.0074 59.1676C22.1922 58.6112 22.3308 58.2402 22.9314 58.0548C23.3933 57.9157 23.8553 57.5911 24.2249 57.3128C24.6406 56.9419 24.964 56.4782 24.964 55.8754C24.964 55.4117 25.0102 54.9016 25.0102 54.4379C25.0102 53.6033 24.964 52.7686 24.964 51.8876C26.3499 51.0993 27.4587 50.0792 27.4587 48.2708C27.4587 47.9925 27.5049 47.7607 27.5049 47.4825C27.4125 46.8797 27.6897 46.4623 28.1054 46.0914C28.706 45.5813 28.706 45.3958 28.1516 44.793C27.7821 44.3757 27.4125 44.0047 27.0891 43.541C26.5347 42.7991 26.5809 41.9181 26.8119 41.0371C26.9043 40.5734 27.2739 40.3415 27.6897 40.0633C27.9668 40.3879 28.244 40.6661 28.5212 40.9443C28.7984 41.2689 29.168 41.4544 29.5837 41.5008C29.6299 41.5008 29.7223 41.5008 29.8147 41.5471C30.9235 42.0108 31.8012 41.5008 32.6328 40.8516C32.9099 40.6198 33.0947 40.2488 33.2795 39.9242C33.4643 39.646 33.5567 39.3214 33.7415 39.0432C33.8339 38.8577 34.0649 38.7186 34.2496 38.6722C34.8964 38.5795 35.266 38.1622 35.497 37.6057C35.728 37.0493 35.8666 36.4928 36.0051 35.89C36.0975 35.5655 36.2361 35.3336 36.5133 35.1018C36.9753 34.6844 37.4834 34.5917 38.0378 34.499C38.4998 34.4526 38.9618 34.2207 39.4237 34.0816C39.8395 35.1018 40.2091 36.0755 40.3015 37.142C40.6249 37.6057 41.3178 38.9504 41.0406 39.4605M23.3471 56.2C23.3933 56.2463 23.4395 56.3391 23.4857 56.3855C23.2547 56.6173 23.0237 56.8028 22.7466 57.081C22.608 56.8492 22.5156 56.71 22.377 56.4782C22.7466 56.3855 23.0237 56.2927 23.3471 56.2ZM23.2085 54.9944C23.4395 55.0407 23.5781 55.0871 23.7629 55.1335C23.7629 55.3653 23.7167 55.5508 23.7167 55.7826C23.6243 55.7363 23.5319 55.7363 23.4857 55.6899C23.3933 55.5044 23.3009 55.2726 23.2085 54.9944ZM26.3499 31.8095C26.8581 31.4385 27.3663 31.0676 27.9206 30.8357C29.4913 30.2793 31.1082 29.8156 32.8175 30.3257C32.9099 30.372 33.0485 30.4184 33.1409 30.4648C33.1871 30.4648 33.1871 30.5112 33.3257 30.6503H32.4942C31.4778 30.5112 30.4615 30.6503 29.4451 30.8821C29.3989 30.8821 29.3066 30.9285 29.2604 30.9749C29.2142 30.9749 29.2142 31.0676 29.1218 31.1603C29.3528 31.2994 29.5837 31.4385 29.9533 31.5777C29.4451 31.9022 28.9832 32.1805 28.5212 32.4123C28.013 32.6905 27.5511 32.876 27.0429 33.1542C26.4885 33.4324 25.9342 33.3861 25.3336 33.247C25.5646 32.6442 25.8418 32.1341 26.3499 31.8095ZM22.2846 36.8174C22.7004 35.9828 23.3009 35.4263 24.3173 35.4263C24.8716 35.4263 25.3798 35.2409 25.9342 35.1481C25.9342 35.1945 25.9804 35.1945 25.9804 35.2409C25.1026 36.0755 24.2249 36.9102 23.3471 37.7448C22.839 38.2085 22.3308 38.1622 21.7764 37.7448C21.915 37.4202 22.146 37.142 22.2846 36.8174ZM20.4367 44.6075C20.2057 44.1902 19.9285 43.8193 19.6976 43.4483C19.7899 42.7528 19.7899 42.0572 19.9285 41.408C20.0209 40.8516 20.2981 40.3415 20.4829 39.8315C22.0536 39.646 23.5319 39.4605 25.0564 39.3214C26.0728 39.2287 27.0429 38.9504 27.9206 38.4867C28.3826 38.2549 28.7984 37.8839 29.168 37.5594C29.5837 37.1884 29.9071 36.7247 30.2767 36.3537C31.2468 35.38 32.217 34.4062 33.5105 33.8961C33.9263 33.757 34.2497 33.4788 34.6192 33.247C34.804 33.1542 34.9888 33.0615 35.266 32.9224C34.5268 33.9425 33.8339 34.8699 33.1871 35.7509C33.0485 35.9828 32.8175 36.1219 32.9561 36.4465C33.0947 36.7711 33.3719 36.6783 33.6491 36.632C33.4643 37.5594 33.2333 37.7912 32.448 37.9767C32.1708 38.023 31.8936 38.2085 31.755 38.394C31.4316 38.765 31.2006 39.1823 30.9697 39.5996C30.7849 39.9706 30.5077 40.2952 30.0919 40.4343C29.3066 39.4141 28.1054 39.5069 26.9967 39.275C26.5347 39.1823 26.1652 39.3678 25.8418 39.6924C24.1787 41.1762 24.733 43.8656 26.119 44.7467C26.3499 44.8858 26.5809 45.1176 26.8581 45.3031C26.4885 45.5813 26.119 45.8132 25.7956 46.045C25.2874 46.3696 25.1488 46.7869 25.1488 47.3897C25.1488 48.2244 25.0102 49.059 24.6868 49.9401C24.4559 49.6618 24.2711 49.4764 24.1325 49.2445C23.2547 48.2244 22.377 47.2506 21.4992 46.2305C21.0373 45.7204 20.7601 45.164 20.4367 44.6075ZM9.21081 84.3C9.11841 84.4855 9.02602 84.671 8.97982 84.9028C8.47165 87.685 7.6863 90.4208 6.94715 93.1566C6.71616 94.084 6.57757 95.0578 6.39278 95.9852C6.30039 96.588 6.20799 97.1444 6.0694 97.7472C6.0694 97.7936 6.0694 97.84 6.02321 97.8863C5.88461 98.1646 5.74602 98.3964 5.65363 98.6746C5.60743 98.9529 5.65363 99.2311 5.65363 99.5093C5.60743 99.8339 5.51504 100.112 5.83842 100.344C5.93081 100.39 5.93081 100.669 5.88461 100.808C5.79222 101.271 5.97701 101.55 6.34658 101.828C6.90095 102.199 7.31672 102.662 7.50151 103.265C6.80855 103.59 6.20799 103.868 5.60743 104.193C5.37644 104.332 5.14546 104.656 5.05307 104.888C4.77588 105.723 4.68349 106.604 4.68349 107.531C4.68349 107.856 4.86828 108.041 5.19166 107.995C5.42264 107.995 5.65363 107.949 5.88461 107.856C6.62377 107.624 6.80855 107.717 7.03954 108.551C6.66996 108.922 6.0694 109.015 5.69982 109.572C6.34658 109.525 6.80855 109.386 7.31672 109.154C7.54771 109.015 7.54771 109.061 7.77869 109.34C7.50151 109.479 7.22433 109.572 6.99334 109.757C6.71616 109.989 6.39278 110.035 6.0694 110.035C4.77588 109.896 3.52856 109.572 2.41983 108.876C2.18884 108.737 2.00406 108.505 1.86546 108.32C1.54208 107.949 1.58828 107.531 1.81927 107.114C2.32743 106.279 2.78941 105.491 3.29757 104.656C3.62095 104.1 3.85194 103.497 3.94433 102.848C3.94433 102.802 3.94433 102.755 3.99053 102.709C4.17532 102.199 4.22152 101.689 4.17532 101.132C4.12912 100.298 4.26771 99.4629 4.31391 98.6283C4.36011 98.3037 4.40631 97.9791 4.40631 97.6081C4.4525 93.3885 4.4987 89.2152 4.54489 84.9956C4.54489 83.6972 4.77588 82.4916 5.23785 81.286C5.46884 80.6368 5.65363 79.9413 5.88461 79.2921C6.0694 78.7357 6.25419 78.1792 6.71616 77.6692C7.17813 77.9474 7.64011 78.1792 8.05588 78.4574C9.02602 79.153 10.2271 79.153 11.1973 79.7094C10.6891 81.3787 10.1348 82.9089 9.21081 84.3ZM7.13194 106.743C6.90095 106.836 6.71616 106.928 6.39278 107.114C6.43898 106.557 6.48517 106.187 6.57757 105.769C6.62377 105.769 6.66996 105.723 6.71616 105.723C6.80856 106.047 6.99335 106.372 7.13194 106.743ZM15.9094 122.88C15.4936 123.065 15.0778 123.251 14.6159 123.436C14.5235 122.88 14.3849 122.37 14.2925 121.859C14.0615 119.958 13.8767 118.057 13.6919 116.11C13.5533 114.811 13.7843 114.533 15.124 114.394C15.5398 114.348 15.9556 114.394 16.3252 114.394C17.4801 114.487 18.5888 114.626 19.7437 114.672C20.4829 114.719 21.1297 114.95 21.7302 115.46C22.7004 116.295 23.8091 116.898 25.0102 117.315C25.7956 117.593 26.5347 117.964 27.2739 118.428C27.6897 118.706 28.1054 118.845 28.5674 119.077C28.7984 119.17 29.0294 119.309 29.2142 119.495C28.7522 119.402 28.244 119.309 27.7821 119.216C26.9043 119.077 26.0266 119.263 25.195 119.541C23.5781 120.051 21.915 120.608 20.2981 121.164C19.1432 121.535 18.0345 121.906 16.8795 122.277C16.5562 122.416 16.2328 122.741 15.9094 122.88ZM20.3443 183.809C20.6677 183.299 21.0373 182.836 21.3145 182.326C21.4992 182.001 21.7302 181.769 22.0998 181.908C22.7928 182.094 23.4395 182.14 24.1325 182.047C24.3635 182.001 24.5944 182.094 24.8716 182.14C24.4559 183.16 24.733 184.18 24.7792 185.34C24.5021 185.201 24.4097 185.154 24.3173 185.061C23.7167 184.505 22.9776 184.273 22.1922 184.134C21.6378 184.041 21.1759 183.995 20.6677 184.319C20.4829 184.459 20.2057 184.459 19.9285 184.505C19.8823 184.459 19.8823 184.412 19.8361 184.366C20.0671 184.134 20.2057 183.995 20.3443 183.809ZM16.7871 191.878C16.9257 191.414 17.0643 190.95 16.9257 190.487C16.8795 190.394 16.9257 190.255 16.9257 190.116C17.0643 189.096 17.2491 188.075 17.3877 187.055C17.4801 186.499 17.7111 186.128 18.3116 186.035C18.635 185.942 18.9584 185.757 19.2818 185.664C19.4666 185.618 19.6976 185.618 19.9285 185.618C20.9911 185.618 22.0536 185.618 23.0699 185.664C23.5319 185.711 23.9939 185.85 24.5021 185.942C24.4559 186.221 24.4097 186.406 24.3635 186.545C23.9939 187.287 24.0863 188.029 24.0863 188.771C24.0401 190.533 23.9477 192.341 23.8553 194.104C23.8553 194.15 23.8091 194.196 23.7629 194.289C23.3471 193.872 22.9776 193.454 22.6542 193.037C22.377 192.712 22.0536 192.573 21.6378 192.62C20.5291 192.805 19.3742 192.805 18.404 193.408C18.173 193.547 17.8497 193.593 17.5725 193.64C16.9257 193.733 16.7871 193.686 16.7409 193.037C16.6023 192.666 16.6947 192.249 16.7871 191.878ZM19.6514 196.005C18.7274 195.634 17.7573 195.355 16.7409 195.263C16.6947 195.263 16.6023 195.216 16.4176 195.124C17.2029 195.031 17.8497 194.985 18.4964 194.799C19.097 194.614 19.6976 194.289 20.2519 194.057C20.8987 194.521 21.1759 195.077 21.2683 196.051C20.7601 196.237 20.1595 196.19 19.6514 196.005ZM24.5944 203.053C24.5944 203.022 24.5791 202.991 24.5483 202.96C25.1488 202.728 25.7032 202.543 26.3037 202.311C26.3037 202.311 26.3499 202.404 26.4885 202.543C25.8418 202.728 25.195 202.867 24.5944 203.053ZM27.0429 200.503C26.3961 200.642 25.7494 200.827 25.0564 200.966C24.3635 201.105 23.7629 201.384 23.2085 201.847C22.9314 201.755 22.7004 201.569 22.4232 201.523C21.3607 201.337 20.9911 200.549 20.8525 199.621C20.7601 198.926 20.7139 198.184 20.6677 197.396C21.4068 197.349 22.146 197.257 22.7928 197.72C23.2547 198.045 23.7629 197.906 24.2249 197.813C24.2711 197.813 24.3635 197.72 24.4097 197.674C24.5483 197.071 25.2412 197.025 25.5646 196.515C26.1651 197.396 26.9505 199.575 27.0429 200.503ZM34.3882 146.064C33.9725 147.27 33.7877 148.522 33.7877 149.82C33.7877 151.49 33.6491 153.159 33.0485 154.782C32.9561 155.107 32.8637 155.431 32.7713 155.756C32.217 157.564 31.7088 159.373 31.1544 161.181C30.7387 162.526 30.3229 163.824 29.9071 165.169C29.6761 165.864 29.5375 166.606 29.0756 167.209C29.0294 167.302 28.9832 167.395 28.937 167.487C28.5674 168.647 28.244 169.759 27.8744 170.919C27.7359 171.382 27.5049 171.8 27.3663 172.263C27.2277 172.634 26.9967 172.959 26.9043 173.33C26.5347 174.582 26.2113 175.88 25.8418 177.132C25.657 177.735 25.3798 178.338 25.1026 178.987C24.733 178.848 24.3635 178.709 24.0401 178.523C23.8553 178.431 23.7167 178.245 23.6705 178.06C23.5781 177.828 23.5319 177.55 23.4857 177.271C23.4395 176.019 23.3471 174.721 23.5781 173.469C23.9015 171.753 24.0401 170.038 24.0401 168.322C24.0401 166.606 24.0401 164.983 24.1325 163.268C24.2711 161.32 24.5021 159.373 24.6406 157.379C24.733 156.127 24.8254 154.875 25.0102 153.669C25.2412 152.185 25.5184 150.701 25.7956 149.218C25.9804 148.29 26.2113 147.363 26.2575 146.435C26.3037 145.786 26.119 145.091 25.9342 144.488C25.6108 143.421 25.2874 142.401 24.8716 141.335C24.5483 140.454 24.1325 139.619 23.6705 138.784C23.0237 137.579 22.2846 136.42 21.5454 135.26C20.8987 134.24 20.2519 133.22 19.559 132.2C19.4666 132.061 19.3742 131.922 19.328 131.783C18.7274 130.623 18.0807 129.464 17.5725 128.259C17.1105 127.146 16.6947 126.033 16.9719 124.642C17.8497 124.317 18.7736 123.993 19.6514 123.668C20.6677 123.343 21.684 123.019 22.7466 122.694C24.0401 122.277 25.2874 121.952 26.6271 121.813C27.3663 121.72 28.0592 121.952 28.706 122.277C29.0294 122.462 29.2142 122.787 29.3066 123.111C29.7223 124.41 30.0919 125.662 30.5077 126.96C31.4778 130.067 32.4942 133.174 33.4643 136.28C33.8339 137.393 34.2035 138.46 34.3882 139.619C34.8964 141.706 35.0812 143.931 34.3882 146.064ZM38.9156 143.514C38.9156 143.468 38.8694 143.468 38.8694 143.468C38.9618 142.077 39.008 140.686 39.1003 139.155C39.7009 138.831 40.4863 138.97 41.3178 138.738C40.4863 140.407 39.7009 141.984 38.9156 143.514ZM46.4457 123.714C46.3071 124.224 46.1685 124.688 46.0299 125.152C45.7989 126.265 45.4755 127.331 44.9674 128.351C44.3668 129.65 43.8125 130.948 43.2119 132.2C42.9809 132.71 42.7037 133.22 42.4265 133.73C42.2418 134.055 42.0108 134.379 41.9184 134.75C41.6412 135.585 41.0868 136.188 40.5325 136.837C40.3477 137.069 40.1167 137.161 39.8395 137.115H38.3612C38.315 137.069 38.2226 136.93 38.1764 136.744C37.7606 135.585 37.3449 134.379 36.9291 133.22C36.2361 131.041 35.5894 128.861 34.8502 126.728C34.2958 125.013 33.6029 123.343 32.9561 121.674C32.9099 121.581 32.9099 121.489 32.8175 121.21C34.2496 121.999 35.6818 122.184 37.1139 122.323C38.1302 122.416 39.1465 122.416 40.2091 122.416C41.8722 122.416 43.4891 122.601 45.106 122.787C45.5679 122.833 46.0761 122.787 46.6305 122.787C46.5381 123.204 46.4919 123.482 46.4457 123.714ZM47.7854 73.8668C47.3234 73.9596 47.1848 74.0523 47.1848 74.516C47.2772 76.5099 46.8153 78.4574 46.6767 80.4513C46.4919 83.8827 46.2609 87.3604 46.5381 90.7918C46.6305 91.9974 46.6305 93.2494 46.7229 94.455C47.0001 99.0456 47.2772 103.636 47.6006 108.273C47.6468 109.247 47.7854 110.174 47.8778 111.148C48.0626 113.281 47.8778 115.368 47.7854 117.501C47.7392 118.057 47.693 118.614 47.6468 119.17C47.5852 119.726 47.2618 120.036 46.6767 120.097C46.5843 120.097 46.4919 120.144 46.3995 120.144C44.5516 120.144 42.6575 120.237 40.8096 119.866C40.4401 119.773 40.0705 119.912 39.7009 119.819C39.0542 119.726 38.3612 119.634 37.7606 119.402C36.3285 118.799 34.9888 118.011 33.5105 117.454C32.0784 116.898 30.8311 116.017 29.399 115.46C29.2604 115.414 29.0756 115.321 28.937 115.275C27.5973 114.95 26.4423 114.301 25.2874 113.513C24.5944 113.049 23.7629 112.771 22.9314 112.446C22.377 112.215 21.7302 112.122 21.1297 111.983C20.8525 111.936 20.6215 111.89 20.3443 111.936C18.866 112.168 17.3877 111.983 15.9556 112.446C15.817 112.493 15.6784 112.446 15.4474 112.493C15.586 111.751 15.6322 111.102 15.817 110.406C16.3252 108.273 16.6485 106.14 16.9719 103.961C17.1567 102.755 17.3877 101.596 17.5725 100.437C17.8035 98.8601 18.0345 97.2372 18.2654 95.6606C18.2654 95.5215 18.3116 95.4288 18.3116 95.2896C18.2654 91.6728 18.5888 88.1023 18.3116 84.4855C18.1269 82.3525 17.9421 80.2195 17.6649 78.1329C17.5263 77.1591 17.1567 76.2317 16.8795 75.3043C16.7871 75.0261 16.6947 74.7015 16.6023 74.4233C16.3714 73.8205 16.1866 73.264 15.4936 73.0322C15.355 72.9858 15.2164 72.8003 15.124 72.6149C14.9392 72.2903 14.6621 72.1975 14.3387 72.383C14.2925 72.4294 14.2001 72.4294 14.1539 72.4294C13.5071 72.6612 13.4147 72.8003 13.5995 73.4031C13.7381 73.9596 13.9229 74.516 14.0615 75.0725C14.2463 75.768 14.2001 75.768 13.5071 75.9071C13.1376 75.9535 12.9528 76.2317 12.7218 76.4635C12.3984 76.9272 12.3984 76.8809 11.844 76.7418C11.3821 76.6027 10.8739 76.5099 10.3657 76.4172C10.0424 76.3708 9.76517 76.2781 9.62658 75.9535C9.07221 74.8406 8.61024 73.7277 8.51785 72.4757C8.51785 72.1512 8.51785 71.8729 8.70264 71.5947C9.11841 70.9919 9.53419 70.3891 9.94996 69.7399C10.3195 69.1835 10.6891 68.6271 11.0587 68.0706C11.6593 67.1432 12.2598 66.1695 12.9066 65.2421C13.4147 64.5465 14.0153 63.851 14.5697 63.2018C15.4012 62.1817 16.4638 61.4398 17.5263 60.6978C17.8959 60.4196 18.4502 60.3732 18.9584 60.1878C19.5128 61.0688 20.0671 61.9035 20.5753 62.7381C20.8063 63.1554 21.0373 63.48 21.453 63.7582C22.4694 64.361 23.2547 65.1957 24.0401 65.984C25.2412 67.236 26.6271 68.2561 28.1516 69.0908C28.7984 69.4617 29.4913 69.6008 30.2305 69.5081C31.5702 69.3226 32.9099 69.1835 34.2034 68.8589C35.5432 68.5807 36.6519 67.8388 37.622 66.865C39.4699 65.0102 40.5787 62.7381 41.2254 60.2341C41.5026 59.1676 41.7336 58.1011 41.9646 57.081C43.0271 57.2665 43.9972 57.452 45.0598 57.6374C45.106 58.1939 45.1522 58.7967 45.2908 59.3995C45.5217 60.7442 45.7527 62.0889 46.0299 63.4337C46.0761 63.7582 46.3071 64.0828 46.4457 64.4074C46.8153 65.0566 47.231 65.7058 47.693 66.4013C47.1848 66.5868 47.231 66.9577 47.3234 67.3751C47.6468 68.8589 47.924 70.3891 48.2474 71.8729C48.3398 72.4294 48.4784 72.9858 48.617 73.635C48.2474 73.7741 48.0164 73.8205 47.7854 73.8668ZM49.4947 66.3086C48.2936 64.3147 47.462 62.2744 47.3234 59.9096C48.2012 59.8632 48.9865 59.3995 49.9105 59.8168C50.0953 60.7442 50.3724 61.7643 50.511 62.7381C50.5572 63.1554 50.4648 63.6191 50.4186 64.0365C50.3262 64.5465 50.1415 65.0566 49.9567 65.5203C49.8181 65.7521 49.6795 65.984 49.4947 66.3086ZM60.9054 82.2598C60.7668 83.048 60.5358 83.79 60.3048 84.6246C58.5955 83.1408 56.7015 82.0279 55.3617 80.3122C54.5302 79.2457 53.6986 78.1792 53.1905 76.8809C52.5437 75.0724 51.7584 73.3104 51.0654 71.5484C50.9268 71.2238 50.8806 70.8992 50.742 70.5746C50.3724 69.4153 50.0029 68.2097 49.6333 66.9578C50.6496 66.5868 50.9268 65.7058 51.1116 64.732C51.204 64.3147 51.2964 63.9437 51.3888 63.48C51.666 63.7582 51.666 64.0365 51.7584 64.3147C51.8969 64.8711 51.9893 65.4275 52.1279 65.984C52.3589 67.0969 53.0981 67.9779 53.6524 68.9053C54.2992 69.9254 55.0384 70.9455 55.6851 71.9657C56.3781 73.0322 57.071 74.1451 57.764 75.2116C57.8102 75.2579 57.8102 75.3043 57.8102 75.3507C58.6879 76.3244 59.1961 77.5764 59.8428 78.7357C60.4434 79.8022 61.1364 80.9614 60.9054 82.2598Z" fill="black"/>
</svg>
