<svg width="135" height="199" viewBox="0 0 135 199" fill="none" xmlns="http://www.w3.org/2000/svg">
<path d="M113 3.5H2.5V96.5H113V3.5Z" fill="#E88AB7"/>
<path d="M104 84L17.5 82V15.5L101.5 17.5L104 84Z" fill="white"/>
<path d="M54.5 128.5L38.5 124L39.5 122.5L54.5 71.5L60 66L63.5 61L70 46.5L79 44.5L84 49.5L86 63L81.5 71.5L86 74L91 78.5L93.5 71.5L101 63H106L108 57V46.5L113.5 41.5L121 46.5V53L119 61L131 71.5L133 91L129 99.5V116.5L123.5 133.5H113.5H91L89.5 127L91 119L84 116.5V119V136.5L70 138L58 136.5L60 131L54.5 128.5Z" fill="#4DB276"/>
<path d="M31.5 185L28.5 189.5L31.5 191.5H36.5L43.5 194L48.5 191.5L41 187.5H36.5L31.5 185Z" fill="#E58252"/>
<path d="M53.5 194V196.5L67.5 194L70.5 191.5L61.5 187.5L53.5 194Z" fill="#E58252"/>
<path d="M92.5 191.5L82.5 194L80 196.5L84 197.5L89 196.5H95V191.5H92.5Z" fill="#E58252"/>
<path d="M110 194V189.5H116.5L114.5 194H110Z" fill="#E58252"/>
<path d="M63.3966 187.822C64.0385 188.217 64.631 188.464 65.2728 188.464C66.5566 188.415 67.5934 189.007 68.6303 189.55C69.1734 189.846 69.7659 190.191 70.4078 190.29C70.8028 190.339 71.099 190.586 71.3459 190.931C71.5928 191.326 71.8396 191.721 72.1359 192.116C72.4815 192.609 72.4321 193.053 72.2346 193.596C71.8396 194.484 71.1978 195.077 70.3584 195.422C69.2722 195.866 68.2353 196.31 67.0009 196.31C66.4578 196.31 65.9147 196.458 65.3716 196.656C63.4954 197.248 61.471 197.347 59.5454 197.742C59.0023 197.84 58.4098 197.741 57.8667 197.643C57.1754 197.495 56.4842 197.593 55.8917 197.939C55.1511 198.383 54.3611 198.383 53.5217 198.334C53.1268 198.334 52.8799 198.186 52.633 197.89C52.5343 197.742 52.4355 197.593 52.3368 197.495C51.3987 196.508 50.8555 195.422 51.2012 193.991C51.2012 193.892 51.2012 193.843 51.1518 193.646C50.1643 193.004 50.2631 192.066 50.658 191.079C50.7568 190.882 50.8062 190.685 50.9049 190.487C51.7443 188.711 51.843 186.885 51.7936 184.96C51.6949 181.407 51.5962 177.854 51.7443 174.301C51.843 171.784 52.4355 169.366 53.2749 167.046C54.213 164.628 54.7067 162.111 55.0524 159.545C55.2992 157.621 55.1511 155.696 54.8055 153.772C54.7561 153.426 54.608 153.081 54.4105 152.834C53.5218 151.551 53.1268 150.169 52.8799 148.639C52.633 146.961 52.3368 145.234 52.0899 143.556C51.9418 142.619 51.8924 141.681 51.843 140.743C51.7937 140.053 51.843 139.362 52.0899 138.671C52.2874 138.72 52.5343 138.72 52.6824 138.819C54.3117 139.51 55.1511 140.842 55.5955 142.52C55.9411 143.704 56.188 144.938 56.5336 146.122C57.0273 148.047 57.5704 149.922 58.5086 151.65C58.8542 152.291 59.1011 152.982 59.496 153.623C59.9404 154.413 60.1873 155.301 60.1379 156.19C60.1379 157.177 60.0885 158.164 59.9404 159.151C59.5454 161.322 59.1011 163.444 58.6567 165.566C58.4098 166.652 58.1629 167.737 57.8667 168.823C57.3729 170.55 57.3729 172.376 57.1261 174.153C56.7805 176.768 56.978 179.384 56.9286 181.999C56.9286 183.332 56.8792 184.664 56.8298 185.996C56.7805 187.033 56.583 188.02 56.4842 189.056C56.4348 189.303 56.4348 189.55 56.3855 189.895C56.7311 189.944 56.978 189.796 57.2248 189.698C57.5211 189.599 57.8173 189.55 58.1136 189.451C58.4098 189.352 58.6567 189.253 59.0023 189.105C59.0023 188.76 59.0517 188.464 59.0023 188.217C58.9529 187.97 58.9036 187.724 58.8048 187.477C57.8173 185.404 57.8667 183.233 58.0642 181.062C58.2123 179.285 58.2617 177.558 58.5086 175.831C58.9529 172.82 59.1998 169.81 59.9404 166.849C60.5823 164.135 61.4216 161.47 62.0635 158.756C62.3597 157.374 62.5572 155.992 62.8041 154.561C63.1497 152.291 63.446 150.07 63.7916 147.85C63.7916 147.702 63.841 147.603 63.841 147.455C63.9891 145.135 64.4335 142.865 64.9272 140.595C65.026 140.053 65.0753 139.51 65.1247 138.868C64.8285 138.819 64.5816 138.72 64.3347 138.72C62.4585 138.621 60.5823 138.424 58.7554 137.881C58.2123 137.733 57.6692 137.684 57.1261 137.585C56.7805 137.536 56.4348 137.536 56.0892 137.437C55.793 137.388 55.6448 137.141 55.6448 136.894C55.5955 136.055 55.793 135.266 56.2373 134.575C56.6817 133.933 57.0767 133.292 57.4717 132.601C57.5704 132.403 57.6692 132.157 57.7679 131.861C57.3236 131.762 56.9286 131.762 56.583 131.614C56.2373 131.466 55.8917 131.219 55.5461 131.071C55.1511 130.874 54.7561 130.726 54.3611 130.577C53.1761 130.183 52.0405 129.788 50.9543 129.097C50.1149 128.604 49.2262 128.159 48.3374 127.765C47.5475 127.37 46.6587 127.074 45.8687 126.728C45.6219 126.63 45.375 126.58 44.8812 126.432C46.3131 127.765 46.6093 129.344 47.0043 130.874C47.3993 132.65 47.7943 134.377 48.1399 136.154C48.3374 137.092 48.3868 138.029 48.4856 138.967C48.6337 140.793 48.7324 142.619 48.8312 144.494C48.8806 145.185 48.9299 145.876 48.9299 146.567C48.9299 147.504 48.7818 148.442 48.4856 149.33C47.9425 151.008 47.4981 152.686 46.8068 154.314C46.165 155.894 45.5231 157.473 44.8319 159.052C43.6469 161.717 42.4619 164.382 41.2769 167.046C40.9807 167.688 40.6844 168.28 40.3388 168.872C39.4501 170.353 38.8576 171.981 38.3638 173.61C38.117 174.498 37.9688 175.485 37.9195 176.373C37.8701 178.298 37.2776 179.976 36.2407 181.555C35.747 182.295 35.2533 183.035 34.7595 183.825C34.6608 184.022 34.562 184.22 34.5126 184.417C34.4139 184.861 34.3151 185.306 34.2164 185.799C35.5001 186.391 37.4257 186.737 38.907 186.589C39.0551 186.144 38.907 185.7 38.7588 185.256C38.5613 184.516 38.3638 183.776 38.2651 182.986C38.0676 181.9 38.1663 180.765 38.512 179.68C38.7588 178.791 38.9563 177.854 39.2032 176.916C39.4007 176.275 39.5488 175.584 39.8451 174.992C40.5363 173.462 41.1288 171.932 41.5732 170.303C42.1163 168.28 42.7581 166.306 43.795 164.431C44.3381 163.444 44.7331 162.408 45.2269 161.421C46.3131 159.052 47.7943 156.881 49.2262 154.709C49.7199 153.969 50.4112 153.475 51.3987 153.377C51.843 153.574 52.2874 153.772 52.7811 153.969C53.028 154.117 53.3242 154.265 53.5217 154.462C54.3117 155.252 54.3611 155.647 53.818 156.634C53.4724 157.275 53.028 157.867 52.6824 158.509C52.3368 159.2 51.9418 159.891 51.6949 160.582C50.9543 162.753 50.1149 164.924 49.0287 166.997C48.2881 168.379 47.6956 169.859 47.0043 171.29C46.7575 171.833 46.5106 172.376 46.165 172.87C45.0787 174.547 44.3875 176.373 43.6963 178.249C43.4988 178.791 43.3013 179.285 43.1038 179.778C42.8569 180.321 42.7582 180.864 42.8075 181.407C43.005 183.085 42.8569 184.763 42.7088 186.391V186.835C43.8444 187.378 44.9306 188.02 46.1156 188.464C47.5968 189.056 48.7324 190.092 49.8681 191.129C50.263 191.474 50.3618 191.918 50.2137 192.412C49.8681 193.596 49.1274 194.336 47.9425 194.633C46.8562 194.879 45.7206 194.978 44.6344 194.978C43.8938 194.978 43.2025 194.682 42.5607 194.336C41.7707 193.942 40.9807 193.646 40.1413 193.547C39.6969 193.497 39.3019 193.399 38.907 193.251C37.7713 192.807 36.6357 192.757 35.5001 193.004C34.2164 193.251 32.9327 193.201 31.6489 192.955C31.0564 192.856 30.4639 192.609 30.0196 192.264C29.3283 191.672 28.6371 191.079 27.9459 190.537C27.5015 190.191 27.4027 189.747 27.4027 189.155C27.4521 187.773 27.7977 186.441 28.1434 185.108C28.1927 184.911 28.2421 184.615 28.3902 184.516C29.1802 184.022 29.3283 183.035 29.9208 182.345C30.5133 181.703 31.1058 180.963 31.6489 180.272C32.1427 179.63 32.6364 178.94 32.982 178.249C33.2289 177.706 33.4264 177.114 33.4758 176.521C33.6239 173.56 34.5126 170.797 35.6483 168.132C36.6357 165.862 37.5245 163.641 38.4132 161.371C39.0057 159.841 39.5488 158.312 40.1413 156.831C40.6844 155.4 41.3263 153.969 41.9188 152.538C42.215 151.798 42.5113 151.008 42.7088 150.218C42.9557 149.182 43.4 148.294 43.9925 147.455C44.3381 146.961 44.4369 146.468 44.3875 145.876C44.19 144 44.0913 142.125 43.8938 140.25C43.8444 139.904 43.795 139.559 43.795 139.214C43.7456 137.289 43.4 135.364 43.1038 133.489C42.8075 131.614 42.4125 129.788 42.0669 127.962C41.9188 127.172 41.6719 126.383 42.0175 125.692C41.82 125.248 41.5238 125.198 41.1782 125.198C40.3882 125.248 39.6476 125.346 38.8576 125.396C38.6601 125.396 38.512 125.445 38.3638 125.445C37.5738 125.495 37.0801 125.198 36.9814 124.409C36.8332 123.471 36.7839 122.534 36.7839 121.596C36.8332 119.918 37.2776 118.29 37.8207 116.71C39.0057 113.157 40.0919 109.505 41.2275 105.952C41.82 104.028 42.4619 102.103 43.005 100.178C43.1531 99.7344 43.4 99.2409 43.2025 98.5993C41.2769 98.8954 39.3513 98.6487 37.4751 99.0435C36.6357 99.2409 35.747 99.2409 34.9076 99.2409C32.4389 99.2902 29.9208 99.2409 27.4521 99.2902C26.3165 99.2902 25.2303 99.3396 24.0947 99.3889C23.749 99.3889 23.4034 99.4383 23.0578 99.4383C20.3916 99.4383 17.7254 99.3889 15.0592 99.3889C14.3185 99.3889 13.5779 99.4383 12.8867 99.4383C9.62799 99.3889 6.36929 99.3396 3.11058 99.0435C2.96246 99.0435 2.76496 98.9941 2.61684 98.9448C1.87622 98.7474 1.67873 98.3526 1.9256 97.6124C2.17247 96.9708 2.56746 96.428 2.66621 95.6384C2.41934 95.4903 2.17247 95.2929 1.87622 95.2436C0.938111 95.0462 0.641866 94.4047 0.592492 93.5657C0.493743 92.5294 0.345619 91.5424 0.296245 90.5061C0.148122 86.5088 0 82.5609 0 78.5636C0 73.4807 0.098749 68.3484 0.098749 63.2654V55.1722C0.098749 51.7671 0.296245 48.4114 0.543117 45.0063C0.641865 43.5258 0.543117 42.0947 0.543117 40.6142C0.493742 37.9494 0.543117 35.2845 0.543117 32.669C0.493742 30.399 0.394994 28.1289 0.296245 25.8589C0.296245 25.168 0.246872 24.4771 0.246872 23.7862C0.246872 20.6772 0.246871 17.5189 0.296245 14.4099C0.345619 11.9918 0.543118 9.52436 0.592492 7.10626C0.641866 6.31667 0.691241 5.57644 0.592492 4.78685C0.493743 3.89857 0.641865 3.05964 0.691239 2.22071C0.740613 1.52982 0.987486 1.38177 1.87622 1.52982C1.97497 1.43112 2.07372 1.38177 2.1231 1.28307C2.61684 0.296093 3.50558 0.0493483 4.49306 0.0493483C5.52992 0.0493483 6.56678 0 7.60364 0H12.7386C16.2935 0 19.8485 0.0493483 23.4034 0.0493483C24.9834 0.0493483 26.5634 0.148046 28.1434 0.197395C30.3652 0.246744 32.587 0.197395 34.8089 0.0986965C36.4382 0.0493475 38.0676 0.246744 39.6969 0.345442C40.6844 0.394791 41.6719 0.394792 42.6594 0.394792C42.9063 0.394792 43.1531 0.394791 43.4494 0.345442C45.1775 0.345442 46.9056 0.296093 48.5843 0.296093H56.2867C60.0392 0.296093 63.7422 0.246744 67.4947 0.197395C68.6797 0.197395 69.914 0.246745 71.099 0.246745C72.5802 0.246745 74.1108 0.148046 75.5921 0.0986965C77.0733 0.0493475 78.5051 0.0986973 79.9864 0.0493483C80.6776 0.0493483 81.3689 0.0986973 82.0601 0.0493483C86.0594 -0.0986988 90.0587 0.197396 94.0087 0.246745C97.613 0.345443 101.217 0.542839 104.822 0.740235C106.797 0.838933 108.772 1.03633 110.747 1.13503C111.191 1.18438 111.586 1.13503 111.981 1.13503C112.228 0.838933 112.475 0.592188 112.623 0.394792C112.771 0.394792 112.919 0.394791 112.968 0.44414C113.363 0.888281 113.857 1.08568 114.45 1.08568C114.894 1.13503 115.24 1.38177 115.388 1.92461C115.19 2.2207 114.993 2.5168 114.795 2.86224C114.845 2.96094 114.845 3.10899 114.943 3.20769C115.388 3.84922 115.585 4.58946 115.684 5.37904C115.882 7.10626 115.98 8.78412 115.931 10.5113C115.931 11.4983 115.98 12.4853 116.03 13.4723C116.128 14.9034 116.227 16.2852 116.276 17.7163C116.375 20.0357 116.523 22.3551 116.573 24.6745C116.622 25.9576 116.573 27.2407 116.77 28.5237C116.869 29.4614 116.82 30.399 116.82 31.3366C116.82 33.8041 116.82 36.3209 116.869 38.7883C116.869 39.9234 117.017 41.1077 117.066 42.2921C118.35 42.8349 119.436 43.7232 120.325 44.7102C121.461 45.9933 122.448 47.3751 123.041 49.0036C123.14 49.2503 123.14 49.4971 123.14 49.7438C123.14 50.3853 123.189 51.0269 123.14 51.6684C123.09 52.4086 123.041 53.0995 122.893 53.8398C122.695 54.7281 122.547 55.567 122.695 56.5046C122.843 57.3929 122.646 58.2812 122.35 59.1695C122.152 59.7123 121.806 60.1071 121.263 60.4032C121.016 60.5019 120.819 60.6006 120.572 60.7486C120.276 61.3408 120.424 61.785 120.868 62.2291C121.708 63.0187 122.646 63.7096 123.288 64.6965C123.436 64.8939 123.683 64.9926 123.88 65.1407C124.67 65.7329 125.509 66.2757 126.102 67.0653C126.299 67.312 126.645 67.5094 126.892 67.6575C128.176 68.5458 129.459 69.4834 130.793 70.3717C131.533 70.8652 131.928 71.5067 132.175 72.2963C132.619 73.7274 132.669 75.1585 132.916 76.5897C133.064 77.626 133.261 78.7117 133.459 79.748C133.706 81.1298 133.952 82.5115 134.101 83.9427C134.298 85.8673 134.397 87.7919 134.446 89.7165C134.496 91.2957 134.199 92.8748 133.854 94.4047C133.755 94.8488 133.656 95.2436 133.508 95.6384C132.965 97.3656 132.521 99.0928 132.422 100.919C132.373 101.758 132.076 102.498 131.336 103.041C130.891 103.386 130.398 103.386 129.854 103.337C129.854 104.965 129.805 106.495 129.953 108.074C130.003 108.864 130.003 109.604 130.101 110.394C130.249 111.874 130.348 113.404 130.496 114.885C130.496 115.131 130.546 115.378 130.595 115.674C130.891 117.697 130.496 119.671 129.756 121.596C129.361 122.632 128.916 123.669 128.521 124.705C128.077 125.889 127.682 127.123 127.287 128.357C127.139 128.752 127.04 129.146 126.892 129.59C126.546 130.528 126.151 131.515 125.855 132.502C125.806 132.7 125.756 132.946 125.756 133.144C125.904 134.525 125.559 135.858 125.411 137.24C125.361 137.881 125.213 138.523 125.213 139.164C125.164 141.484 124.67 143.754 124.374 146.024C124.028 148.886 123.288 151.65 122.942 154.512C122.646 156.831 122.448 159.2 122.251 161.519C122.152 162.753 122.053 163.987 121.955 165.22C121.806 167.392 121.658 169.563 121.461 171.735C121.411 172.672 121.313 173.61 121.165 174.547C120.918 176.275 120.918 177.953 120.967 179.68V180.173C120.967 181.703 120.375 182.493 118.844 182.887C118.103 183.085 117.363 183.233 116.622 183.43C116.474 183.48 116.326 183.529 116.227 183.578C116.277 184.171 116.326 184.713 116.326 185.256C116.326 186.194 116.622 187.033 117.511 187.526C118.054 187.872 118.597 188.217 119.14 188.563C119.634 188.908 119.782 189.155 119.634 189.747C119.535 190.092 119.436 190.389 119.288 190.685C118.844 191.474 118.4 192.264 117.906 193.004C117.708 193.3 117.461 193.547 117.165 193.695C116.227 194.336 115.289 194.929 114.351 195.471C113.709 195.866 112.919 195.866 112.228 195.768C111.092 195.57 109.957 195.323 108.821 195.077C108.031 194.879 107.438 194.435 107.241 193.596C107.093 192.955 106.945 192.362 106.747 191.721C106.55 191.129 106.649 190.635 106.895 190.092C107.29 189.303 107.587 188.513 108.327 187.97C108.426 187.872 108.574 187.822 108.574 187.674C108.821 186.786 109.216 185.898 109.167 184.911C109.167 184.763 109.117 184.565 109.018 184.417C108.623 183.973 108.525 183.43 108.426 182.887C108.327 182.394 108.228 181.9 108.08 181.407C107.34 179.038 107.142 176.62 107.438 174.153C107.537 173.462 107.488 172.771 107.488 172.08C107.389 170.254 107.241 168.428 107.093 166.553C106.994 164.875 106.797 163.197 106.797 161.569C106.698 158.114 106.649 154.61 106.698 151.156C106.698 149.478 106.945 147.8 107.093 146.172C107.192 144.987 107.29 143.803 107.34 142.619C106.747 145.481 106.105 148.343 105.513 151.255C105.069 153.278 104.624 155.252 104.18 157.275C104.032 157.966 103.834 158.706 103.785 159.397C103.538 161.963 102.995 164.48 102.501 166.997C102.007 169.613 101.563 172.228 101.217 174.844C100.97 176.521 100.921 178.249 100.773 179.976C100.773 180.223 100.773 180.469 100.724 180.765C100.625 181.703 100.526 181.851 99.588 182.049C98.7486 182.246 97.9093 182.394 97.0205 182.591C97.1686 182.838 97.3661 183.035 97.4155 183.282C97.4649 183.578 97.4155 183.874 97.3661 184.171C97.218 184.861 96.9711 185.503 96.823 186.144C96.6255 186.885 96.5268 187.674 96.3293 188.415C96.1812 189.056 96.2305 189.599 96.6255 190.092C97.1686 190.931 97.5143 191.82 97.6624 192.807C97.7611 193.646 97.7611 194.435 97.4649 195.225C97.2674 195.768 97.0699 196.261 96.9218 196.804C96.7243 197.396 96.2799 197.692 95.638 197.692C94.3049 197.643 92.9718 197.84 91.6881 197.445C91.1943 197.297 90.7006 197.396 90.2562 197.742C89.5156 198.284 88.6269 198.482 87.6888 198.482H84.3313C82.9488 198.482 81.6157 198.136 80.2826 197.89C79.8383 197.791 79.542 197.495 79.2458 197.149C78.9001 196.705 78.8014 196.212 79.0976 195.718C79.4433 195.175 79.7889 194.633 80.1839 194.139C80.3814 193.942 80.6776 193.794 80.9245 193.695C82.0601 193.3 83.1957 193.004 84.1338 192.165C84.2326 192.066 84.3807 192.017 84.4794 192.017C85.2201 192.066 85.5163 191.573 85.9113 191.079C86.6519 190.092 87.2938 189.007 87.8369 187.872C87.985 187.526 88.0838 187.131 88.1825 186.786C88.38 186.046 88.5775 185.306 88.6763 184.516C88.9231 183.134 89.17 181.752 89.4169 180.371C89.4663 180.075 89.4169 179.778 89.3181 179.482C88.8244 177.015 88.6763 174.449 88.4294 171.981C88.3306 171.142 88.3306 170.254 88.38 169.415C88.4294 166.75 88.5281 164.085 88.6269 161.47C88.6763 160.532 88.6763 159.595 88.6763 158.657C88.7256 156.436 88.8244 154.216 88.9231 151.995C88.9231 151.6 88.9231 151.205 89.0219 150.86C89.6144 147.85 89.7625 144.839 90.0094 141.78C90.2562 139.164 90.5525 136.598 90.8981 133.884C90.6019 133.637 90.2069 133.292 89.8119 132.996C88.9725 132.255 88.1331 131.515 87.59 130.528C87.3925 130.183 87.195 129.788 87.0469 129.393C86.8494 128.949 86.9482 128.455 87.2444 128.061C87.9356 127.222 88.1331 126.235 88.2319 125.198C88.38 123.57 88.6269 121.941 88.775 120.362C88.8244 119.77 89.0219 119.178 89.5156 118.734C88.8738 118.29 88.1331 118.536 87.4913 118.388C86.8 118.24 86.1088 118.29 85.4669 118.388C85.2694 121.547 85.0719 124.656 85.2201 127.765C85.2694 129.097 85.5163 130.38 85.6644 131.713C85.7138 132.354 85.8125 132.996 85.8619 133.637C85.9113 134.624 85.8619 134.624 85.3682 135.759C84.5288 135.907 83.6401 136.154 82.7513 136.253C82.1589 136.351 81.5664 136.499 81.0232 136.697C80.1345 137.042 79.2458 137.289 78.3077 137.388C77.8139 137.437 77.2708 137.536 76.7771 137.684C75.7896 137.98 74.7527 138.079 73.7158 138.079C72.679 138.079 71.6421 138.177 70.6546 138.227C70.5065 138.227 70.3584 138.325 70.1115 138.424C70.3584 138.769 70.5559 139.016 70.7534 139.263C71.494 140.102 71.8396 141.089 71.7409 142.224C71.6915 143.112 71.5434 144 71.494 144.889C71.494 144.987 71.4446 145.037 71.4446 145.135C71.3952 147.8 70.704 150.366 70.2596 152.982C70.0128 154.512 69.6671 155.992 69.3215 157.522C68.9265 159.249 68.4328 160.927 68.0378 162.605C67.2478 165.813 66.4578 169.02 65.3716 172.129C65.026 173.215 64.5816 174.301 64.2853 175.436C64.0385 176.275 63.841 177.114 63.7422 177.953C63.5941 179.236 63.5447 180.519 63.446 181.802V181.95C63.2485 183.282 63.2979 184.615 63.4954 185.898C63.4954 186.539 63.3966 187.181 63.3966 187.822ZM79.1964 91.9866H78.357C78.3076 91.8385 78.2583 91.6411 78.1595 91.5424C77.9127 91.345 77.567 91.197 77.2708 90.9996C75.5427 89.9632 73.8146 88.9269 72.4321 87.4464C72.1359 87.101 71.7902 86.8049 71.1978 86.6569C71.1484 86.953 71.099 87.1997 71.0496 87.4464C70.7534 89.1737 70.5559 90.9502 70.2103 92.6281C69.7659 94.7501 69.1734 96.8721 68.6797 98.9941C68.5809 99.4383 68.5315 99.9318 68.4822 100.376C68.2353 103.041 68.1366 105.656 67.7416 108.321C67.3466 110.937 67.0009 113.552 66.6059 116.217C66.5566 116.414 66.4578 116.612 66.7541 116.809C67.6922 116.365 68.729 116.513 69.7165 116.809C70.309 116.957 71.0003 117.105 71.6421 117.105C72.9259 117.105 74.2096 117.105 75.4933 117.007C76.1846 116.957 76.9252 116.858 77.6164 116.464C77.567 116.02 77.5177 115.575 77.4683 115.181C77.4683 114.835 77.4189 114.49 77.4683 114.144C77.5177 113.749 77.8139 113.552 78.2089 113.651C78.8014 113.848 79.3939 114.095 80.0358 114.292C80.5295 114.44 80.9739 114.638 81.4676 114.786C81.517 114.786 81.6157 114.736 81.7145 114.638C81.6651 114.44 81.6157 114.194 81.517 113.947C80.9739 114.095 80.4801 114.194 79.9864 114.292C79.9864 114.194 79.9864 113.996 79.937 113.947C79.7395 113.799 79.4926 113.7 79.2458 113.601C78.6039 113.207 78.0608 112.713 77.8139 112.022C77.3202 110.394 77.1227 108.765 77.3695 107.087C77.5177 106.248 77.5177 105.36 77.4683 104.521C77.4683 104.126 77.3695 103.633 77.1721 103.287C76.8264 102.695 76.7771 102.103 76.8758 101.412C77.0239 99.7344 77.1227 98.0071 77.2708 96.2799C77.3202 95.7864 77.2708 95.2436 77.3202 94.7501C77.4683 93.8618 77.6658 92.9735 77.8633 92.1346C77.9127 91.9372 78.0608 91.7398 78.357 91.8879C78.6533 91.9372 78.9495 91.9372 79.1964 91.9866C79.2458 92.0853 79.1964 92.2333 79.2458 92.332C79.3939 92.48 79.542 92.6281 79.7395 92.7268C81.0232 93.7631 80.727 93.319 81.0726 95.0462C81.122 95.2436 81.122 95.4903 81.122 95.6877C81.2207 97.7604 81.2207 99.7837 81.0232 101.856C80.9739 102.498 80.9739 103.139 81.0232 103.781C81.0232 104.077 81.0726 104.423 81.2701 104.62C81.8132 105.409 81.912 106.298 82.0601 107.186C82.1095 107.68 82.0601 108.173 82.307 108.765C82.8007 108.321 83.097 107.877 83.4426 107.433C84.0844 106.495 84.7263 105.508 85.4176 104.571C85.9113 103.88 86.4544 103.238 87.0469 102.547C86.5532 102.202 86.4544 101.758 86.405 101.215C86.3557 100.425 86.3557 99.685 86.5532 98.9448C86.8 98.0565 86.9482 97.1682 87.0963 96.3293C87.1457 96.0825 87.0963 95.8358 87.1457 95.6384C86.5532 95.4903 85.9607 95.441 85.4669 95.1942C83.2945 94.1086 81.2701 93.0229 79.1964 91.9866ZM18.6141 18.1604C18.466 18.7526 18.6141 19.2461 18.7129 19.7396C18.861 20.4798 19.0585 21.2694 19.1079 22.0097C19.2066 23.8849 19.256 25.7602 19.3054 27.6354C19.4041 30.0535 19.3547 32.4223 19.5522 34.8404C19.7003 36.4689 19.7003 38.0974 19.7991 39.726C19.9966 43.131 20.0953 46.4868 20.1447 49.8918C20.1941 52.5073 20.1447 55.1228 20.0953 57.7383C20.0953 59.1695 19.9966 60.6499 20.046 62.1304C20.1447 65.3381 20.2928 68.5458 20.3916 71.7535C20.4903 74.4677 20.5397 77.1325 20.6385 79.8467C20.6385 80.0934 20.7372 80.3402 20.7866 80.5376C21.1816 80.5376 21.4778 80.5869 21.7741 80.5376C23.1072 80.2908 24.4403 80.3402 25.724 80.3895C26.514 80.4389 27.2546 80.4389 28.0446 80.3895C29.279 80.3402 30.5133 80.2908 31.7477 80.2415C32.2414 80.2415 32.6858 80.1921 33.1795 80.1921C36.3889 79.9454 39.5982 79.9948 42.8075 80.0935C44.0419 80.1428 45.2762 80.2415 46.5106 80.2908C47.0043 80.2908 47.4487 80.2415 47.9425 80.2415C48.3375 80.2415 48.5843 80.0441 48.7324 79.6987C48.7818 79.5013 48.8806 79.3039 48.9793 79.1065C49.4731 77.7247 49.9174 76.3429 50.4605 75.0105C51.448 72.7404 52.5343 70.5197 53.5217 68.2003C54.213 66.5718 55.4474 65.5355 56.9286 64.6472C57.3236 64.4005 57.7679 64.2031 58.1629 63.9563C58.7061 63.6109 59.2985 63.3641 59.9404 63.2654C60.4835 63.1667 61.0266 63.0187 61.4216 62.6732C61.1583 61.785 61.1748 60.5677 61.471 59.0214C61.1748 58.9227 60.7798 58.9227 60.5329 58.7747C59.9898 58.4786 59.4467 58.0838 58.9529 57.689C58.7061 57.4916 58.5579 57.2449 58.5086 56.9488C58.4098 56.3566 58.3604 55.7644 58.6073 55.1722C58.8048 54.6787 58.9529 54.1852 59.101 53.6917C59.2492 53.2969 59.3479 52.8528 59.1998 52.3593C58.1629 51.8165 57.8173 50.7801 57.5704 49.6451C57.5211 49.349 57.4717 49.0529 57.4223 48.7568C57.3729 48.6088 57.3729 48.4114 57.2248 48.3127C56.7805 47.9179 56.3855 47.4244 55.7436 47.1777C55.4473 47.9672 54.8055 48.4607 54.5586 49.2503C54.2624 50.1386 53.5218 50.8295 52.3861 50.7308C52.2874 50.7308 52.1393 50.8295 52.0899 50.8295C51.448 51.471 51.448 52.2606 51.5468 53.0008C51.5961 53.5437 51.7936 54.0865 51.7936 54.6294C51.7443 56.2085 52.1886 57.689 52.4355 59.2188C52.5343 59.8604 52.7811 60.4525 53.2255 60.946C53.9167 61.6369 53.6205 62.3278 53.028 62.8213C52.7811 63.0187 52.4355 63.1667 52.1393 63.3148C51.8924 63.4135 51.5468 63.5122 51.2999 63.6602C50.7074 63.9563 50.6087 64.4005 51.0037 64.894C51.4974 65.4861 51.9418 66.1277 52.5836 66.5718C53.2255 67.016 53.1761 67.3121 52.633 67.7562C52.3861 67.9536 52.0899 68.2003 51.8924 68.4471C51.2012 69.286 50.263 69.6808 49.2262 69.9276C48.6831 70.0756 48.1399 69.9769 47.5968 69.6808C46.6093 69.138 45.6219 68.6445 44.6344 68.1016C44.19 67.9042 43.795 67.6081 43.6469 67.164C43.4494 66.6705 43.0544 66.4238 42.6594 66.2264C42.4125 66.0783 42.1657 65.9303 41.8694 65.7822C41.2769 65.4861 40.9807 65.042 40.7832 64.4005C40.5857 63.7096 40.5363 63.068 40.5857 62.3771C40.5857 61.8343 40.7338 61.2915 40.3388 60.6993C39.8451 60.7486 39.4007 60.798 38.9563 60.798C38.0182 60.8473 37.0307 60.8473 36.1914 60.3538C34.9076 59.663 33.6733 58.8734 32.4389 58.1331C31.7477 57.7383 31.4021 57.1955 31.3527 56.3566C31.3033 54.8761 31.1552 53.3463 31.1058 51.8658C31.1058 50.4347 31.1552 49.0529 31.2046 47.6218V39.5286C31.2046 38.739 31.1058 37.9987 31.0564 37.2092C31.0564 35.4819 31.0071 33.8041 31.0564 32.0769C31.0564 31.2379 31.5008 30.5964 32.3402 30.3003C32.8833 30.1029 33.377 29.9055 33.9202 29.8562C35.5495 29.6588 37.1789 29.5601 38.8082 29.4614C39.3513 29.412 39.8944 29.5107 40.4869 29.5107C41.2276 29.5601 41.9682 29.6094 42.6594 29.5601C43.5975 29.5107 44.5356 29.6094 45.4737 29.9055C46.2144 30.1029 46.955 30.399 47.6956 30.4977C49.0287 30.6457 50.1149 31.2873 51.1024 32.1756C51.3987 32.4716 51.6949 32.7677 52.0405 33.0638C52.3861 33.3599 52.5836 33.7054 52.633 34.1495C52.8799 35.8274 53.1761 37.5546 53.423 39.2325C53.4724 39.6273 53.5218 40.0714 53.5711 40.4662C53.9167 40.5649 54.213 40.6636 54.4599 40.7623C54.7067 40.9103 54.9536 41.1077 55.2005 41.3051C55.8423 41.848 56.4842 42.3908 57.1755 42.9336C57.6198 43.2791 57.9161 43.7232 58.0148 44.3154C58.1136 44.8583 58.1629 45.4011 58.4592 45.8946C59.1504 45.5985 59.7429 45.3517 60.3848 45.105C61.1254 44.8089 61.8166 44.9076 62.4585 45.4011C63.2485 45.9933 64.0879 46.5361 64.8778 47.079C65.5691 47.5231 66.2109 48.0166 66.5072 48.8062C66.6059 49.0036 66.7541 49.2997 67.0997 49.201C67.2478 49.0529 67.3959 48.8555 67.5441 48.6581C68.2353 47.8685 68.8772 47.079 69.5684 46.2894C70.0128 45.7959 70.5559 45.3024 71.3459 45.4504C71.7409 45.4998 71.9877 45.3024 72.284 45.105C72.8271 44.7102 73.3209 44.3154 73.864 43.97C74.2096 43.7232 74.6046 43.6739 75.0983 43.7232C75.8883 43.8713 76.7277 43.97 77.5177 43.8713C78.4558 43.7726 79.1964 44.0193 79.9864 44.4141C80.4801 44.6609 80.9739 44.957 81.4676 45.1543C83.3932 45.8946 85.1707 46.9309 86.8 48.1646C87.3925 48.6088 87.9356 48.9049 88.6763 48.8555C89.4662 48.8062 90.1575 49.1516 90.75 49.6945C91.1944 50.0892 91.6387 50.484 92.1325 50.8788C93.0541 51.6684 93.5808 52.6554 93.7124 53.8398C94.7987 54.7281 95.8355 55.6163 96.8724 56.5046C97.4155 56.9981 97.5636 57.5409 97.3661 58.2318C97.2674 58.5773 97.1193 58.9721 96.9218 59.3175C96.3787 60.2058 95.8355 61.0447 95.1937 61.8837C94.7493 62.4265 94.2062 62.6732 93.4656 62.3771C93.3174 62.3278 93.1199 62.2785 92.9718 62.2291C91.935 62.0317 91.3918 62.5252 91.5893 63.5122C91.6881 64.1044 91.935 64.6472 92.0831 65.2394C92.33 66.1277 92.1325 66.8186 91.3918 67.4107C91.1944 67.5588 91.0462 67.6575 90.8487 67.8055C90.4537 68.1016 90.1081 68.1016 89.6144 68.0523C88.8738 67.9042 88.1331 67.7068 87.4419 67.312C87.0963 67.1147 86.7013 66.8679 86.2076 66.9666C85.9113 67.7068 85.5657 68.4964 85.2201 69.286C84.8744 70.0756 84.282 70.8158 84.2326 71.7535C84.8744 71.9509 85.4669 72.1482 86.1088 72.2469C87.0469 72.4443 87.7875 72.8391 88.4294 73.53C88.9231 74.0235 89.4169 74.4677 89.96 74.9118C90.2562 75.1585 90.5525 75.4053 90.8981 75.7014C91.0956 75.2079 91.2931 74.8624 91.4412 74.4677C92.0831 72.4444 92.6756 70.3717 93.3668 68.3484C93.5149 67.8549 93.7618 67.4107 94.0581 66.9666C94.7987 65.8316 95.5887 64.6966 96.3786 63.5615C96.6255 63.2161 96.8724 62.8706 97.1686 62.5252C97.8599 61.8343 98.6005 61.2915 99.6867 61.5382C100.18 61.6369 100.575 61.4889 100.97 61.0941C100.625 60.6499 100.575 60.0577 100.575 59.5149C100.575 57.7383 100.575 56.0111 100.526 54.2346C100.477 53.0008 100.427 51.7671 100.477 50.5334C100.724 44.5128 100.378 38.4429 100.427 32.4223V32.1756C100.378 30.399 100.378 28.6718 100.329 26.8952C100.329 25.7108 100.279 24.4771 100.279 23.2927C100.23 22.0097 100.18 20.7266 100.131 19.4435C100.131 19.1968 100.082 18.95 100.032 18.7033C99.5386 18.7526 99.1436 18.8513 98.7486 18.8513C96.5761 18.9007 94.4037 19.0487 92.1818 18.8513C91.3425 18.802 90.4537 18.9007 89.6144 18.9007C89.2194 18.9007 88.8244 18.95 88.4788 18.95C85.4175 18.7526 82.307 18.7526 79.1964 18.8513C76.1352 18.9994 73.1234 18.9007 70.0621 18.9007C69.4697 18.9007 68.8772 18.95 68.2847 18.95C66.2109 18.95 64.0879 18.9994 61.9648 18.9994C59.496 18.95 57.0767 18.9007 54.608 18.802C52.0405 18.7526 49.4731 18.7033 46.9056 18.6539C44.2888 18.6046 41.6719 18.4565 39.0551 18.4072C37.1789 18.3578 35.3026 18.4072 33.377 18.4565C30.6614 18.5552 27.9952 18.7033 25.2796 18.5059C23.8478 18.4072 22.4653 18.3578 21.0828 18.1111C20.1941 18.2098 19.4535 18.2098 18.6141 18.1604ZM112.277 39.7753C112.178 37.4559 112.129 35.2352 111.882 33.0145C111.537 29.7081 111.537 26.4511 111.586 23.1447C111.635 19.4929 111.685 15.841 111.734 12.2386C111.734 11.6957 111.734 11.1035 111.783 10.5607C111.833 9.12957 111.882 7.74779 111.932 6.31667C111.932 6.11928 111.882 5.92188 111.882 5.72448C111.388 5.92188 110.944 6.16863 110.5 6.16863C107.685 6.46472 104.871 6.51407 102.007 6.46472C98.9461 6.41537 95.9343 6.26732 92.8731 6.16863C91.145 6.11928 89.4169 6.11928 87.7381 6.16863C82.8007 6.16863 77.8633 6.21797 72.9258 6.21797C72.4815 6.21797 72.0865 6.26732 71.6421 6.26732C70.309 6.31667 68.9759 6.41537 67.6428 6.41537C64.5816 6.46472 61.471 6.51407 58.3604 6.61277C56.4842 6.66212 54.608 6.85951 52.6824 6.90886C50.6087 6.95821 48.5843 7.00756 46.5106 7.00756H42.1163C41.3757 7.00756 40.6351 6.95821 39.9438 7.05691C37.6726 7.4517 35.4014 7.2543 33.1302 7.10626C31.0564 6.95821 28.9333 6.71146 26.8103 6.85951C25.1315 6.95821 23.4528 6.95821 21.7741 6.90886C18.8116 6.81016 15.8492 6.61277 12.8867 6.51407C10.1711 6.41537 7.5049 6.36602 4.78931 5.97123C4.64119 5.97123 4.49306 6.02058 4.34494 6.06993C4.44369 7.59975 4.59181 9.03087 4.69056 10.5113C4.73993 11.449 4.69056 12.3866 4.78931 13.3242C4.93743 15.3475 5.08555 17.3215 5.28305 19.3448C5.52992 22.3551 5.82617 25.316 6.12241 28.277C6.17179 28.7211 6.22116 29.2146 6.31991 29.6588C6.66553 31.7314 6.81365 33.8041 6.86303 35.9261C6.9124 37.752 6.96178 39.6273 7.1099 41.4532C7.35677 44.2167 7.3074 46.9309 7.15928 49.6451C7.01115 53.1489 6.81365 56.6527 6.71491 60.1564C6.66553 62.8706 6.66553 65.5355 6.66553 68.2497C6.66553 70.7665 6.61616 73.2833 6.56678 75.8494V80.3402C6.56678 83.8933 6.51741 87.4464 6.51741 90.9996C6.51741 91.7892 6.56678 92.5294 6.61616 93.319C6.61616 93.5657 6.76428 93.7631 6.86303 93.9605C10.1711 93.7138 13.3311 93.5164 16.5404 93.2696C19.8978 93.0229 23.2059 92.7761 26.5634 92.5787C28.4396 92.48 30.3158 92.3813 32.2414 92.332C33.4264 92.2827 34.6608 92.2827 35.8457 92.2827C36.9814 92.2333 38.1663 92.0853 39.3019 92.184C40.7832 92.332 42.215 92.2827 43.6963 92.332H45.0787C45.375 91.7398 46.56 87.6932 46.7081 86.7556C46.7575 86.5582 46.9056 86.3608 46.5106 86.0647C46.4612 86.1634 46.4118 86.2621 46.3625 86.4101C46.0662 86.953 45.5725 87.1504 44.9306 87.1504C44.6344 87.1504 44.3381 87.1997 44.0419 87.1504C42.9063 87.101 41.7213 87.0023 40.5857 86.953C38.7588 86.9036 36.8826 86.8049 35.0558 86.7556C33.5252 86.7062 31.9946 86.7062 30.4146 86.7062H29.5258C28.3902 86.6569 27.2052 86.6569 26.0696 86.6075C24.8847 86.6075 23.749 86.6569 22.6134 86.3608C21.5766 86.114 20.4903 86.0153 19.4041 86.0647C18.1697 86.0647 16.9354 85.8179 15.701 85.5218C15.2567 85.4231 14.911 85.2257 14.7629 84.6336C14.9604 84.1894 15.2073 83.6959 15.4048 83.2024C14.944 82.5773 14.7135 81.9194 14.7135 81.2285C14.7135 80.735 14.6148 80.1921 14.5654 79.6987C14.516 79.3039 14.4667 78.9584 14.4173 78.5636C14.2198 75.2572 14.0223 72.0002 13.8248 68.6938C13.6767 66.2757 13.4298 63.8083 13.2323 61.3902C12.7879 56.1592 12.9854 50.9282 13.1336 45.6972C13.1829 43.2791 13.3804 40.9103 13.3311 38.4922C13.2817 35.8767 13.3804 33.2612 13.5286 30.6457C13.7261 27.0433 14.1211 23.4901 14.4173 19.8876C14.516 18.4565 14.6148 16.9761 14.7135 15.5449C14.7629 15.1501 14.8123 14.8047 14.911 14.4099C14.9604 14.0645 15.0592 13.719 15.4542 13.6203C15.8492 13.5216 15.9479 13.9164 16.1948 14.0151C16.2441 14.0645 16.3429 14.0645 16.3923 14.0645C16.9848 13.8671 17.5279 13.6203 18.1204 13.4723C18.7129 13.3736 19.3054 13.3242 19.8978 13.2749C20.0953 13.2749 20.3422 13.2255 20.5397 13.1762C23.0084 12.6333 25.5265 12.5346 28.094 12.5346C28.3409 12.5346 28.5877 12.5346 28.884 12.584C29.8715 12.7814 30.8589 12.6827 31.8464 12.6333C33.2783 12.5346 34.7595 12.4359 36.2407 12.4359C37.6232 12.3866 39.0057 12.4359 40.3388 12.4853C41.2769 12.4853 42.215 12.5346 43.1531 12.584C44.19 12.6333 45.2269 12.732 46.2144 12.7814C47.9918 12.8307 49.8187 12.8307 51.6455 12.8801C53.423 12.9294 55.1511 12.9788 56.9286 13.0775C59.0023 13.1762 61.0266 13.2255 63.1004 13.3736C63.7916 13.4229 64.4828 13.571 65.1247 13.571C66.6059 13.571 68.1365 13.5216 69.6178 13.4723C71.3459 13.4229 73.0246 13.2749 74.7527 13.2749C75.8389 13.2749 76.9745 13.3736 78.1102 13.3736C79.0976 13.4229 80.0851 13.3242 81.0726 13.4229C82.2576 13.5216 83.3932 13.4723 84.5288 13.2749C85.7138 13.0775 86.9482 13.1268 88.1331 13.2749C90.4537 13.571 92.8237 13.8177 95.1937 13.8671C95.9343 13.8671 96.6749 13.9658 97.3661 14.0151C98.3536 14.0645 99.3411 14.1138 100.329 14.1632C101.119 14.2125 101.958 14.2125 102.797 14.2125C102.945 14.2125 103.143 14.2125 103.291 14.2619C103.884 14.4593 103.982 15.0514 103.538 15.4462C103.192 15.7423 102.847 16.0878 102.55 16.3345C102.649 17.3709 102.748 18.3085 102.797 19.2461C102.995 21.9603 102.995 24.7239 103.34 27.4381C103.538 29.1159 103.637 30.7444 103.834 32.4223C103.982 34.0015 104.229 35.5806 104.377 37.1598C104.575 39.3805 104.772 41.6012 104.97 43.8219C105.019 44.3648 105.118 44.9076 105.167 45.4504C106.056 44.1674 107.044 43.0817 108.179 42.1441C109.512 41.2064 110.747 40.3675 112.277 39.7753ZM92.1818 127.617C92.4781 128.011 92.7743 128.357 93.1199 128.702C94.4531 130.084 95.8355 131.416 97.4649 132.453C98.5017 133.144 99.6374 133.538 100.97 133.242C102.452 132.897 103.982 132.65 105.562 132.65C106.303 132.65 106.994 132.551 107.735 132.502C108.278 132.453 108.87 132.453 109.413 132.502C110.747 132.601 112.03 132.749 113.363 132.897C113.61 132.946 113.857 132.897 114.104 132.848C116.128 132.403 118.202 132.551 120.226 132.897C120.918 132.996 121.56 133.094 122.35 132.749C122.547 132.255 122.843 131.663 123.041 131.071C123.584 129.344 124.078 127.617 124.621 125.939C124.917 124.952 125.263 123.965 125.608 123.027C126.546 120.51 126.694 117.895 126.398 115.329C126.053 112.417 126.003 109.505 125.904 106.594C125.904 105.952 125.954 105.311 125.954 104.669C125.954 103.386 125.904 102.103 125.855 100.82C125.855 100.425 125.756 100.03 125.559 99.7344C125.164 99.0435 125.114 98.2539 125.164 97.4643C125.263 94.454 125.411 91.4931 125.559 88.4828C125.608 87.5452 125.707 86.6075 126.102 85.7192C126.299 85.3244 126.398 84.9296 126.991 84.7323C127.534 84.9296 128.077 85.1764 128.62 85.6699C128.62 86.0647 128.669 86.4595 128.669 86.8049C128.472 89.5685 128.521 92.3814 128.867 95.1449C128.867 95.2929 128.768 95.4903 129.114 95.4903C129.163 95.2929 129.262 95.1449 129.311 94.9475C129.558 93.8125 129.854 92.6774 130.101 91.5918C130.348 90.6541 130.348 89.7165 130.299 88.7789C130.101 84.5842 129.953 80.3895 129.756 76.1949C129.706 75.1092 129.706 74.0729 129.657 72.9872C129.657 72.5924 129.558 72.2469 129.163 72.0002C128.571 71.5561 128.176 70.9145 127.879 70.273C127.633 69.7795 127.336 69.4834 126.843 69.1873C126.299 68.8419 125.806 68.4471 125.263 68.1016C125.016 67.9536 124.769 67.8055 124.522 67.6575C124.423 67.7562 124.325 67.8055 124.325 67.9042C123.88 69.2367 123.189 70.5197 122.991 71.9015C122.942 72.247 122.745 72.543 122.646 72.8885C122.448 73.4313 122.251 74.0235 122.053 74.5664C121.658 75.6027 121.313 76.639 120.621 77.5766C119.93 78.613 119.239 79.6493 118.548 80.6856C118.301 81.0804 118.005 81.4259 117.659 81.7713C117.363 82.0674 116.968 82.2155 116.474 82.1661C116.128 82.1168 115.783 82.0674 115.487 82.1168C114.351 82.2648 113.265 81.9687 112.277 81.4752C111.24 80.9324 110.253 80.3895 109.216 79.896C108.377 79.5013 107.735 78.9091 107.192 78.1688C106.599 77.3792 106.105 76.5403 105.908 75.5533C105.76 74.9612 105.612 74.4183 105.414 73.8261C105.315 73.53 105.167 73.2833 104.723 73.3326C104.575 73.7274 104.674 74.1716 104.674 74.5664C104.674 76.3429 104.772 78.1688 104.575 79.9454C104.328 82.2155 104.081 84.4362 103.933 86.7062C103.785 89.4204 103.735 92.184 103.637 94.8982C103.686 94.9475 103.735 94.9968 103.834 94.9968C104.279 95.0956 104.772 95.1942 105.217 95.2929C107.192 95.6877 107.537 96.0825 107.29 98.0565C106.994 100.82 107.093 103.534 107.29 106.248C107.389 107.729 107.34 109.259 107.34 110.739C107.34 111.479 107.241 112.17 107.192 112.911C107.142 113.848 107.142 114.786 107.093 115.723C107.093 116.069 106.994 116.414 106.994 116.76C106.945 117.155 106.698 117.352 106.352 117.451C106.204 117.5 106.007 117.549 105.859 117.549C103.686 117.845 101.514 118.092 99.3411 118.339C99.0449 118.388 98.7486 118.388 98.4524 118.388C96.823 118.438 95.1937 118.487 93.5643 118.586C93.3668 118.586 93.1693 118.684 92.8731 118.783C93.3668 119.573 93.3174 120.313 93.1693 121.102C92.9718 122.139 92.7743 123.224 92.6262 124.261C92.3793 125.346 92.0831 126.482 92.1818 127.617ZM64.4335 64.4498C63.7422 64.9926 63.1991 65.3874 62.656 65.7822C61.9154 66.3251 61.1254 66.8679 60.3848 67.4107C59.6442 67.9536 59.101 68.6445 58.7554 69.5328C57.7186 72.395 56.8792 75.3066 56.1386 78.2675C55.5955 80.3895 55.2005 82.5116 54.6574 84.6336C53.5711 88.8776 52.3861 93.0722 51.2999 97.3163C49.9174 102.942 48.0412 108.42 46.2144 113.898C45.2762 116.661 44.5356 119.474 43.795 122.287C43.7456 122.534 43.7456 122.78 43.6963 123.076C43.9925 123.076 44.2394 123.126 44.4863 123.126C45.7206 122.978 46.7575 123.323 47.6956 124.063C48.0906 124.36 48.5349 124.458 49.0287 124.458C49.4731 124.458 49.9174 124.458 50.3124 124.606C51.843 125.05 53.3736 125.495 54.7561 126.235C55.3486 126.531 55.8917 126.827 56.4842 127.074C57.3729 127.468 58.2617 127.617 59.1998 127.715C59.5454 127.172 59.6935 126.679 59.7923 126.136C59.9404 125.396 60.2367 124.754 60.5823 124.113C60.7798 123.767 60.9773 123.422 61.1748 123.126C61.5204 122.583 61.5698 121.991 61.4216 121.399C61.3229 120.856 61.2241 120.313 61.2241 119.77C61.2241 118.882 61.3229 117.993 61.4216 117.105C61.6191 115.427 61.8166 113.799 62.0141 112.121C62.2116 110.344 62.3598 108.518 62.7054 106.742C63.1004 104.669 63.2979 102.597 63.5447 100.524C63.5941 100.08 63.6435 99.685 63.5941 99.2409C63.4954 98.1058 63.6929 97.0202 63.8904 95.9345C63.9397 95.6384 63.9891 95.3423 64.0879 95.0462C64.5322 92.6281 64.9272 90.21 65.4703 87.8412C66.211 84.4362 66.9516 81.0804 67.4947 77.626C67.6922 76.491 67.8897 75.3559 68.2847 74.2703C68.8278 72.7404 69.4203 71.2106 70.3584 69.8782C70.6053 69.5328 70.8521 69.1873 71.3459 69.0886C71.6915 69.2367 72.0371 69.3847 72.3827 69.5328C72.7777 69.7301 73.2221 69.7795 73.6171 69.6808C74.8021 69.3354 75.8883 69.5821 76.9745 70.1743C77.0733 70.2236 77.2214 70.2236 77.3695 70.2236C77.2214 69.8782 77.0239 69.6315 76.7771 69.5328C76.2339 69.3354 75.8389 68.9406 75.6414 68.3977C74.9996 66.8186 75.1971 67.2133 73.5677 66.6705C73.469 66.6212 73.3208 66.6212 73.1727 66.5718C71.6915 66.1277 71.9384 66.3251 71.2965 65.042C71.2471 64.9927 71.1484 64.9433 71.1484 64.894C70.3584 65.042 69.6178 65.1407 68.8772 65.2887C68.2847 65.4368 67.6922 65.3874 67.0997 65.19C66.1616 64.9433 65.2728 64.6965 64.4335 64.4498ZM113.61 182.394C114.647 182.345 115.536 182.246 116.326 181.851C116.968 181.506 117.363 180.963 117.412 180.272C117.461 179.926 117.412 179.581 117.412 179.236C117.461 178.051 117.461 176.818 117.56 175.633C117.807 172.722 118.153 169.859 118.103 166.948C118.103 166.553 118.103 166.158 118.153 165.813C118.449 163.345 118.745 160.878 119.041 158.41C119.14 157.719 119.19 157.029 119.288 156.387C119.634 154.364 120.078 152.34 120.375 150.317C120.671 148.294 120.967 146.27 121.313 144.247C121.806 141.336 122.3 138.424 122.843 135.512C122.893 135.315 122.942 135.068 122.942 134.871C122.942 134.624 122.893 134.377 122.893 134.131C121.461 134.427 120.128 134.673 118.795 134.97C117.659 135.216 116.523 135.315 115.338 135.167C114.203 135.019 113.018 134.97 111.882 134.92C111.685 134.92 111.438 135.019 111.142 135.118C111.339 135.512 111.487 135.808 111.685 136.105C112.129 136.746 112.277 137.437 112.228 138.177C112.228 138.72 112.129 139.263 112.08 139.855C112.03 140.645 112.03 141.385 111.981 142.174C111.932 143.359 111.932 144.593 111.833 145.777C111.783 146.665 111.586 147.554 111.487 148.442C111.142 151.353 110.895 154.314 110.845 157.275C110.845 158.904 110.796 160.532 110.845 162.161C110.845 163.839 110.944 165.517 110.993 167.145C111.043 168.083 111.092 169.02 111.142 169.958C111.24 171.389 111.29 172.87 111.487 174.301C111.734 175.831 112.129 177.311 112.475 178.791C112.672 179.729 112.919 180.716 113.166 181.654C113.363 181.851 113.512 182.098 113.61 182.394ZM96.7736 180.864C96.823 180.765 96.9218 180.617 96.9218 180.519C96.9711 179.433 97.0699 178.397 97.1193 177.311C97.1686 175.436 97.3168 173.56 97.613 171.685C97.7118 171.093 97.8105 170.501 97.8599 169.909C98.008 167.935 98.3043 166.01 98.7486 164.085C99.0942 162.556 99.3905 160.976 99.4892 159.397C99.5386 158.706 99.6374 158.016 99.7855 157.374C100.575 153.87 101.217 150.317 102.205 146.863C102.649 145.283 103.192 143.655 103.39 141.977C103.637 139.904 104.032 137.832 104.772 135.858C104.871 135.66 104.822 135.414 104.871 135.118C104.18 134.92 103.637 134.871 102.995 134.97C102.501 135.019 101.958 135.068 101.464 135.019C100.23 134.97 98.9955 135.118 97.7611 135.315C96.9711 135.463 96.1812 135.611 95.3418 135.71C95.0949 135.759 94.8481 135.809 94.6012 135.907C94.7987 137.338 94.848 138.671 94.6506 140.052C94.5518 140.842 94.5518 141.681 94.5024 142.471C94.5024 142.915 94.5024 143.408 94.4531 143.902C94.3049 145.432 94.1568 146.961 94.0087 148.491C93.8606 150.515 93.6137 152.587 93.7124 154.66C93.7124 155.005 93.7124 155.351 93.6631 155.696C93.6137 156.881 93.5149 158.065 93.5149 159.299C93.4656 160.878 93.4656 162.457 93.4656 164.036C93.4656 166.997 93.3668 169.958 93.4656 172.87C93.5149 175.041 93.8112 177.212 94.0581 179.384C94.1074 179.927 94.1568 180.469 94.5518 181.012C94.8974 180.963 95.2924 180.864 95.638 180.864H96.7736ZM66.6059 121.349C66.5072 121.547 66.4084 121.596 66.4084 121.695C66.1616 123.224 65.4703 124.606 64.7297 125.988C64.5322 126.333 64.4335 126.679 64.3347 127.074C63.4954 129.837 62.7547 132.601 61.2241 135.068C61.1254 135.266 60.9773 135.463 60.9279 135.66C60.8785 135.858 60.8785 136.055 60.8785 136.203C62.2116 136.45 63.4954 136.647 64.7297 136.894C64.8285 136.894 64.9766 136.845 65.1247 136.845C65.1741 136.647 65.2235 136.401 65.3222 136.253C65.4703 136.006 65.6185 135.71 65.816 135.512C66.3097 135.068 66.6553 135.068 67.1491 135.512C67.4947 135.858 67.7909 136.203 68.0872 136.549C68.334 136.845 68.5809 136.993 68.9759 136.993C70.2103 136.943 71.4446 137.042 72.679 136.697C73.1233 136.549 73.6171 136.499 74.0615 136.45C74.9996 136.401 75.9377 136.154 76.7771 135.808C77.4683 135.512 78.1595 135.414 78.9001 135.364C79.937 135.315 80.9245 135.167 81.9613 135.068C82.3563 135.019 82.6032 134.772 82.5045 134.377C82.3563 133.736 82.1589 133.045 81.912 132.403C81.5664 131.515 81.1714 130.676 80.9739 129.739C80.5789 127.715 80.6282 125.741 80.9245 123.718C81.0726 122.632 81.3195 121.547 81.4676 120.412C81.517 119.967 81.7145 119.474 81.4676 119.03C81.3195 119.079 81.1714 119.079 81.0726 119.079C79.0483 119.671 77.0239 119.819 74.9502 119.474C74.2096 119.375 73.5183 119.227 72.7777 119.079C72.2346 118.98 71.7409 119.079 71.3953 119.573C70.8028 120.362 69.9634 120.905 69.2228 121.547C68.8772 121.843 68.4822 121.941 68.0378 121.793C67.6428 121.596 67.1491 121.497 66.6059 121.349ZM100.674 96.1319C99.4892 95.8851 98.403 95.6877 97.2674 95.4903C97.1193 95.8851 96.9711 96.2799 96.823 96.576C96.5761 97.1682 96.3293 97.7604 96.033 98.3526C95.3912 99.7344 94.4531 100.919 93.4656 102.004C92.725 102.794 91.7868 103.386 90.75 103.534C90.3056 103.584 90.0094 103.732 89.7625 104.028C89.4169 104.423 89.0713 104.817 88.775 105.212C88.0838 106.248 87.4913 107.334 86.7507 108.321C85.9113 109.407 85.6151 110.591 85.4669 111.874C85.2694 113.503 85.6644 114.934 86.8494 116.118C87.0963 116.365 87.3925 116.562 87.7381 116.562C88.4294 116.562 89.1206 116.513 89.8119 116.562C90.3056 116.562 90.8487 116.513 91.3425 116.661C92.8731 117.007 94.4037 116.858 95.9343 116.957C97.1193 117.007 98.3536 116.957 99.5386 116.908C100.378 116.908 101.267 116.858 102.106 116.809C102.501 116.76 102.847 116.661 103.192 116.562C103.489 115.477 103.439 114.44 103.291 113.453C103.094 112.22 102.896 110.986 102.6 109.802C102.304 108.37 102.106 106.939 102.106 105.459C102.106 104.817 102.007 104.176 101.76 103.584C101.365 102.597 101.217 101.511 101.119 100.475C101.02 99.0435 100.872 97.6617 100.674 96.1319ZM66.3591 63.1667C67.1491 62.92 67.6922 62.5745 68.1859 62.1798C68.6797 61.7356 69.2228 61.6863 69.8646 61.8837C70.704 62.1304 71.5928 62.3771 72.4321 62.6239C72.7777 62.7226 73.1727 62.8706 73.469 63.1174C74.0121 63.5122 74.6046 63.7096 75.1971 63.907C75.6414 64.0057 76.0858 64.2031 76.5302 64.3018C77.2708 64.4498 77.7152 64.894 78.0114 65.5848C78.5545 66.7199 79.147 67.8055 79.6901 68.8419C80.2332 69.0886 80.6776 69.3354 81.1714 69.5821C81.6651 68.9406 82.0601 68.299 82.2576 67.5588C83.1957 64.6472 83.3932 61.5876 83.2451 58.5279C83.1463 56.4059 82.9982 54.2839 82.8501 52.1126C82.8007 51.3723 82.8007 50.6814 82.8007 49.9412V47.8192C82.0107 47.1777 81.0232 47.0296 80.1839 46.6348C79.147 47.227 78.1102 46.7335 77.0239 46.4374C76.5302 46.8816 76.0858 47.3257 75.5921 47.7205C75.1971 48.0659 74.8021 48.4607 74.2096 48.3127C73.7158 48.214 73.4196 48.4114 73.074 48.7075C72.284 49.349 71.7902 50.1879 71.2471 51.0269C69.6178 53.5437 68.2847 56.2085 67.0997 58.9721C66.6059 60.1564 66.4084 61.5382 66.3591 63.1667ZM49.6212 34.5937C48.6337 34.2976 47.6462 34.1495 46.6587 34.2976C45.4737 34.4456 44.2888 34.5443 43.0544 34.3469C42.8569 34.2976 42.61 34.3469 42.4125 34.3963C40.5363 34.5443 38.6601 34.8898 36.7839 34.5937C36.0926 34.495 35.6483 34.9391 35.5989 35.63C35.5495 36.9624 35.4508 38.2948 35.5989 39.6273C35.9939 42.8843 36.1914 46.092 36.1914 49.349C36.1914 51.323 36.1914 53.2969 36.2407 55.2709C36.2407 55.7644 36.1914 56.3072 36.4382 56.7514C37.1295 56.7514 37.8207 56.702 38.512 56.7514C39.2032 56.8007 39.8451 56.9981 40.5857 56.7514C40.6351 56.5046 40.6844 56.2579 40.7338 56.0111C40.8819 54.7774 41.03 53.5437 41.1782 52.31C41.425 50.0892 42.5113 48.2633 43.795 46.5361C43.9431 46.3387 44.19 46.1413 44.3875 46.0426C45.7206 45.4504 47.1031 45.253 48.5349 45.6972C49.0287 45.8452 49.4237 45.8452 49.8187 45.5491C50.1149 45.3024 50.5099 45.1543 50.8062 44.9076C51.0037 44.7102 51.2012 44.4635 51.3493 44.2661C51.053 43.7232 50.5593 43.4765 50.1643 43.1804C49.7693 42.8349 49.5718 42.4895 49.6212 41.9467C49.6212 41.3545 49.6706 40.7623 49.6706 40.1701V35.9261C49.7199 35.4326 49.6706 35.0378 49.6212 34.5937ZM101.069 66.177C100.822 66.3744 100.674 66.4238 100.625 66.5225C99.4399 67.8055 98.2549 69.0886 97.0699 70.421C96.7736 70.7171 96.5268 71.1119 96.3293 71.4574C95.9343 72.3457 95.5393 73.2339 95.243 74.1716C94.5024 76.5897 93.8606 79.0078 93.1693 81.4752C92.9224 82.3141 92.7743 83.1531 92.6756 83.992C92.4287 85.966 92.1818 87.8906 91.4906 89.7659C91.4412 89.9632 91.3918 90.1606 91.3918 90.4074C91.145 92.0853 90.8487 93.8125 90.355 95.441C89.96 96.7241 89.9106 98.0565 90.1081 99.3889C90.1575 99.5863 90.1575 99.8331 90.5525 99.8331C90.6512 99.7344 90.7994 99.537 90.9969 99.4383C92.2806 98.698 93.1199 97.4149 94.0087 96.2799C94.4037 95.7371 94.8481 95.1942 94.7987 94.454C94.7987 94.3553 94.8481 94.2073 94.9468 94.1086C95.243 93.7138 95.5393 93.319 95.8849 92.8255C96.4774 92.9735 97.1193 92.9735 97.4649 93.6644C97.5143 93.7631 97.6624 93.8125 97.7611 93.8618C98.2055 93.9605 98.6499 94.0592 99.0942 94.1086C99.3905 93.6644 99.2917 93.319 99.2917 92.9242C99.2424 91.9866 99.193 91.0489 99.1436 90.1113C99.0942 86.9036 99.4892 83.6959 99.8349 80.4882C100.032 78.8104 100.329 77.1819 100.526 75.504C100.773 73.2339 101.02 71.0132 101.267 68.7432C101.316 67.9536 101.316 67.164 101.069 66.177ZM74.2096 72.6417C73.6171 73.5794 73.5183 73.8755 73.4196 74.9118C73.3208 76.3429 73.1233 77.7247 72.7777 79.1065C72.4321 80.5869 72.0865 82.1168 71.7409 83.5972C71.6915 83.8933 71.6915 84.1894 71.6421 84.4362C73.2715 85.4725 74.9008 86.4595 76.4808 87.4958C77.172 87.9399 77.7645 88.4828 78.3077 89.075C78.8014 89.6178 79.2951 90.1606 79.7889 90.6541C80.9739 91.6905 82.307 92.4307 83.9363 92.4307C84.8744 91.1476 85.9113 88.1867 85.9607 86.5582C85.5163 86.2621 84.9732 86.0647 84.5782 85.6699C83.1957 84.2388 81.9614 82.7089 81.2701 80.8337C80.5789 78.9091 79.7889 76.9845 79.0483 75.1092C78.9989 74.9612 78.8508 74.8131 78.752 74.6651C77.9127 74.5664 77.0733 74.6157 76.3821 74.1716C75.6908 73.7274 74.9502 73.1352 74.2096 72.6417ZM116.573 58.5773C117.066 58.0838 117.56 57.6396 118.054 57.1462C118.696 56.5046 119.239 55.7644 119.19 54.7774C119.14 53.8398 119.387 53.0008 119.733 52.1619C119.881 51.8165 120.029 51.4217 120.078 51.0762C120.226 50.0892 120.325 49.1023 120.375 48.1646C120.375 47.9179 120.325 47.6711 120.276 47.4244C120.177 47.0296 120.029 46.6842 119.881 46.3387C119.733 45.9439 119.535 45.5491 119.14 45.3024C117.708 45.4998 117.708 45.4504 116.622 44.5128C116.375 44.3154 116.079 44.0687 115.832 43.8219C115.487 43.5258 115.092 43.4271 114.647 43.5258C113.808 43.7726 113.067 44.1674 112.524 44.8582C111.932 45.5985 111.29 46.2894 110.697 46.9803C110.253 47.4737 109.907 47.9672 109.71 48.5594C109.759 48.7075 109.71 48.8062 109.759 48.8555C110.401 49.6945 110.203 50.5334 109.66 51.3723C109.315 51.9645 109.068 52.606 108.722 53.1982C108.377 53.8398 108.377 54.5307 108.623 55.1722C109.018 56.1098 109.413 57.0475 109.808 57.9851C109.957 58.2812 110.154 58.5279 110.401 58.8734C112.475 58.8734 114.45 58.7253 116.573 58.5773ZM104.081 64.4005C104.674 65.6835 105.069 66.9666 105.315 68.2497C105.365 68.5951 105.513 68.9406 105.76 69.1873C106.55 70.1743 106.994 71.3587 107.488 72.4937C107.735 73.0365 108.031 73.53 108.623 73.8261C109.167 74.1222 109.512 74.6157 109.71 75.2079C110.006 75.9975 110.352 76.7871 110.747 77.5766C110.944 78.0208 111.191 78.3662 111.438 78.761C111.783 78.761 112.03 78.8104 112.277 78.8104C113.314 78.9091 113.413 78.8597 113.857 77.9221C114.302 76.9845 114.845 76.1455 115.487 75.3066C116.178 74.4183 116.721 73.4313 117.165 72.4444C118.103 70.3717 119.041 68.299 119.93 66.2264C120.029 65.9796 120.128 65.6835 120.276 65.3874C119.733 64.894 119.239 64.4005 118.745 63.9563C118.498 63.7096 118.251 63.6602 117.906 63.7589C117.659 63.8576 117.412 63.907 117.165 63.9563C115.289 64.5979 113.413 65.0913 111.487 65.4861C109.759 65.8809 108.08 65.6342 106.451 65.1407C105.562 64.9433 104.822 64.6472 104.081 64.4005ZM32.0933 187.23C31.5996 188.118 31.1058 188.908 30.7108 189.698C30.6121 189.895 30.6614 190.142 30.6614 190.388C31.7477 190.537 32.7352 190.537 33.6733 190.29C34.6114 190.043 35.4508 190.191 36.3395 190.487C36.932 190.685 37.5739 190.882 38.1663 191.03C38.907 191.178 39.6476 191.375 40.3388 191.77C41.0794 192.165 41.8694 192.313 42.7088 192.165C43.8444 191.968 44.98 191.82 46.1156 191.573C46.56 191.474 47.0043 191.375 47.35 190.882C46.6587 190.339 45.8687 190.043 45.1281 189.846C44.0419 189.599 43.1531 188.957 42.1657 188.612C41.2769 187.773 40.2894 187.773 39.2032 188.02C38.8576 188.118 38.512 188.118 38.1663 188.168C37.8207 188.217 37.4751 188.266 37.1295 188.217C35.6483 187.921 34.167 187.921 32.7352 187.329C32.6364 187.23 32.3895 187.28 32.0933 187.23ZM93.0212 57.3436C91.9843 56.4553 91.0462 55.567 90.0587 54.7774C89.2688 54.1359 88.8738 53.445 89.3181 52.4086C89.3675 52.2113 89.3675 52.0139 89.3675 51.7671C88.7256 51.6191 88.2319 51.5697 87.7381 52.0632C87.6888 53.1982 87.6888 54.3333 87.6394 55.5176V56.8007C87.7381 59.4656 87.4913 62.0811 86.8988 64.6965C86.8494 64.9433 86.8494 65.19 86.8 65.3874C87.4913 65.9796 88.0838 65.6835 88.5775 65.2394C89.0219 64.894 88.9725 64.4005 88.8738 63.9563C88.8244 63.8083 88.775 63.6109 88.7256 63.4628C88.5281 62.7226 88.3306 61.9824 88.1825 61.2915C89.0219 60.1564 89.8119 59.8604 90.9969 60.1564C91.3425 60.2551 91.6387 60.4032 91.9843 60.4525C92.5275 60.5512 93.0212 60.4032 93.2187 59.811C92.8566 58.9227 92.7908 58.1002 93.0212 57.3436ZM94.1074 196.508C95.0949 195.323 95.3912 194.188 94.3543 192.56C93.5149 192.56 92.6262 192.609 91.7868 193.004C91.0956 193.349 90.4044 193.448 89.6637 193.448H88.1331C87.6394 193.448 87.2444 193.547 86.8 193.744C86.1582 194.09 85.4669 194.336 84.7757 194.583C84.1832 194.781 83.9363 195.126 83.7882 195.669C83.6401 196.212 83.7388 196.705 84.2326 196.853C85.0719 197.149 85.9113 197.544 86.8 196.952C87.4913 196.508 88.2319 196.212 89.0713 196.212C90.7994 196.162 92.4781 195.965 94.1074 196.508ZM54.3611 195.274C54.8549 195.175 55.2499 195.077 55.5955 195.077C56.0398 195.077 56.4348 195.175 56.8792 195.175C57.2742 195.175 57.6198 195.077 58.0148 194.978C59.3973 194.583 60.7798 194.09 62.2116 193.892C62.5572 193.843 62.9029 193.744 63.1991 193.596C64.1372 193.103 65.1247 192.955 66.1616 193.004C66.8528 193.053 67.1491 192.856 67.7416 192.362C66.7047 192.412 65.816 192.017 64.9766 191.721C63.9397 191.375 63.1497 190.833 62.5079 189.994C62.4585 189.944 62.3597 189.895 62.3104 189.846C62.2116 189.846 62.1129 189.796 62.0635 189.846C60.681 190.191 59.3479 190.635 58.3604 191.721C58.1629 191.918 57.9161 192.165 57.7186 192.313C56.9286 192.955 56.0398 193.448 54.9536 193.448C54.7561 193.448 54.5586 193.497 54.4105 193.547C54.3611 194.09 54.3611 194.633 54.3611 195.274ZM49.8681 60.4032C49.5224 59.7123 49.0781 59.1201 48.8806 58.4292C48.5349 57.1462 48.3374 55.8137 48.1399 54.5307C47.9918 53.445 47.9425 52.31 47.7943 51.2243C47.7943 51.0762 47.6956 50.9282 47.5475 50.7308C46.6094 51.9152 46.165 53.2476 46.0662 54.58C45.77 57.9357 45.5725 61.3408 45.375 64.6965C45.375 64.8446 45.4244 65.042 45.4737 65.19C46.0169 65.5355 46.5106 65.8316 47.0537 66.177C47.2512 66.029 47.3993 65.8809 47.5475 65.7329C47.6956 65.5848 47.7943 65.3874 47.9425 65.2394C47.4981 64.6966 47.0537 64.1537 46.6587 63.6109C46.3625 63.2161 46.3625 62.8213 46.6093 62.4265C46.8562 61.8837 47.3006 61.5382 47.8437 61.3408C48.1893 61.1928 48.5843 61.0941 48.9299 61.0447C49.3249 60.8473 49.7199 60.798 49.8681 60.4032ZM94.4531 182.887C94.0581 182.789 93.7124 182.789 93.3174 182.986C92.9224 184.022 92.5768 185.009 92.2312 186.046C91.8856 187.033 91.54 187.97 91.0462 188.859C90.5525 189.796 89.7131 190.487 89.2688 191.622C90.8487 191.425 92.2806 191.227 93.7618 190.981C93.5149 190.043 93.7124 189.155 94.0087 188.217C94.1074 187.872 94.1568 187.477 94.2062 187.082C94.3049 185.7 94.3543 184.368 94.6012 182.986C94.5518 182.986 94.5024 182.986 94.4531 182.887ZM86.9482 82.3635C87.3432 81.1791 87.5406 80.0441 87.6888 78.9091C87.6888 78.761 87.6394 78.5636 87.59 78.4156C87.3431 77.6753 87.0963 76.9845 86.8 76.2442C85.7632 76.3923 85.0719 75.8988 84.3807 75.2572C83.6895 74.5664 82.8995 73.9742 82.2082 73.2339C81.6651 72.6417 81.0232 72.4444 80.1345 72.3456C80.3814 72.5924 80.4307 72.7404 80.5789 72.8391C81.7145 73.6287 82.7513 74.517 83.6895 75.504C84.3807 76.1949 84.9238 76.9351 85.2201 77.8234C85.5163 78.8104 85.8619 79.748 86.2076 80.735C86.405 81.2285 86.5038 81.8207 86.9482 82.3635ZM63.3472 54.8267C63.6435 54.3826 63.9397 53.9385 64.1866 53.4943C64.4335 53.0502 64.8285 52.606 64.9766 52.0139C64.4828 51.6191 64.0385 51.2736 63.5447 50.9282C62.9522 50.484 62.4091 50.0399 61.8166 49.6451C61.6685 49.5464 61.4216 49.5464 61.1748 49.4971C61.1254 49.7932 61.076 49.9906 61.076 50.1879C61.2241 51.2243 61.471 52.2113 62.0635 53.0502C62.3597 53.445 62.261 53.8398 62.3104 54.2346C62.6066 54.432 62.9522 54.6294 63.3472 54.8267ZM114.845 190.685C114.746 190.586 114.647 190.487 114.548 190.438C113.907 190.24 113.265 190.043 112.623 189.846C111.438 191.375 111.092 192.362 111.388 193.744C112.376 193.596 112.771 192.659 113.512 192.214C114.104 191.869 114.548 191.326 114.845 190.685ZM113.117 188.464C113.413 187.724 113.61 187.131 113.808 186.539C113.561 186.144 113.314 185.799 113.117 185.404C112.87 185.009 112.672 184.615 112.425 184.171C112.129 184.812 111.635 186.885 111.586 187.822C112.03 188.069 112.524 188.217 113.117 188.464ZM105.661 59.5149H106.945C107.142 59.5149 107.389 59.5149 107.389 59.1695C107.093 58.9721 106.747 58.7747 106.5 58.5279C106.204 58.2812 106.007 57.9851 105.661 57.689C105.513 58.3305 105.562 58.9227 105.661 59.5149ZM110.845 62.4265C111.833 62.4265 112.771 62.2785 113.66 61.5876C112.524 61.3902 111.734 61.9824 110.845 62.4265ZM63.446 49.9412C63.6929 49.2503 63.6435 49.1023 63.1004 48.7568C62.6066 48.4607 62.5079 48.4607 62.0141 48.9049C62.5079 49.201 62.8535 49.7438 63.446 49.9412ZM107.685 62.92C108.327 63.2161 108.87 62.9693 109.364 62.6732C108.87 62.5746 108.426 62.4265 107.883 62.2785C107.883 62.5252 107.784 62.7226 107.685 62.92ZM105.464 46.7829C105.431 47.3422 105.513 47.7863 105.71 48.1153C105.908 47.5724 106.056 47.1283 105.464 46.7829Z" fill="black"/>
</svg>
