<svg width="22" height="21" viewBox="0 0 22 21" fill="none" xmlns="http://www.w3.org/2000/svg">
<path d="M10.9199 12.2997C12.0988 12.2997 13.0545 11.3439 13.0545 10.165C13.0545 8.98606 12.0988 8.03035 10.9199 8.03035C9.74095 8.03035 8.78523 8.98606 8.78523 10.165C8.78523 11.3439 9.74095 12.2997 10.9199 12.2997Z" fill="#E58252"/>
<path d="M10.9199 0C5.30592 0 0.754883 4.55103 0.754883 10.165C0.754883 15.779 5.30592 20.33 10.9199 20.33C16.5338 20.33 21.0849 15.779 21.0849 10.165C21.0849 4.55103 16.5338 0 10.9199 0ZM17.2001 12.7485C17.1514 13.7149 16.8798 14.6679 16.1755 15.3647C15.4644 16.0681 14.5069 16.3302 13.5312 16.3785H8.30862C7.33278 16.3302 6.3754 16.0683 5.66429 15.3647C4.95998 14.6679 4.68845 13.7149 4.63966 12.7485V7.58146C4.68845 6.61506 4.96002 5.66207 5.66429 4.96524C6.3754 4.26182 7.3329 3.99972 8.30862 3.95146H13.5311C14.507 3.99972 15.4644 4.2617 16.1755 4.96524C16.8798 5.66207 17.1513 6.61506 17.2001 7.58146L17.2001 12.7485Z" fill="#E58252"/>
<path d="M13.4653 5.12899C12.1932 5.09411 9.64705 5.09411 8.37496 5.12899C7.71297 5.14717 6.96251 5.31196 6.49085 5.81574C6.00074 6.3394 5.81553 6.97207 5.79675 7.67984C5.76373 8.92208 5.79675 12.6506 5.79675 12.6506C5.81826 13.3583 6.00074 13.991 6.49085 14.5147C6.96251 15.0186 7.71297 15.1833 8.37496 15.2015C9.64705 15.2363 12.1932 15.2363 13.4653 15.2015C14.1272 15.1833 14.8777 15.0185 15.3494 14.5147C15.8395 13.991 16.0247 13.3584 16.0435 12.6506V7.67984C16.0247 6.97207 15.8395 6.3394 15.3494 5.81574C14.8775 5.3118 14.1271 5.14717 13.4653 5.12899ZM10.9199 13.4739C10.2655 13.4739 9.62584 13.2799 9.08173 12.9163C8.53761 12.5527 8.11353 12.036 7.8631 11.4314C7.61267 10.8268 7.54715 10.1616 7.67482 9.51973C7.80248 8.8779 8.11761 8.28835 8.58034 7.82561C9.04307 7.36288 9.63262 7.04776 10.2745 6.92009C10.9163 6.79243 11.5815 6.85795 12.1861 7.10838C12.7907 7.3588 13.3075 7.78289 13.671 8.327C14.0346 8.87112 14.2287 9.51082 14.2287 10.1652C14.2287 11.0427 13.8801 11.8843 13.2596 12.5048C12.6391 13.1253 11.7975 13.4739 10.9199 13.4739ZM14.2427 7.53948C14.1118 7.53945 13.9839 7.50061 13.8751 7.42788C13.7663 7.35515 13.6815 7.25179 13.6315 7.13087C13.5814 7.00994 13.5683 6.8769 13.5939 6.74854C13.6194 6.62019 13.6825 6.50229 13.775 6.40976C13.8676 6.31723 13.9855 6.25422 14.1138 6.2287C14.2422 6.20318 14.3753 6.2163 14.4962 6.26639C14.6171 6.31648 14.7204 6.40129 14.7931 6.51011C14.8658 6.61893 14.9046 6.74687 14.9046 6.87774C14.9046 6.96466 14.8875 7.05072 14.8542 7.13102C14.821 7.21131 14.7722 7.28427 14.7108 7.34572C14.6493 7.40717 14.5763 7.45591 14.496 7.48916C14.4157 7.5224 14.3296 7.5395 14.2427 7.53948Z" fill="#E58252"/>
</svg>
