<svg width="25" height="12" viewBox="0 0 25 12" fill="none" xmlns="http://www.w3.org/2000/svg">
<rect x="1.35" y="1.35" width="22.3" height="9.37692" rx="4.68846" fill="#4F4F4F" stroke="url(#paint0_linear_4_158)" stroke-width="1.3"/>
<mask id="mask0_4_158" style="mask-type:alpha" maskUnits="userSpaceOnUse" x="2" y="2" width="21" height="9">
<rect x="2" y="2" width="21" height="8.07692" rx="4.03846" fill="black"/>
</mask>
<g mask="url(#mask0_4_158)">
<g filter="url(#filter0_i_4_158)">
<rect x="2" y="2" width="21" height="8.07692" rx="4.03846" fill="#1F2533"/>
</g>
<path d="M3.85769 4.4231L3.92314 4.59996L4.1 4.6654L3.92314 4.73085L3.85769 4.90771L3.79225 4.73085L3.61539 4.6654L3.79225 4.59996L3.85769 4.4231Z" fill="#DEE5F3"/>
<path d="M6.76538 5.71539L6.83082 5.89226L7.00769 5.9577L6.83082 6.02315L6.76538 6.20001L6.69993 6.02315L6.52307 5.9577L6.69993 5.89226L6.76538 5.71539Z" fill="#DEE5F3"/>
<path d="M4.50384 8.62308L4.56929 8.79994L4.74615 8.86539L4.56929 8.93083L4.50384 9.10769L4.4384 8.93083L4.26154 8.86539L4.4384 8.79994L4.50384 8.62308Z" fill="#DEE5F3"/>
<path d="M5.31154 6.20001L5.33336 6.25897L5.39231 6.28078L5.33336 6.3026L5.31154 6.36155L5.28973 6.3026L5.23077 6.28078L5.28973 6.25897L5.31154 6.20001Z" fill="#DEE5F3"/>
<path d="M4.01925 7.33078L4.04106 7.38973L4.10002 7.41155L4.04106 7.43336L4.01925 7.49232L3.99743 7.43336L3.93848 7.41155L3.99743 7.38973L4.01925 7.33078Z" fill="#DEE5F3"/>
<path d="M5.83655 8.94617L5.86927 9.0346L5.9577 9.06732L5.86927 9.10004L5.83655 9.18847L5.80382 9.10004L5.71539 9.06732L5.80382 9.0346L5.83655 8.94617Z" fill="#DEE5F3"/>
<g filter="url(#filter1_f_4_158)">
<path d="M3.73654 5.71539L3.76926 5.80382L3.85769 5.83655L3.76926 5.86927L3.73654 5.9577L3.70382 5.86927L3.61539 5.83655L3.70382 5.80382L3.73654 5.71539Z" fill="#DEE5F3"/>
</g>
<path d="M3.05001 8.13846L3.07182 8.19741L3.13078 8.21923L3.07182 8.24104L3.05001 8.3L3.02819 8.24104L2.96924 8.21923L3.02819 8.19741L3.05001 8.13846Z" fill="#DEE5F3"/>
<path d="M7.08846 7.8154L7.11027 7.87435L7.16923 7.89617L7.11027 7.91798L7.08846 7.97694L7.06664 7.91798L7.00769 7.89617L7.06664 7.87435L7.08846 7.8154Z" fill="#DEE5F3"/>
<path d="M5.6346 3.61539L5.65642 3.67434L5.71537 3.69616L5.65642 3.71797L5.6346 3.77693L5.61279 3.71797L5.55383 3.69616L5.61279 3.67434L5.6346 3.61539Z" fill="#DEE5F3"/>
<path d="M2.40386 6.20001L2.42567 6.25897L2.48463 6.28078L2.42567 6.3026L2.40386 6.36155L2.38204 6.3026L2.32309 6.28078L2.38204 6.25897L2.40386 6.20001Z" fill="#DEE5F3"/>
<path d="M8.05771 2.80771L8.12315 2.98457L8.30001 3.05002L8.12315 3.11546L8.05771 3.29232L7.99226 3.11546L7.8154 3.05002L7.99226 2.98457L8.05771 2.80771Z" fill="#DEE5F3"/>
<path d="M11.7731 4.42307L11.8385 4.59993L12.0154 4.66537L11.8385 4.73082L11.7731 4.90768L11.7076 4.73082L11.5308 4.66537L11.7076 4.59993L11.7731 4.42307Z" fill="#DEE5F3"/>
<path d="M9.51153 8.13846L9.57698 8.31532L9.75384 8.38077L9.57698 8.44621L9.51153 8.62307L9.44609 8.44621L9.26923 8.38077L9.44609 8.31532L9.51153 8.13846Z" fill="#DEE5F3"/>
<path d="M10.3192 4.90768L10.341 4.96664L10.4 4.98845L10.341 5.01027L10.3192 5.06922L10.2974 5.01027L10.2385 4.98845L10.2974 4.96664L10.3192 4.90768Z" fill="#DEE5F3"/>
<path d="M9.67308 6.68463L9.6949 6.74359L9.75385 6.7654L9.6949 6.78722L9.67308 6.84617L9.65127 6.78722L9.59232 6.7654L9.65127 6.74359L9.67308 6.68463Z" fill="#DEE5F3"/>
<path d="M10.5211 5.87692L10.5539 5.96535L10.6423 5.99808L10.5539 6.0308L10.5211 6.11923L10.4884 6.0308L10.4 5.99808L10.4884 5.96535L10.5211 5.87692Z" fill="#DEE5F3"/>
<g filter="url(#filter2_f_4_158)">
<path d="M8.74423 4.42307L8.77695 4.5115L8.86539 4.54422L8.77695 4.57694L8.74423 4.66537L8.71151 4.57694L8.62308 4.54422L8.71151 4.5115L8.74423 4.42307Z" fill="#DEE5F3"/>
</g>
<g filter="url(#filter3_f_4_158)">
<path d="M8.0577 6.68463L8.07951 6.74359L8.13847 6.7654L8.07951 6.78722L8.0577 6.84617L8.03588 6.78722L7.97693 6.7654L8.03588 6.74359L8.0577 6.68463Z" fill="#DEE5F3"/>
</g>
<path d="M12.0962 6.52307L12.118 6.58203L12.1769 6.60384L12.118 6.62566L12.0962 6.68461L12.0743 6.62566L12.0154 6.60384L12.0743 6.58203L12.0962 6.52307Z" fill="#DEE5F3"/>
<path d="M11.2885 3.2923L11.3103 3.35125L11.3692 3.37307L11.3103 3.39488L11.2885 3.45384L11.2667 3.39488L11.2077 3.37307L11.2667 3.35125L11.2885 3.2923Z" fill="#DEE5F3"/>
<path d="M7.41155 4.90768L7.43336 4.96664L7.49232 4.98845L7.43336 5.01027L7.41155 5.06922L7.38973 5.01027L7.33078 4.98845L7.38973 4.96664L7.41155 4.90768Z" fill="#DEE5F3"/>
</g>
<defs>
<filter id="filter0_i_4_158" x="2" y="2" width="21" height="15.8769" filterUnits="userSpaceOnUse" color-interpolation-filters="sRGB">
<feFlood flood-opacity="0" result="BackgroundImageFix"/>
<feBlend mode="normal" in="SourceGraphic" in2="BackgroundImageFix" result="shape"/>
<feColorMatrix in="SourceAlpha" type="matrix" values="0 0 0 0 0 0 0 0 0 0 0 0 0 0 0 0 0 0 127 0" result="hardAlpha"/>
<feOffset dy="7.8"/>
<feGaussianBlur stdDeviation="5.85"/>
<feComposite in2="hardAlpha" operator="arithmetic" k2="-1" k3="1"/>
<feColorMatrix type="matrix" values="0 0 0 0 0.0903125 0 0 0 0 0.105719 0 0 0 0 0.141667 0 0 0 1 0"/>
<feBlend mode="normal" in2="shape" result="effect1_innerShadow_4_158"/>
</filter>
<filter id="filter1_f_4_158" x="3.35539" y="5.45539" width="0.76231" height="0.76231" filterUnits="userSpaceOnUse" color-interpolation-filters="sRGB">
<feFlood flood-opacity="0" result="BackgroundImageFix"/>
<feBlend mode="normal" in="SourceGraphic" in2="BackgroundImageFix" result="shape"/>
<feGaussianBlur stdDeviation="0.13" result="effect1_foregroundBlur_4_158"/>
</filter>
<filter id="filter2_f_4_158" x="8.36308" y="4.16307" width="0.76231" height="0.76231" filterUnits="userSpaceOnUse" color-interpolation-filters="sRGB">
<feFlood flood-opacity="0" result="BackgroundImageFix"/>
<feBlend mode="normal" in="SourceGraphic" in2="BackgroundImageFix" result="shape"/>
<feGaussianBlur stdDeviation="0.13" result="effect1_foregroundBlur_4_158"/>
</filter>
<filter id="filter3_f_4_158" x="7.71693" y="6.42463" width="0.68153" height="0.68153" filterUnits="userSpaceOnUse" color-interpolation-filters="sRGB">
<feFlood flood-opacity="0" result="BackgroundImageFix"/>
<feBlend mode="normal" in="SourceGraphic" in2="BackgroundImageFix" result="shape"/>
<feGaussianBlur stdDeviation="0.13" result="effect1_foregroundBlur_4_158"/>
</filter>
<linearGradient id="paint0_linear_4_158" x1="12.7423" y1="0.0615386" x2="12.8231" y2="12.5808" gradientUnits="userSpaceOnUse">
<stop offset="0.125"/>
<stop offset="1" stop-color="white" stop-opacity="0"/>
</linearGradient>
</defs>
</svg>
