<svg width="7" height="6" viewBox="0 0 7 6" fill="none" xmlns="http://www.w3.org/2000/svg">
<rect width="5.69711" height="5.69711" rx="2.84855" transform="matrix(-1 3.99602e-09 3.99602e-09 1 6.6911 0.178223)" fill="#FFC875"/>
</svg>
