{
"numeric": ["1", "2", "3", "4", "5", "6", "7", "8", "9", "10", "11", "12"],
"English":["January","February","March","April","May","June","July","August","September","October","November","December"],
"Abkhaz":["ажьырныҳәа (āž̍ərnəh°̍ā)","жәабран (ž°ābrān)","хәажәкыра (x°āž°ḳərā)","мшаҧы (mšāpə)","лаҵара (lāc̣ārā)","рашәара (rāš°ārā)","ҧхынгәы (pxəng°ə)","нанҳәа (nānh°̍ā)","цәыббра (c°əbbrā)","жьҭаара (ž̍tāārā)","абҵара (ābc̣ārā)","ҧхынҷкәын (pxənč̣̍ḳ°ən)"],
"Afrikaans":["januarie","februarie","maart","april","mei","junie","julie","augustus","september","oktober","november","desember"],
"Amharic":["ጃንዩዌሪ (ǧanyuweri)","ፌብሩወሪ (februwări)","ማርች (marč)","ኤፕረል (ʾepräl)","መይ (mäy)","ጁን (ǧun)","ጁላይ (ǧulay)","ኦገስት (ʾogäst)","ሰፕቴምበር (septembär)","ኦክተውበር (ʾokətäwbär)","ኖቬምበር (novembär)","ዲሴምበር (disembär)"],
"Arabic 1":["يَنَايِر‎ (yanāyir)","فِبْرَايِر‎ (fibrāyir)","مَارِس‎ (māris)","أَبْرِيل‎ (ʾabrīl)","مَايُو‎ (māyū)","يُونِيُو‎ (yūniyō)","يُولِيُو‎ (yūliyō)","أَغُسْطُس‎ (ʾaḡusṭus)","سِبْتِمْبِر‎ (sibtimbir)","أُكْتُوبِر‎ (ʾoktōbir)","نُوفِمْبِر‎ (nūfimbir, novembir)","دِيسِمْبِر‎ (disembir)"],
"Arabic 2":["يناير يُولِيُو‎ (yanāyir)","فبراير‎ (fibrāyir)","مَارْس‎ (mārs)","أَبْرِيل‎ (ʾabrīl)","مايو‎ (māyū)","يونيو‎ (yūniyō)","يوليوز‎ (yūliyō)","اغسطس‎ (ʾaḡusṭus)","سِبْتَمْبِر‎ (sibtambir)","أكتوبر ‎ (ʾoktōbir)","نونبر‎ (nūfimbir, novembir)","دِيسَمْبِر‎ (disambir)"],
"Arabic 3":["يَنَايِر‎ (yanāyir)","فِبْرَايِر‎ (fibrāyir)","مارس‎(mārs)","ابريل‎ (ʾabrīl)","ماي‎ (māyū)","يُونِيُو‎ (yūniyō)","يُولِيُو‎ (yūliyō)","غشث ‎(ʾaḡusṭus)","شتنبر‎ (sibtambir)","أُكْتُوبِر‎ (ʾoktōbir)","نُوفِمْبِر‎ (nūfimbir, novembir)","دجنبر‎ (disambir)"],
"Arabic 4":["يَنَايِر‎ (yanāyir)","فِبْرَايِر‎ (fibrāyir)","مارس‎ (mārs)","ابريل‎ (ʾabrīl)","ماي‎ (māyū)","يُونِيُو‎ (yūniyō)","يُولِيُو‎ (yūliyō)","غشث‎ (ʾaḡusṭus)","سَبْتَمْبَر‎ (sabtambar)","أُكْتُوبِر‎ (ʾoktōbir)","نُوفِمْبِر‎ (nūfimbir, novembir)","ديسمبر‎ (disambir)"],
"Persan":["ژانویه‎ (jan)","فِبْرَايِر‎ (feb)","مارس‎ (mar)","آوریل‎ (avr)","ممکن است‎ (mai)","ژوئن‎ (juin)","جولای‎ (juillet)","مرداد‎ (aout)","سپتامبر‎ (sept)","اکتبر‎ (oct)","نوامبر‎ (nov)","دسامبر‎ (dec)"],
"Persan 2":["ژانویه‎ (jan)","فِبْرَايِر‎ (feb)","مارس‎ (mar)","آوریل‎ (avr)","مه‎ (mai)","ژوئن‎ (juin)","جولای‎ (juillet)","مرداد‎ (aout)","سپتامبر‎ (sept)","اکتبر‎ (oct)","نوامبر‎ (nov)","دسامبر‎ (dec)"],
"Armenian":["հունվար (hunvar)","փետրվար (pʿetrvar)","մարտ (mart)","ապրիլ (april)","մայիս (mayis)","հունիս (hunis)","հուլիս (hulis)","օգոստոս (ōgostos)","սեպտեմբեր (september)","հոկտեմբեր (hoktember)","նոյեմբեր (noyember)","դեկտեմբեր (dektember)"],
"Bashkir":["һыуығай (hïwïğay)","шаҡай (šaqay)","буранай (buranay)","алағарай (alağaray)","һабанай (habanay)","һөтай (hötay)","майай (mayay)","урағай (urağay)","һарысай (harïsay)","ҡарасай (qarasay)","ҡырпағай (qïrpağay)","аҡъюлай (aqʺyulay)"],
"Belarusian":["сту́дзень (stúdzjenʹ)","лю́ты (ljúty)","сакаві́к (sakavík)","красаві́к (krasavík)","тра́вень (trávjenʹ)","чэ́рвень (čérvjenʹ)","лі́пень (lípjenʹ)","жні́вень (žnívjenʹ)","ве́расень (vjérasjenʹ)","кастры́чнік (kastrýčnik)","лістапа́д (listapád)","сне́жань (snjéžanʹ)"],
"Bengali":["জানুয়ারি (januyari)","ফেব্রুয়ারি (phebruyari)","মার্চ (marc)","এপ্রিল (epril)","মে (me)","জুন (jun)","জুলাই (julai)","আগস্ট, অগাস্ট (agôsṭô, ôgasṭ)","সেপ্টেম্বর (sepṭembôr)","অক্টবর (ôkṭbôr)","নভেম্বর (nôbhembôr)","ডিসেম্বর (ḍisembôr)"],
"Bosnian":["januar","februar","mart","april","maj","juni","juli","august, avgust","septembar","oktobar","novembar","decembar"],
"Bulgarian":["януа́ри (januári)","февруа́ри (fevruári)","март (mart)","апри́л (apríl)","май (maj)","ю́ни (júni)","ю́ли (júli)","а́вгуст (ávgust)","септе́мври (septémvri)","окто́мври (októmvri)","ное́мври (noémvri)","деке́мври (dekémvri)"],
"Burmese":["ဇန်နဝါရီ (janna.wari)","ဖေဖော်ဝါရီ (hpehpauwari)","မတ် (mat)","ဧပြီ (e-pri)","မေ (me)","ဇွန် (jwan)","ဇူလိုင် (juluing)","ဩဂုတ် (au:gut)","စက်တင်ဘာ (caktangbha)","အောက်တိုဘာ (auktuibha)","နိုဝင်ဘာ (nuiwangbha)","ဒီဇင်ဘာ (dijangbha)"],
"Buryat":["нэгэдүгээр һара (negedügeer hara)","хоёрдугаар һара (xojordugaar hara)","гурбадугаар һара (gurbadugaar hara)","дүрбэдүгээр һара (dürbedügeer hara)","табадугаар һара (tabadugaar hara)","зургадугаар һара (zurgadugaar hara)","долоодугаар һара (doloodugaar hara)","наймадугаар һара (najmadugaar hara)","юһэдүгээр һара (juhedügeer hara)","арбадугаар һара (arbadugaar hara)","арбан нэгэдүгээр һара (arban negedügeer hara)","арбан хоёрдугаар һара (arban xojordugaar hara)"],
"Chechen":["Дечкен-бутт (Dečken-butt)","Чиллан-бутт (Čillan-butt)","Зазадоккху-бутт (Zazadoqːu-butt)","Оханан-бутт (Oχanan-butt)","Стигалкъекъа-бутт (Stigalq̇eq̇a-butt)","Мангалан-бутт (Mangalan-butt)","Товбецан-бутт (Towbecan-butt)","Марсхьокху-бутт (Marsḥoqu-butt)","Гезгмашан-бутт (Gezgmašan-butt)","Гӏадужу-бутт (Ġadužu-butt)","Лахьанан-бутт (Laḥanan-butt)","Гӏуран-бутт (Ġuran-butt)"],
"Cherokee":["ᏚᏃᎸᏔᏂ (dunolvtani)","ᎧᎦᎵ (kagali)","ᎤᏄᎳᎯ (unulahi)","ᏥᎶᏂ (tsiloni)","ᎠᏅᎢᏍᎬᏘ (anvisgvti)","ᏓᏣᎷᏂ (datsaluni)","ᎫᏰᏉᏂ (guyequoni)","ᎦᎶᏂ (galoni)","ᏚᎵᏍᏗ (dulisdi)","ᏚᏂᏅᏗ (duninvdi)","ᏄᏓᏕᏆ (nudadequa)","ᎥᏍᎩᎦ (vsgiga)"],
"Chinese":["一月 (yīyuè)","二月 (èryuè)","三月 (sānyuè)","四月 (sìyuè)","五月 (wǔyuè)","六月 (liùyuè)","七月 (qīyuè)","八月 (bāyuè)","九月 (jiǔyuè)","十月 (shíyuè)","十一月 (shíyīyuè)","十二月 (shí'èryuè)"],
"Chuvash":["кӑрлач (kărlač)","нарӑс (narăs)","пуш (puš)","ака (aka)","ҫу (śu)","ҫертме (śertme)","утӑ (ută)","ҫурла (śurla)","авӑн (avăn)","юпа (jupa)","чӳк (čük)","раштав (raštav)"],
"Crimean Tatar":["yanvar","fevral","mart","aprel","mayıs","iyun","iyul","avgustos","sentâbr","oktâbr","noyabr","dekabr"],
"Croatian":["siječanj","veljača","ožujak","travanj","svibanj","lipanj","srpanj","kolovoz","rujan","listopad","studeni","prosinac"],
"Czech":["leden","únor","březen","duben","květen","červen","červenec","srpen","září","říjen","listopad","prosinec"],
"Danish":["januar","februar","marts","april","maj","juni","juli","august","september","oktober","november","december"],
"Dutch":["januari","februari","maart","april","mei","juni","juli","augustus","september","oktober","november","december"],
"Erzya":["якшамков (jakšamkov)","даволков (davolkov)","эйзюрков (ejzjurkov)","чадыков (čadykov)","панжиков (panžikov)","аштемков (aštemkov)","медьков (medʹkov)","умарьков (umarʹkov)","таштыков (taštykov)","ожоков (ožokov)","суньдерьков (sunʹderʹkov)","ацамков (acamkov)"],
"Esperanto":["januaro","februaro","marto","aprilo","majo","junio","julio","aŭgusto","septembro","oktobro","novembro","decembro"],
"Estonian":["jaanuar","veebruar","märts","aprill","mai","juuni","juuli","august","september","oktoober","november","detsember"],
"Faroese":["januar","februar","mars","apríl","mai","juni","juli","august","september","oktober","november","desember"],
"Finnish":["tammikuu","helmikuu","maaliskuu","huhtikuu","toukokuu","kesäkuu","heinäkuu","elokuu","syyskuu","lokakuu","marraskuu","joulukuu"],
"French":["janvier","février","mars","avril","mai","juin","juillet","août","septembre","octobre","novembre","décembre"],
"French_abbr":["jan","fév","mar","avr","mai","juin","juil","août","sept","oct","nov","déc"],
"Galician":["xaneiro","febreiro","marzo","abril","maio","xuño","xullo","agosto","setembro","outubro","novembro","decembro"],
"Georgian":["იანვარი (ianvari)","თებერვალი (tebervali)","მარტი (marṭi)","აპრილი (aṗrili)","მაისი (maisi)","ივნისი (ivnisi)","ივლისი (ivlisi)","აგვისტო (agvisṭo)","სექტემბერი (sekṭemberi)","ოქტომბერი (okṭomberi)","ნოემბერი (noemberi)","დეკემბერი (deḳemberi)"],
"German":["Januar","Februar","März","April","Mai","Juni","Juli","August","September","Oktober","November","Dezember"],
"Greek":["Ιανουάριος","Φεβρουάριος","Μάρτιος","Απρίλιος","Μάιος","Ιούνιος","Ιούλιος","Αύγουστος","Σεπτέμβριος","Οκτώβριος","Νοέμβριος","Δεκέμβριος"],
"Greek latin":["Ianouários","Fevrouários","Mártios","Aprílios","Máios","Ioúnios","Ioúlios","Ávgoustos","Septémvrios","Októvrios","Noémvrios","Dekémvrios"],
"Greek demosphere":["Ιανουαρίου", "Φεβρουαρίου", "Μαρτίου", "Απριλίου", "Μαίου", "Ιουνίου", "Ιουλίου", "Αυγούστου", "Σεπτεμβρίου", "Οκτωβρίου", "Νοέμβριος", "Δεκεμβρίου"],
"Haitian Creole":["janvye","fevriye","mas","avril","me","jen","jiyè","out","septanm","oktòb","novanm","desanm"],
"Hawaiian":["Ianuali","Pepeluali","Malaki","ʻApelila","Mei","Iune","Iulai","ʻAukake","Kepakemapa","ʻOkakopa","Nowemapa","Kēkēmapa"],
"Hebrew":["ינואר‎","פברואר‎","מרץ‎","אפריל‎","מאי‎","יוני‎","יולי‎","אוגוסט‎","ספטמבר‎","אוקטובר‎","נובמבר‎","דצמבר‎"],
"Hindi":["जनवरी (janvarī)","फ़रवरी (farvarī)","मार्च (mārc)","अप्रैल (aprail)","मई (maī)","जून (jūn)","जुलाई (julāī)","अगस्त (agast)","सितंबर (sitambar)","अक्टूबर (akṭūbar)","नवंबर (navambar)","दिसंबर (disambar)"],
"Hungarian":["január","február","március","április","május","június","július","augusztus","szeptember","október","november","december"],
"Icelandic":["janúar,janúarmánuður(confer þorri)","febrúar,febrúarmánuður(confer góa)","mars,marsmánuður(confer einmánuður)","apríl,aprílmánuður(confer harpa)","maí,maímánuður(confer skerpla)","júní,júnímánuður(confer sólmánuður)","júlí,júlímánuður(confer heyannir)","ágúst,ágústmánuður(confer tvímánuður)","september,septembermánuður(confer haustmánuður)","október,októbermánuður(confer gormánuður)","nóvember,nóvembermánuður(confer ýlir)","desember,desembermánuður(confer mörsugur)"],
"Indonesian":["Januari","Februari","Maret","April","Mei","Juni","Juli","Agustus","September","Oktober","November","Desember"],
"Irish":["Eanáir","Feabhra","Márta","Aibreán","Bealtaine","Meitheamh","Iúil","Lúnasa","Meán Fómhair","Deireadh Fómhair","Samhain","Mí na Nollag"],
"Italian":["gennaio","febbraio","marzo","aprile","maggio","giugno","luglio","agosto","settembre","ottobre","novembre","dicembre"],
"Italian 2":["gen","feb","mar","apr","mag","giu","lug","ago","set","ott","nov","dic"],
"Japanese":["一 (いち)月 (がつ) (ichigatsu)","二 (に)月 (がつ) (nigatsu)","三 (さん)月 (がつ) (sangatsu)","四 (し)月 (がつ) (shigatsu)","五 (ご)月 (がつ) (gogatsu)","六 (ろく)月 (がつ) (rokugatsu)","七 (しち)月 (がつ) (shichigatsu)","八 (はち)月 (がつ) (hachigatsu)","九 (く)月 (がつ) (kugatsu)","十 (し)月 (がつ) (shigatsu)","十一 (いち)月 (がつ) (jūichigatsu)","十二 (に)月 (がつ) (jūnigatsu)"],
"Kalmyk":["туула сар (tuula sar)","лу сар (lu sar)","моһа сар (moha sar)","мөрн сар (mörn sar)","хөн сар (xön sar)","мөчн сар (möçn sar)","така сар (taka sar)","ноха сар (noxa sar)","һаха сар (haxa sar)","хулһн сар (xulhn sar)","үкр сар (ükr sar)","бар сар (bar sar)"],
"Kazakh":["қантар (qantar)","ақпан (aqpan)","наурыз (nawrız)","сәуір (säwir)","мамыр (mamır)","маусым (mawsım)","шілде (şilde)","тамыз (tamız)","қыркүйек (qırküyek)","қазан (qazan)","қараша (qaraşa)","желтоқсан (jeltoqsan)"],
"Khmer":["មករា (mĕəʾkaʾraa)","កុម្ភៈ (komphĕəʾ)","មីនា (miinaa)","មេសា (meisaa)","ឧសភា (ʾosaʾphiə)","មិថុនា (mithonaa)","កក្កដា (kɑkkaʾdaa)","សីហា (səyhaa)","កញ្ញា (kaññaa)","តុលា (tolaa)","វិច្ឆិកា (vɨcchekaa)","ធ្នូ (thnuu)"],
"Korean":["일월 (一月, irwol)","이월 (二月, iwol)","삼월 (三月, samwol)","사월 (四月, sawol)","오월 (五月, owol)","유월 (六月, yuwol)","칠월 (七月, chirwol)","팔월 (八月, parwol)","구월 (九月, guwol)","시월 (十月, siwol)","십일월 (十一月, sibirwol)","십이월 (十二月, sibiwol)"],
"Latin":["ມັງກອນ (mang kǭn)","ກຸມພາ (kum phā)","ມີນາ (mī nā)","ເມສາ (mē sā)","ພຶດສະພາ (phưt sa phā)","ມີຖຸນາ (mī thu nā)","Iūlius, Quintīlis","Augustus, Sextīlis","September","Octōber","November","December"],
"Lao":["Iānuārius","Februārius","Mārtius","Aprīlis","Māius","Iūnius","ກໍລະກົດ (kǭ la kot)","ສິງຫາ (sing hā)","ກັນຍາ (kan nyā)","ຕຸລາ (tu lā)","ພະຈິກ (pha chik)","ທັນວາ (than wā)"],
"Latvian":["janvāris","februāris","marts","aprīlis","maijs","jūnijs","jūlijs","augusts","septembris","oktobris","novembris","decembris"],
"Lezgi":["гьер(her)","эхем(ėḫem)","ибне(ibne)","нава(nava)","тӏул(ṭul)","къамуг(q̄amug)","чиле (čile)","пахун (paχun)","мара (mara)","баскӏум (basḳum)","цӏехуьл (c̣eχül)","фандукӏ (fanduḳ)"],
"Lithuanian":["sausis","vasaris","kovas","balandis","gegužė","birželis","liepa","rugpjūtis","rugsėjis","spalis","lapkritis","gruodis"],
"Luxembourgish":["Januar","Februar","Mäerz","Abrëll","Mee","Juni","Juli","August","September","Oktober","November","Dezember"],
"Macedonian":["јануа́ри (januári)","февруа́ри (fevruári)","март (mart)","а́прил (ápril)","мај (maj)","ју́ни (júni)","ју́ли (júli)","а́вгуст (ávgust)","септе́мври (septémvri)","окто́мври (októmvri)","ное́мври (noémvri)","деке́мври (dekémvri)"],
"Malay":["Januariجانواري‎","Februariفيبرواري‎","Macمچ‎","Aprilاڤريل‎","Meiمي‎","Junجون‎","Julaiجولاي‎","Ogosاوݢوس‎","Septemberسيڤتيمبر‎","Oktoberاوکتوبر‎","Novemberنوۏيمبر‎","Disemberديسيمبر‎"],
"Malayalam":["ജനുവരി (januvari)","ഫെബ്രുവരി (phebruvari)","മാര്ച്ച് (mārccŭ)","ഏപ്രില് (ēprilŭ)","മേയ് (mēyŭ)","ജൂണ് (jūṇŭ)","ജൂലൈ (jūlai)","ആഗസ്റ്റ് (āgasṟṟŭ)","സെപ്റ്റംബര് (sepṟṟambarŭ)","ഒക്ടോബര് (okṭōbarŭ)","നവംബര് (navambarŭ)","ഡിസംബര് (ḍisambarŭ)"],
"Moksha":["кельмеков (kelʹmekov)","уфайков (ufajkov)","марайков (marajkov)","шудиков (šudikov)","панжиков (panžikov)","лямбеков (ljambekov)","псиков (psikov)","сёроньков (sjoronʹkov)","тюжягов (tjužjagov)","кельмазаков (kelʹmazakov)","эйндамков (ejndamkov)","кучкаков (kučkakov)"],
"Mongolian":["нэгдүгээр сар (negdügeer sar)","хоёрдугаар сар (hojordugaar sar)","гуравдугаар сар (guravdugaar sar)","дөрөвдүгээр сар (dörövdügeer sar)","тавдугаар сар (tavdugaar sar)","зургадугаар сар (zurgadugaar sar)","долоодугаар сар (doloodugaar sar)","наймдугаар сар (najmdugaar sar)","есдүгээр сар (jesdügeer sar)","аравдугаар сар (aravdugaar sar)","арваннэгдүгээр сар (arvannegdügeer sar)","арванхоёрдугаар сар (arvanhojordugaar sar)"],
"Navajo":["Yas Niłtʼees","Atsá Biyáázh","Wóózhchʼį́į́d","Tʼą́ą́chil","Tʼą́ą́tsoh","Yaʼiishjááshchilí","Yaʼiishjáástsoh","Biniʼantʼą́ą́tsʼózí","Biniʼantʼą́ą́tsoh","Ghąąjįʼ","Níłchʼitsʼósí","Níłchʼitsoh"],
"Norwegian (Bokmål and Nynorsk)":["januar","februar","mars","april","mai","juni","juli","august","september","oktober","november","desember"],
"Ojibwe":["gichi-manidoo-giizis","namebini-giizis","onaabani-giizis","iskigamizige-giizis","zaagibagaa-giizis","ode'imini-giizis","aabita-niibino-giizis","manoominike-giizis","waatebagaa-giizis","binaakwe-giizis","gashkadino-giizis","manidoo-giizisoons"],
"Old English":["se æfterra ġēola","solmōnaþ","hreþmōnaþ","ēastermōnaþ","þrimilce","se ǣrra līþa","se æfterra līþa","wēodmōnaþ","hærfestmōnaþ","winterfylleþ","blōtmōnaþ","se ǣrra ġēola"],
"Old High German":["hartimānōd","hornung","lenzinmānōd","ōstarmānōd","drīmilki, winnimānōd","brāhmānōd","hewimānōd, houmānōd","aranmānōd","witumānōd, herbistmānōd","windumemānōd","wintarmānōd",""],
"Old Norse":["morsugr or jól (first half of the month) and þorri (latter half)","þorri and gói; kyndilsmessa","gói and einmánuðr","einmánuðr","","sólmánuðr","sólmánuðr and heyannir","heyannir and tvímánuðr","tvímánuðr and haustmánuðr","haustmánuðr and gormánuðr","gormánuðr and frermánuðr","frermánuðr and morsugr or jól"],
"Old Prussian":["Janwārs / Rags","Februārs / Wassarins","Mārts / Pūlis","Aprīls / Sakkis","Maījs / Zallaws","Jūnijs / Sīmenis","Jūlijs / Līpa","August / Daggis","Septēmberis / Sillin","Uktōberijs / Spallins","Nuwēmberis / Lapkrūtis","Decēmberis / Sallaws"],
"Polish":["styczeń","luty","marzec","kwiecień","maj","czerwiec","lipiec","sierpień","wrzesień","październik","listopad","grudzień"],
"Polish 2":["sty","lut","mar","kwi","maj","cze","lip","sie","wrz","paź","lis","gru"],
"Portuguese":["janeiro","fevereiro","março","abril","maio","junho","julho","agosto","setembro","outubro","novembro","dezembro"],
"Romanian":["ianuarie","februarie","martie","aprilie","mai","iunie","iulie","august","septembrie","octombrie","noiembrie","decembrie"],
"Russian":["янва́рь (janvárʹ)","февра́ль (fevrálʹ)","март (mart)","апре́ль (aprélʹ)","май (maj)","июнь (ijunʹ)","ию́ль (ijúlʹ)","а́вгуст (ávgust)","сентя́брь (sentjábrʹ)","октя́брь (oktjábrʹ)","ноя́брь (nojábrʹ)","дека́брь (dekábrʹ)"],
"Russian 2":["янва́рь (janvárʹ)","февра́ль (fevrálʹ)","март (mart)","апре́ль (aprélʹ)","мая (maj)","июнь (ijunʹ)","ию́ль (ijúlʹ)","а́вгуст (ávgust)","сентя́брь (sentjábrʹ)","октя́брь (oktjábrʹ)","ноя́брь (nojábrʹ)","дека́брь (dekábrʹ)"],
"Serbian":["јануар, januar","фебруар, februar","март, mart","април, april","мај, maj","јун, jun; јуни, juni","јул, jul; јули, juli","август, avgust","септембар, septembar","октобар, oktobar","новембар, novembar","децембар, decembar"],
"Sinhalese":["ජනවාරි (janavāri)","පෙබරවාරි (pebaravāri)","මාර්‍තු (mār‍tu)","අප්‍රේල් (ap‍rēl)","මැයි (mæyi)","ජූනි (jūni)","ජූලි (jūli)","අගෝස්‍තු (agōs‍tu)","සැප්‍තැම්‍බර් (sæp‍tæm‍bar)","ඔක්‍තෝබර් (ok‍tōbar)","නොවැම්‍බර් (novæm‍bar)","දෙසැම්‍බර් (desæm‍bar)"],
"Slovak":["január","február","marec","apríl","máj","jún","júl","august","september","október","november","december"],
"Slovenian":["prosinec","svečan","sušec","mali traven","veliki traven","rožnik","mali srpan","veliki srpan","kimovec","vinotok","listopad","gruden"],
"Spanish":["enero","febrero","marzo","abril","mayo","junio","julio","agosto","septiembre","octubre","noviembre","diciembre"],
"Swahili":["Januari","Februari","Machi","Aprili","Mei","Juni","Julai","Agosti","Septemba","Oktoba","Novemba","Desemba"],
"Swedish":["januari","februari","mars","april","maj","juni","juli","augusti","september","oktober","november","december"],
"Tagalog":["Enero","Pebrero","Marso","Abril","Mayo","Hunyo","Hulyo","Agosto","Setyembre","Oktubre","Nobyembre","Disyembre"],
"Tamil":["ஜனவரி (jaṉavari)","பெப்ரவரி (pepravari)","மார்ச் (mārc)","ஏப்ரல் (ēpral)","மே (mē)","ஜூன் (jūṉ)","ஜூலை (jūlai)","ஆகஸ்ட் (ākasṭ)","செப்டம்பர் (cepṭampar)","அக்டோபர் (akṭōpar)","நவம்பர் (navampar)","டிசம்பர் (ṭicampar)"],
"Tatar":["гыйнвар (ğıynwar)","февраль (fewral’)","март (mart)","апрель (aprel’)","май (may)","июнь (iyun’)","июль (iyul’)","август (awgust)","сентябрь (sentyabr’)","октябрь (oqtyabr’)","ноябрь (noyabr’)","декабрь (dekabr’)"],
"Telugu":["జనవరి (janavari)","ఫిబ్రవరి (phibravari)","మార్చి (mārci)","ఏప్రిల్ (ēpril)","మే (mē)","జూన్ (jūn)","జూలై (jūlai)","ఆగష్టు (āgaṣṭu)","సెప్టెంబర్ (sepṭembar)","అక్టోబర్ (akṭōbar)","నవంబర్ (navambar)","డిసెంబర్ (ḍisembar)"],
"Thai":["มกราคม (má-gà-raa-kom)","กุมภาพันธ์ (gum-paa-pan)","มีนาคม (mii-naa-kom)","เมษายน (mee-sǎa-yon)","พฤษภาคม (prʉ́t-sà-paa-kom)","มิถุนายน (mí-tù-naa-yon)","กรกฎาคม (gà-rá-gà-daa-kom)","สิงหาคม (sǐng-hǎa-kom)","กันยายน (gan-yaa-yon)","ตุลาคม (dtù-laa-kom)","พฤศจิกายน (prʉ́t-sà-jì-gaa-yon)","ธันวาคม (tan-waa-kom)"],
"Tibetan":["ཟླ་དང་པོ། (zla dang po)","ཟླ་གཉིས་པ། (zla gnyis pa)","ཟླ་གསུམ་པ། (zla gsum pa)","ཟླ་བཞི་པ། (zla bzhi pa)","ཟླ་ལྔ་པ། (zla lnga pa)","ཟླ་དྲུག་པ། (zla drug pa)","ཟླ་བདུན་པ། (zla bdun pa)","ཟླ་བརྒྱད་པ། (zla brgyad pa)","ཟླ་དགུ་པ། (zla dgu pa)","ཟླ་བཅུ་པ། (zla bcu pa)","ཟླ་བཅུ་གཅིག་པ། (zla bcu gcig pa)","ཟླ་བཅུ་གཉིས་པ། (zla bcu gnyis pa)"],
"Turkish":["ocak","şubat","mart","nisan","mayıs","haziran","temmuz","ağustos","eylül","ekim","kasım","aralık"],
"Udmurt":["толшор (tolšor)","тулыспал (tulyspal)","южтолэзь (južtolezʹ)","оштолэзь (oštolezʹ)","куартолэзь (kuartolezʹ)","инвожо (invožo)","пӧсьтолэзь (pösʹtolezʹ)","гудырикошкон (gudyrikoškon)","куарусён (kuarusjon)","шуркынмон (šurkynmon)","коньывуон (konʹyvuon)","толсур (tolsur)"],
"Ukrainian":["сі́чень (síčenʹ)","лю́тий (ljútyj)","бе́резень (bérezenʹ)","кві́тень (kvítenʹ)","тра́вень (trávenʹ)","че́рвень (čérvenʹ)","ли́пень (lýpenʹ)","се́рпень (sérpenʹ)","ве́ресень (véresenʹ)","жо́втень (žóvtenʹ)","листопа́д (lystopád)","гру́день (hrúdenʹ)"],
"Uyghur":["قەھرىتان‎ (qehritan),يانۋار‎ (yanwar)","ھۇد‎ (hud),فېۋرال‎ (fëwral)","نەۋرۇز‎ (newruz),مارت‎ (mart)","ئۈمىد‎ (ümid),ئاپرىل‎ (april)","باھار‎ (bahar),ماي‎ (may)","سەڧەر‎ (seڧer),ئىيۇن‎ (iyun)","چىللە‎ (chille),ئىيۇل‎ (iyul)","تومۇز‎ (tomuz),ئاۋغۇست‎ (awghust)","مىزان‎ (mizan),سىنتەبىر‎ (sintebir)","ئوغۇز‎ (oghuz),ئۆكتەبىر‎ (öktebir)","ئوغلاق‎ (oghlaq),نويابىر‎ (noyabir)","كۈنەك‎ (künek),دىكابىر‎ (dikabir)"],
"Veps":["viluku","uhoku","keväz'ku","sulaku","semendku","kezaku","heinku","eloku","sügüz'ku","reduku","kül'mku","tal'vku"],
"Vietnamese":["tháng mộttháng 1","tháng haitháng 2","tháng batháng 3","tháng tưtháng 4","tháng nămtháng 5","tháng sáutháng 6","tháng bảytháng 7","tháng támtháng 8","tháng chíntháng 9","tháng mườitháng 10","tháng mười mộttháng 11","tháng mười haitháng 12"],
"Võro":["vahtsõaastakuu","radokuu","urbõkuu","mahlakuu","lehekuu","piimäkuu","hainakuu","põimukuu","süküskuu","rehekuu","märtekuu","joulukuu"],
"Walloon":["djanvî","fevrî","måss","avri","may","djun","djulete","awousse","setimbe","octôbe","nôvimbe","decimbe"],
"Welsh":["Ionawr","Chwefror","Mawrth","Ebrill","Mai","Mehefin","Gorffennaf","Awst","Medi","Hydref","Tachwedd","Rhagfyr"],
"West Frisian":["jannewaris","febrewaris","maart","april","maaie","juny","july","augustus","septimber","oktober","novimber","desimber"],
"Yakut":["тохсунньу (toxsunńu)","олунньу (olunńu)","кулун тутар (kulun tutar)","муус устар (muus ustar)","ыам ыйа (ıam ıya)","бэс ыйа (bes ıya)","от ыйа (ot ıya)","атырдьах ыйа (atırcax ıya)","балаҕан ыйа (balağan ıya)","алтынньы (altınńı)","сэтинньи (setinńi)","ахсынньы (axsınńı)"],
"Yiddish":["יאַנואַר‎ (yanuar)","פֿעברואַר‎ (februar)","מאַרץ‎ (marts)","אַפּריל‎ (april)","מײַ‎ (may)","יוני‎ (yuni)","יולי‎ (yuli)","אויגוסט‎ (oygust)","סעפּטעמבער‎ (september)","אָקטאָבער‎ (oktober)","נאָוועמבער‎ (november)","דעצעמבער‎ (detsember)"],
"Yup'ik":["Kanruyauciq","Kep'nerciq","Tengmiirviguaq","Tengmiirvik","Qusiirvik","Kaugun","Ingun","Amirairun","Amiraayaaq","Nulirun","Cauyarvik","Uivik"],
"Zazaki":["Çıle Çele","Şıbat Zemherı","Adar, Mert","Lisan, Nisan","Gulan","Heziran, Paliyan","Temuz","Tebaxe, Axıstos","Keşkelun","Cetan","Kelverdan","Gağan"]
}
