<?xml version="1.0" encoding="UTF-8" standalone="no"?>
<svg
   xmlns:dc="http://purl.org/dc/elements/1.1/"
   xmlns:cc="http://creativecommons.org/ns#"
   xmlns:rdf="http://www.w3.org/1999/02/22-rdf-syntax-ns#"
   xmlns:svg="http://www.w3.org/2000/svg"
   xmlns="http://www.w3.org/2000/svg"
   xmlns:sodipodi="http://sodipodi.sourceforge.net/DTD/sodipodi-0.dtd"
   xmlns:inkscape="http://www.inkscape.org/namespaces/inkscape"
   width="256"
   height="256"
   viewBox="0 4 67.733334 67.733334"
   version="1.1"
   id="svg488"
   inkscape:version="1.0.2 (e86c870879, 2021-01-15)"
   sodipodi:docname="logo-metapress_sq_dark.svg"
   inkscape:export-filename="/home/siltaar/Boulot/meta-press/logo/logo-metapress-3200px-bg.png"
   inkscape:export-xdpi="1200"
   inkscape:export-ydpi="1200">
  <defs
     id="defs482">
    <inkscape:path-effect
       effect="powerstroke"
       id="path-effect5030"
       is_visible="true"
       offset_points="0.022273139,0.3955798 | 0.5600909,1.2595355 | 0.8,1.6843298"
       sort_points="true"
       interpolator_type="CubicBezierFit"
       interpolator_beta="0.2"
       start_linecap_type="round"
       linejoin_type="extrp_arc"
       miter_limit="4"
       end_linecap_type="round" />
    <inkscape:path-effect
       effect="powerstroke"
       id="path-effect414"
       is_visible="true"
       offset_points="0.022273139,0.3955798 | 0.5600909,1.2595355 | 0.8,1.6843298"
       sort_points="true"
       interpolator_type="CubicBezierFit"
       interpolator_beta="0.2"
       start_linecap_type="round"
       linejoin_type="extrp_arc"
       miter_limit="4"
       end_linecap_type="round" />
    <inkscape:path-effect
       effect="powerstroke"
       id="path-effect416"
       is_visible="true"
       offset_points="0.022273139,0.3955798 | 0.5600909,1.2595355 | 0.8,1.6843298"
       sort_points="true"
       interpolator_type="CubicBezierFit"
       interpolator_beta="0.2"
       start_linecap_type="round"
       linejoin_type="extrp_arc"
       miter_limit="4"
       end_linecap_type="round" />
    <inkscape:path-effect
       effect="powerstroke"
       id="path-effect418"
       is_visible="true"
       offset_points="0.022273139,0.3955798 | 0.5600909,1.2595355 | 0.8,1.6843298"
       sort_points="true"
       interpolator_type="CubicBezierFit"
       interpolator_beta="0.2"
       start_linecap_type="round"
       linejoin_type="extrp_arc"
       miter_limit="4"
       end_linecap_type="round" />
    <inkscape:path-effect
       effect="powerstroke"
       id="path-effect420"
       is_visible="true"
       offset_points="0.022273139,0.3955798 | 0.5600909,1.2595355 | 0.8,1.6843298"
       sort_points="true"
       interpolator_type="CubicBezierFit"
       interpolator_beta="0.2"
       start_linecap_type="round"
       linejoin_type="extrp_arc"
       miter_limit="4"
       end_linecap_type="round" />
    <inkscape:path-effect
       effect="powerstroke"
       id="path-effect422"
       is_visible="true"
       offset_points="0.022273139,0.3955798 | 0.5600909,1.2595355 | 0.8,1.6843298"
       sort_points="true"
       interpolator_type="CubicBezierFit"
       interpolator_beta="0.2"
       start_linecap_type="round"
       linejoin_type="extrp_arc"
       miter_limit="4"
       end_linecap_type="round" />
  </defs>
  <sodipodi:namedview
     id="base"
     pagecolor="#ffffff"
     bordercolor="#666666"
     borderopacity="1.0"
     inkscape:pageopacity="1"
     inkscape:pageshadow="2"
     inkscape:zoom="1.8894145"
     inkscape:cx="51.337144"
     inkscape:cy="112.23516"
     inkscape:document-units="mm"
     inkscape:current-layer="g650"
     showgrid="false"
     fit-margin-top="0.5"
     fit-margin-left="0"
     fit-margin-right="0"
     fit-margin-bottom="0"
     units="px"
     inkscape:window-width="1600"
     inkscape:window-height="882"
     inkscape:window-x="0"
     inkscape:window-y="0"
     inkscape:window-maximized="1"
     viewbox-y="4"
     viewbox-x="0"
     inkscape:pagecheckerboard="true"
     inkscape:document-rotation="0" />
  <metadata
     id="metadata485">
    <rdf:RDF>
      <cc:Work
         rdf:about="">
        <dc:format>image/svg+xml</dc:format>
        <dc:type
           rdf:resource="http://purl.org/dc/dcmitype/StillImage" />
        <dc:title />
      </cc:Work>
    </rdf:RDF>
  </metadata>
  <g
     inkscape:label="Calque 1"
     inkscape:groupmode="layer"
     id="layer1"
     transform="translate(-20.284459,-4.5435575)">
    <g
       id="g650">
      <g
         id="g1514"
         transform="matrix(0.4913245,0.13163747,-0.13163747,0.4913245,-63.282253,-772.57227)">
        <path
           inkscape:original-d="m 577.78459,1501.3584 c 9.21813,5.8837 12.35103,9.0507 18.79031,12.8423"
           inkscape:path-effect="#path-effect5030"
           sodipodi:nodetypes="cc"
           inkscape:connector-curvature="0"
           id="path1502"
           d="m 577.57176,1501.6918 c 0.20488,0.1308 0.41335,0.2509 0.60566,0.3883 4.13529,2.9551 6.89915,5.2993 9.36016,7.421 0.2417,0.2083 0.67681,0.5842 0.91851,0.7926 0.95844,0.8267 1.86188,1.6685 2.84569,2.4639 0.25861,0.2091 0.52268,0.4149 0.79445,0.6162 1.08516,0.8035 2.30668,1.5026 3.62405,2.2783 a 1.6843298,1.6843298 90 0 0 1.70924,-2.9028 c -1.25834,-0.741 -2.34999,-1.5099 -3.45982,-2.1752 -0.27794,-0.1666 -0.5559,-0.3285 -0.8342,-0.4879 -1.05872,-0.6066 -2.12375,-1.1786 -3.19791,-1.8299 -0.33971,-0.206 -0.6828,-0.4154 -1.03155,-0.6292 -2.79934,-1.716 -5.85685,-3.6446 -10.30029,-6.2122 -0.20555,-0.1187 -0.40257,-0.2586 -0.60833,-0.3899 a 0.3955798,0.3955798 90 0 0 -0.42566,0.6668 z"
           style="color:#000000;clip-rule:nonzero;display:inline;overflow:visible;visibility:visible;opacity:1;isolation:auto;mix-blend-mode:normal;color-interpolation:sRGB;color-interpolation-filters:linearRGB;solid-color:#000000;solid-opacity:1;vector-effect:none;fill:#00d0c0;fill-opacity:1;fill-rule:nonzero;stroke:none;stroke-width:3.3686595;stroke-linecap:round;stroke-linejoin:round;stroke-miterlimit:4;stroke-dasharray:none;stroke-dashoffset:0;stroke-opacity:1;marker:none;marker-start:none;marker-mid:none;marker-end:none;paint-order:normal;color-rendering:auto;image-rendering:auto;shape-rendering:auto;text-rendering:auto;enable-background:accumulate" />
        <g
           id="g1512"
           transform="translate(98.927727,1288.0394)">
          <path
             id="path1504"
             d="m 502.17582,234.1526 v -1.91109 h 1.14665 1.14666 v 1.91109 1.91109 h -1.14666 -1.14665 z"
             style="fill:#dddddd;stroke-width:0.25481179;fill-opacity:1"
             inkscape:connector-curvature="0" />
          <path
             id="path1506"
             d="m 497.84402,230.71264 v -1.01925 h 1.91108 1.91109 v 1.01925 1.01925 h -1.91109 -1.91108 z"
             style="fill:#dddddd;stroke-width:0.25481179;fill-opacity:1"
             inkscape:connector-curvature="0" />
          <path
             id="path1508"
             d="m 504.97874,230.71264 v -1.01925 h 1.78369 1.78368 v 1.01925 1.01925 h -1.78368 -1.78369 z"
             style="fill:#dddddd;stroke-width:0.25481179;fill-opacity:1"
             inkscape:connector-curvature="0" />
          <path
             id="path1510"
             d="m 502.17582,227.14528 v -1.78368 h 1.14665 1.14666 v 1.78368 1.78367 h -1.14666 -1.14665 z"
             style="fill:#dddddd;stroke-width:0.25481179;fill-opacity:1"
             inkscape:connector-curvature="0" />
        </g>
      </g>
      <g
         transform="matrix(0.4913245,0.13163747,-0.13163747,0.4913245,-23.993665,-760.03732)"
         id="g1528">
        <path
           style="color:#000000;clip-rule:nonzero;display:inline;overflow:visible;visibility:visible;opacity:1;isolation:auto;mix-blend-mode:normal;color-interpolation:sRGB;color-interpolation-filters:linearRGB;solid-color:#000000;solid-opacity:1;vector-effect:none;fill:#00d0c0;fill-opacity:1;fill-rule:nonzero;stroke:none;stroke-width:3.3686595;stroke-linecap:round;stroke-linejoin:round;stroke-miterlimit:4;stroke-dasharray:none;stroke-dashoffset:0;stroke-opacity:1;marker:none;marker-start:none;marker-mid:none;marker-end:none;paint-order:normal;color-rendering:auto;image-rendering:auto;shape-rendering:auto;text-rendering:auto;enable-background:accumulate"
           d="m 577.57176,1501.6918 c 0.20488,0.1308 0.41335,0.2509 0.60566,0.3883 4.13529,2.9551 6.89915,5.2993 9.36016,7.421 0.2417,0.2083 0.67681,0.5842 0.91851,0.7926 0.95844,0.8267 1.86188,1.6685 2.84569,2.4639 0.25861,0.2091 0.52268,0.4149 0.79445,0.6162 1.08516,0.8035 2.30668,1.5026 3.62405,2.2783 a 1.6843298,1.6843298 90 0 0 1.70924,-2.9028 c -1.25834,-0.741 -2.34999,-1.5099 -3.45982,-2.1752 -0.27794,-0.1666 -0.5559,-0.3285 -0.8342,-0.4879 -1.05872,-0.6066 -2.12375,-1.1786 -3.19791,-1.8299 -0.33971,-0.206 -0.6828,-0.4154 -1.03155,-0.6292 -2.79934,-1.716 -5.85685,-3.6446 -10.30029,-6.2122 -0.20555,-0.1187 -0.40257,-0.2586 -0.60833,-0.3899 a 0.3955798,0.3955798 90 0 0 -0.42566,0.6668 z"
           id="path1516"
           inkscape:connector-curvature="0"
           sodipodi:nodetypes="cc"
           inkscape:path-effect="#path-effect5030"
           inkscape:original-d="m 577.78459,1501.3584 c 9.21813,5.8837 12.35103,9.0507 18.79031,12.8423" />
        <g
           transform="translate(98.927727,1288.0394)"
           id="g1526">
          <path
             inkscape:connector-curvature="0"
             style="fill:#dddddd;stroke-width:0.25481179;fill-opacity:1"
             d="m 502.17582,234.1526 v -1.91109 h 1.14665 1.14666 v 1.91109 1.91109 h -1.14666 -1.14665 z"
             id="path1518" />
          <path
             inkscape:connector-curvature="0"
             style="fill:#dddddd;stroke-width:0.25481179;fill-opacity:1"
             d="m 497.84402,230.71264 v -1.01925 h 1.91108 1.91109 v 1.01925 1.01925 h -1.91109 -1.91108 z"
             id="path1520" />
          <path
             inkscape:connector-curvature="0"
             style="fill:#dddddd;stroke-width:0.25481179;fill-opacity:1"
             d="m 504.97874,230.71264 v -1.01925 h 1.78369 1.78368 v 1.01925 1.01925 h -1.78368 -1.78369 z"
             id="path1522" />
          <path
             inkscape:connector-curvature="0"
             style="fill:#dddddd;stroke-width:0.25481179;fill-opacity:1"
             d="m 502.17582,227.14528 v -1.78368 h 1.14665 1.14666 v 1.78368 1.78367 h -1.14666 -1.14665 z"
             id="path1524" />
        </g>
      </g>
      <g
         transform="matrix(0.17950914,0.47592507,-0.47592507,0.17950914,-99.145153,-795.31403)"
         id="g1538">
        <path
           sodipodi:nodetypes="ccccc"
           inkscape:connector-curvature="0"
           id="path1530"
           d="m 1653.5998,293.5384 -5.0146,5.21265 40.6469,43.13432 c 2.3146,2.70359 7.6802,-1.34996 4.7249,-4.99766 z"
           style="color:#000000;clip-rule:nonzero;display:inline;overflow:visible;visibility:visible;opacity:1;isolation:auto;mix-blend-mode:normal;color-interpolation:sRGB;color-interpolation-filters:linearRGB;solid-color:#000000;solid-opacity:1;vector-effect:none;fill:#dddddd;fill-opacity:1;fill-rule:nonzero;stroke:none;stroke-width:3.08093119;stroke-linecap:round;stroke-linejoin:round;stroke-miterlimit:4;stroke-dasharray:none;stroke-dashoffset:0;stroke-opacity:1;marker:none;marker-start:none;marker-mid:none;marker-end:none;paint-order:normal;color-rendering:auto;image-rendering:auto;shape-rendering:auto;text-rendering:auto;enable-background:accumulate" />
        <g
           transform="matrix(-1.7104986,0,0,1.7104986,2358.8078,162.86467)"
           id="g1534">
          <path
             sodipodi:nodetypes="cccccccccccccccccccccccccccccccccccccccsccccccccccccsccccccccccccccccccccccccccccccccccccccccccccccccccccccccccccccccccccccccccccccccccccccccccccccccccccccccccccccccccccccccccccccccccccccccccccccccccccccccccccccccccccccccccccccccccccccccccccccccccccccccccccccccscccccccccccccccccccccccccccccccccccccccccsccccccccccccccccccccccccccccccccccccccccc"
             inkscape:connector-curvature="0"
             id="path1532"
             transform="matrix(-0.10732047,-0.28453427,-0.28453427,0.10732047,1303.2783,1635.4763)"
             d="m 5866.0039,826.03125 c -1.2898,0.007 -2.4944,0.38627 -3.8262,0.89648 -5.5386,2.12262 -11.2444,7.62264 -17.1406,15.68946 -2.84,3.88563 -5.7082,8.39187 -8.5508,13.41797 0.1351,0.0646 0.3262,0.1485 0.4551,0.21093 1.0364,0.50174 1.8638,0.92422 2.4961,1.28516 0.316,0.18051 0.5635,0.32193 0.8848,0.56836 0.1606,0.12329 0.3392,0.22165 0.6718,0.67969 0.1652,0.22904 0.4307,0.56651 0.5176,1.32812 0.087,0.75969 -0.3908,1.95394 -1.0039,2.45117 -0.4543,0.36745 -0.4049,0.2872 -0.5976,0.40625 -0.1939,0.11902 -0.436,0.26226 -0.7383,0.44141 -0.6032,0.35792 -1.429,0.84231 -2.4219,1.41797 -1.8134,1.05102 -4.2763,2.46057 -6.8535,3.92773 -0.8172,1.71423 -1.6292,3.45902 -2.4336,5.25391 -9.4876,21.17108 -14.3296,40.21979 -12.5859,51.80273 l 0.01,0.0371 v 0.041 c 0.6499,3.30383 1.6057,5.91461 3.6895,7.875 2.0763,1.95341 5.002,3.09181 9.291,4.15625 0.5612,0.1756 0.9241,0.20667 1.7012,0.32617 0.821,0.12622 1.8964,0.27885 3.1679,0.44531 2.5432,0.33296 5.8568,0.73108 9.336,1.11328 28.2467,3.10311 51.0715,13.92949 73.7363,35.0293 l 9.8574,9.17383 2.9141,-6.01367 c 6.0706,-12.52654 9.8568,-33.89043 9.1972,-51.10742 -0.3457,-9.02519 -2.4111,-19.52691 -5.6093,-29.64454 -3.1983,-10.11765 -7.5282,-19.85267 -12.4024,-27.33203 -11.1463,-17.10395 -28.099,-32.39454 -45.2676,-40.77734 -3.449,-1.68407 -5.3429,-2.61392 -7.1679,-2.97266 -0.4563,-0.0897 -0.8963,-0.12915 -1.3262,-0.12695 z m 5.3379,5.62109 c 0.1025,0.0456 0.1518,0.0597 0.2734,0.11719 l 0.025,0.22852 c -0.097,-0.11709 -0.1955,-0.23249 -0.2988,-0.34571 z m 4.4258,5.33985 2.6992,1.71289 c 3.2129,2.0391 4.4481,2.92063 4.9551,4.00195 0.5069,1.08132 0.5754,3.19798 0.4824,7.81445 -0.025,1.24103 -0.1253,2.39173 -0.2481,3.29102 -0.8741,-0.49997 -1.9908,-1.20958 -3.1269,-2.01172 -1.1992,-0.84674 -2.3999,-1.76513 -3.3145,-2.54492 -0.4573,-0.38991 -0.842,-0.7483 -1.1035,-1.01953 -0.116,-0.12034 -0.197,-0.22636 -0.2539,-0.30274 -0.017,-0.14013 -0.1032,-0.54355 -0.1133,-0.97851 -0.015,-0.65597 0.022,-1.47918 0.1133,-2.2461 0.2363,-1.98876 0.1952,-5.1274 -0.062,-7.46679 z m -11.043,1.06445 c 0.1166,0.18491 0.5657,0.63525 0.6289,2.94531 0.074,2.68627 -0.4871,6.6847 -1.6465,11.31641 -2.3188,9.26341 -6.9266,21.14752 -12.3457,32.62695 -5.4191,11.47944 -11.6735,22.61492 -17.1465,30.50196 -2.7365,3.94343 -5.305,7.08039 -7.2617,8.92773 -0.603,0.56934 -0.944,0.75728 -1.373,1.0625 -0.1714,-0.27088 -0.3317,-0.12135 -0.4785,-1.73828 -0.2312,-2.5473 0.1819,-6.63004 1.2597,-11.4375 2.1557,-9.61509 6.8205,-22.21855 12.3985,-34.27344 5.5779,-12.05507 12.0976,-23.64266 17.7422,-31.33984 2.8222,-3.8486 5.4893,-6.72313 7.2734,-8.05274 0.5355,-0.39924 0.6692,-0.40878 0.9492,-0.53906 z m 25.7344,9.11328 c 0.8768,0.63247 1.4684,0.98315 2.9765,2.2832 1.3787,1.18852 2.6967,2.44515 3.6856,3.47657 0.4944,0.51568 0.9104,0.97236 1.1914,1.32031 0.159,0.19679 0.2677,0.38007 0.3223,0.4668 0.015,0.10522 0.05,0.32371 0.059,0.59765 0.015,0.45845 0,1.0872 -0.035,1.79883 -0.077,1.4233 -0.2573,3.20343 -0.4883,4.92774 -0.2229,1.66381 -0.4957,3.2508 -0.7597,4.44726 -0.9667,-0.82635 -2.1984,-1.96315 -3.4219,-3.13867 -1.2523,-1.20316 -2.4849,-2.44373 -3.3809,-3.41211 -0.448,-0.48421 -0.8154,-0.90249 -1.0351,-1.18164 -0.011,-0.0135 -0.01,-0.0137 -0.018,-0.0273 0,-0.0766 0,-0.0295 0.01,-0.10743 0.029,-0.36439 0.072,-0.87515 0.127,-1.48242 0.1095,-1.21461 0.2622,-2.82684 0.4316,-4.54883 0.1734,-1.76304 0.2879,-3.48202 0.332,-4.85546 0.01,-0.21761 0,-0.36459 0.01,-0.56446 z m -16.1211,7.9961 0.1504,0.0879 c 0.9987,0.58444 3.5587,2.41236 5.3359,3.84961 l 2.5196,2.03515 -0.4512,2.31836 c -0.3358,1.71896 -1.1949,4.99489 -1.8496,7.0332 l -0.4004,1.25 -1.7754,-1.5957 c -1.0726,-0.96687 -2.1622,-1.90063 -3.0684,-2.63867 -0.4531,-0.36904 -0.8603,-0.68654 -1.209,-0.94531 -0.3486,-0.25875 -0.5603,-0.43326 -0.9726,-0.63477 -0.269,-0.13155 -0.2818,-0.17144 -0.291,-0.18555 -0.01,-0.0145 -0.078,-0.12609 -0.088,-0.56445 -0.021,-0.87675 0.3199,-2.82388 1.1133,-6.01953 z m 30.6406,5.89257 2.3848,2.9375 c 1.3757,1.69607 2.5723,3.34801 3.416,4.68946 0.8436,1.34151 1.2848,2.62531 1.2637,2.4414 0.01,0.0637 -0.1014,1.62542 -0.416,3.33399 -0.3147,1.70856 -0.7757,3.77204 -1.2696,5.71679 -0.3566,1.40426 -0.7032,2.51742 -1.0449,3.6211 -2.0009,-3.20708 -5.5296,-8.93226 -5.9082,-9.69531 0.011,-0.0245 -0.066,-0.33262 -0.074,-0.70704 -0.011,-0.51973 0.015,-1.24588 0.078,-2.08789 0.1271,-1.68398 0.4052,-3.84071 0.7988,-5.99804 z m -17.1367,5.10352 c 0.7946,0.80666 1.7259,1.79243 2.709,2.9043 1.1121,1.2578 2.2279,2.58398 3.0879,3.67578 0.43,0.54588 0.794,1.03706 1.0547,1.41406 0.1882,0.2721 0.226,0.35483 0.2695,0.42773 0.012,0.0925 0.032,0.2154 0.014,0.37891 -0.045,0.40284 -0.1432,0.99161 -0.2871,1.67383 -0.2879,1.36442 -0.7436,3.10991 -1.25,4.82226 -0.5065,1.71239 -1.0678,3.40114 -1.5469,4.63282 -0.017,0.0433 -0.028,0.0574 -0.045,0.0996 -0.7596,-0.87195 -1.6886,-2.02083 -2.6348,-3.26953 -1.0089,-1.33146 -2.0126,-2.72946 -2.7637,-3.8711 -0.3755,-0.57079 -0.6898,-1.0829 -0.9023,-1.46484 -0.1051,-0.18876 -0.1825,-0.36734 -0.2285,-0.47461 0,-0.10794 0,-0.28617 0.017,-0.48242 0.046,-0.41471 0.1371,-0.99612 0.2598,-1.66407 0.2455,-1.33588 0.623,-3.04113 1.0762,-4.75 0.4146,-1.56361 0.8205,-2.93711 1.1699,-4.05273 z m -18.0391,5.73437 2.7403,2.29493 c 1.4656,1.22686 2.5928,2.32732 3.3183,3.19531 0.7254,0.86803 0.9705,1.56783 0.9649,1.51758 -0.029,-0.25444 -0.1341,1.00289 -0.5371,2.28906 -0.4031,1.28616 -1.0013,2.86073 -1.6817,4.33398 -0.841,1.82109 -1.1423,2.29596 -1.4726,2.88282 -0.9963,-1.20683 -2.2931,-2.64224 -3.8731,-4.1543 -0.9306,-0.89062 -1.7955,-1.73029 -2.4355,-2.36133 -0.1745,-0.172 -0.283,-0.28315 -0.42,-0.41992 0.086,-0.28851 0.1708,-0.56509 0.3086,-0.98633 0.3868,-1.18154 0.9478,-2.80175 1.5918,-4.54883 z m 47.6075,6.94532 c 0.4416,0.80604 0.8681,1.58887 1.5273,2.83008 1.0138,1.90886 2.0141,3.85129 2.8047,5.43554 0.7381,1.47905 1.2884,2.6595 1.4473,3.04297 -0.01,0.0126 0.026,0.21843 0,0.49414 -0.034,0.41614 -0.1214,1.01989 -0.2598,1.73047 -0.2768,1.42113 -0.747,3.27874 -1.3184,5.24023 -0.9528,3.27092 -2.1877,6.42377 -3.2773,8.8711 l -1.7246,-5.22656 -2.9805,-9.01368 1.8125,-6.20312 c 0.8405,-2.87594 1.4616,-5.23796 1.9649,-7.20117 z m -16.9473,2.94726 c 0.073,0.1152 0.1169,0.17352 0.1933,0.29688 0.7809,1.25865 1.759,2.9298 2.7188,4.67968 1.0159,1.85208 1.7628,3.13368 2.1875,4.06836 0.4247,0.93472 0.5432,1.43614 0.5,2.16016 -0.086,1.44807 -1.2517,4.17863 -3.8496,10.3418 l -0.8672,2.07031 -1.6328,-3.6543 c -0.9004,-2.01708 -1.7411,-3.97675 -2.3594,-5.49414 -0.309,-0.75873 -0.5623,-1.40717 -0.7383,-1.88476 -0.1518,-0.41192 -0.2069,-0.66003 -0.2011,-0.56836 0.016,-0.10376 0.041,-0.25986 0.086,-0.46485 0.099,-0.45025 0.2621,-1.08619 0.4746,-1.83398 0.425,-1.49552 1.0433,-3.44538 1.7422,-5.44727 0.6465,-1.85177 1.2352,-3.20539 1.7461,-4.26953 z m -18.1992,2.54688 c 0.8122,0.95474 2.7724,3.58692 4.3027,5.87304 l 2.4082,3.60157 -2.832,6.26367 c -0.8644,1.91132 -1.7717,3.63301 -2.4942,4.79883 -0.053,0.0866 -0.077,0.10526 -0.1289,0.18554 -0.3814,-0.65756 -0.7942,-1.44546 -1.1582,-2.35742 -0.9734,-2.43812 -2.2287,-5.01425 -3.3515,-6.42969 -0.3867,-0.48749 -0.7646,-0.9662 -1.0547,-1.33984 -0.016,-0.0209 -0.011,-0.0153 -0.027,-0.0371 0.1131,-0.33234 0.2469,-0.71732 0.4493,-1.24805 0.4909,-1.28735 1.2061,-3.04708 2.0195,-4.94726 z m -18.75,3.48242 c 0.068,0.0643 0.1084,0.0957 0.1797,0.16406 0.7906,0.75845 1.7806,1.76123 2.75,2.7793 0.9693,1.0181 1.9218,2.05421 2.6367,2.87695 0.3574,0.41141 0.6547,0.77238 0.8554,1.03125 0.02,0.0251 0.025,0.0406 0.043,0.0664 v 0.041 c -0.071,0.32567 -0.2166,0.83148 -0.418,1.41993 -0.4028,1.17685 -1.0231,2.69668 -1.6953,4.18945 -0.6723,1.49274 -1.4017,2.96609 -2.0156,4.04687 -0.1322,0.23259 -0.2199,0.35029 -0.3379,0.54102 -0.3424,-0.7251 -0.7698,-1.42314 -1.377,-2.24805 -0.6977,-0.94792 -1.5359,-1.96637 -2.3828,-2.87695 -0.7851,-0.84406 -1.5255,-1.66062 -2.082,-2.2832 -0.1653,-0.18491 -0.2705,-0.30703 -0.3985,-0.45313 0.096,-0.27689 0.1918,-0.55415 0.3555,-0.9707 0.444,-1.1301 1.1041,-2.68125 1.8613,-4.32813 0.736,-1.60062 1.465,-3.00987 2.0274,-3.99609 z m 29.1308,13.48242 c 0.616,1.10072 2.0994,4.86539 2.9629,8.01953 l 1.4903,5.42383 -4.3926,7.60742 c -1.7544,3.03929 -2.4338,4.01486 -3.3301,5.40235 -0.1272,-1.36711 -0.1705,-2.38331 -0.3809,-4.00977 l -0.291,-2.23047 -0.1621,0.0605 c -0.3784,-2.27036 -0.775,-4.72782 -1.2637,-6.04297 -0.2678,-0.7199 -0.3277,-1.13581 0.049,-2.4707 0.3765,-1.3349 1.2781,-3.42302 2.8633,-6.69336 z m 34.5293,0.42383 0.01,0.0117 c 2.0939,7.92568 3.0738,11.77122 2.998,14.6289 -0.076,2.85772 -1.1471,5.18943 -3.5918,10.47852 -1.9176,4.14879 -3.5299,7.16698 -4.9414,9.70117 0.025,-1.21942 0.04,-1.64163 0.064,-3.0293 0.07,-3.94846 -0.1009,-9.05887 -0.4219,-11.71093 -0.3605,-2.97928 0.047,-5.27134 1.8223,-9.60352 1.3138,-3.20596 3.0494,-7.705 4.0644,-10.47656 z m -52.3593,0.0762 c 0.6563,1.28073 1.4895,3.02631 2.3281,4.91602 l 2.7383,6.16601 -4.1504,6.74219 c -1.1231,1.82491 -2.1473,3.40133 -3.0235,4.72266 -0.1134,-0.54132 -0.1458,-0.89505 -0.3105,-1.58399 -0.3725,-1.55841 -0.8611,-3.40654 -1.3809,-5.1914 l -0.539,-1.84766 -1.1153,-3.84961 3.1348,-6.01562 c 0.8466,-1.62475 1.6483,-2.9913 2.3184,-4.0586 z m 35.1054,0.0547 1.4063,4.34961 c 0.9868,3.043 1.6503,5.41688 2.0117,7.16992 0.3613,1.75301 0.3684,2.90566 0.2891,3.26172 -0.035,0.15721 -0.6888,1.85245 -1.6075,3.72851 -0.9186,1.8761 -2.1227,4.1547 -3.3769,6.35352 -1.3932,2.44256 -2.2847,4.01109 -3.1426,5.49609 0.012,-3.19235 -0.1985,-7.55898 -0.6309,-10.75195 -0.3896,-2.87765 -0.508,-4.2761 -0.1503,-6.07812 0.3575,-1.80203 1.2811,-4.17414 3.123,-8.57227 z m -53.9258,1.13281 1.2579,1.4961 c 1.8171,2.15926 3.0446,4.14114 3.6328,5.66601 v 0 c 0.5882,1.5249 0.4707,2.41875 0.2637,2.75586 -0.8234,1.34094 -2.6434,3.98532 -4.2734,6.25195 -0.5934,0.82512 -1.0907,1.48469 -1.5821,2.14063 -0.353,-0.79668 -0.7108,-1.60088 -1.1191,-2.65821 v -0.008 c -0.5839,-1.51453 -1.184,-2.92118 -1.6953,-4 -0.256,-0.54019 -0.4895,-0.99477 -0.709,-1.37304 -0.1097,-0.18913 -0.2119,-0.35578 -0.3457,-0.53516 -0.088,-0.11811 -0.3481,-0.30385 -0.5644,-0.47461 0.01,-0.002 -0.011,0.0382 0.08,-0.26172 0.255,-0.8418 1.1618,-2.63315 2.7695,-5.26758 l 0.025,-0.0449 z m -9.0566,14.82422 c 0.086,0.13477 0.1306,0.18209 0.2422,0.4043 0.447,0.88919 1.031,2.40765 1.8047,4.45898 0.9452,2.50599 1.3043,3.77791 1.3008,4.23242 0,0.45455 -0.1377,0.66821 -1.0957,1.89649 -1.7702,2.26955 -2.9687,3.32263 -4.5489,3.86523 -1.5803,0.54242 -3.8477,0.59198 -7.6367,0.18946 -1.42,-0.15085 -2.4762,-0.36634 -3.4824,-0.56836 0.4906,-0.42622 0.9606,-0.84855 1.5195,-1.28711 2.1134,-1.65898 5.6102,-5.50251 8.3457,-8.9961 1.384,-1.76755 2.4244,-3.07914 3.1406,-3.82617 0.1966,-0.20486 0.2753,-0.255 0.4102,-0.36914 z m 18.0547,1.16797 c 0.5511,1.9411 1.111,4.50994 1.3476,7.23437 0.1412,1.62553 0.1984,3.18757 0.1622,4.41407 -0.036,1.22649 -0.2933,2.2276 -0.2579,2.15625 -0.9365,1.88957 -1.5388,2.51965 -2.7324,2.87109 -1.1936,0.35135 -3.3842,0.27457 -7.0137,-0.39648 l -3.7343,-0.69141 2.0879,-2.26953 c 2.4597,-2.67252 6.1162,-7.36099 8.332,-10.66797 0.7866,-1.17394 1.3166,-1.9433 1.8086,-2.65039 z m 17.0273,2.83008 c 0.2531,1.90494 0.5852,4.84028 0.7852,8.18164 0.2089,3.49158 0.2375,5.33768 0.01,6.4375 -0.2316,1.09985 -0.6643,1.72768 -1.916,3.27539 l -1.9531,2.41211 -4.7676,-1.74414 c -1.6133,-0.59168 -3.1013,-1.18606 -4.1699,-1.64649 -0.014,-0.005 -0.021,-0.0103 -0.035,-0.0156 0.4706,-0.61012 1.0267,-1.29735 1.7167,-2.07422 1.9019,-2.14116 5.3851,-7.04521 8.0625,-11.25781 z m 16.711,3.30664 c 0.047,0.91324 0.1008,1.70622 0.1367,2.72851 0.1335,3.80186 0.1778,8.06969 0.059,10.17969 -0.2595,4.59217 -0.3894,4.90889 -3.3965,8.26758 l -2.6133,2.91406 -4.4082,-2.33203 -3.6699,-1.9375 1.6211,-1.88867 c 1.7408,-2.02648 4.0219,-4.93653 5.2129,-6.6543 1.1948,-1.72334 3.8122,-5.89667 5.9433,-9.46875 0.4317,-0.72356 0.7236,-1.17247 1.1153,-1.80859 z m 16.4257,3.23633 0.033,0.9414 c 0.246,7.66414 -0.1142,12.9148 -1.3145,16.93555 -1.2003,4.02075 -3.1938,6.90632 -6.6094,10.11914 l -1.5156,1.42383 -3.7246,-2.61133 -3.3438,-2.34961 2.8965,-3.54883 c 2.3476,-2.88128 6.12,-8.20247 8.5469,-12.03125 1.1991,-1.89175 2.3093,-3.70491 3.1387,-5.125 0.4147,-0.71001 0.7572,-1.31724 1.0156,-1.80273 0.1292,-0.2427 0.2395,-0.45951 0.3301,-0.6543 0.091,-0.1947 0.1674,-0.268 0.2558,-0.7207 -0.053,0.27129 0.1415,-0.22942 0.291,-0.57617 z m 16.3008,3.96289 c -0.019,0.73807 -0.01,1.30409 -0.041,2.10937 -0.1668,4.10966 -0.5107,8.89192 -0.9219,12.06445 -0.8534,6.58537 -1.1999,7.57141 -4.1054,11.26172 -1.8348,2.33049 -3.8425,4.58101 -5.5625,6.29102 -0.86,0.855 -1.6506,1.57419 -2.291,2.09375 -0.4268,0.34617 -0.5973,0.42814 -0.8184,0.5625 -0.1782,-0.0881 -0.326,-0.15369 -0.5781,-0.29688 -0.7863,-0.44635 -1.8387,-1.12007 -2.8828,-1.83593 -1.0441,-0.71587 -2.0903,-1.48207 -2.8868,-2.12305 -0.1606,-0.12925 -0.2511,-0.21913 -0.3886,-0.33594 0.1317,-0.15897 0.207,-0.25139 0.3633,-0.4375 0.8528,-1.01805 2.0521,-2.41544 3.375,-3.9375 5.7065,-6.56633 10.2455,-13.39853 15.8281,-23.78906 0.35,-0.65147 0.5834,-1.03454 0.9101,-1.62695 z m -5.9003,43.91207 -0.9962,1.8789 -2.1348,-1.94845 c 0.6298,0.19498 1.3858,0.0472 1.9532,-0.16679 0.4235,-0.15976 1.2385,-0.32097 1.5293,-0.6453 z"
             style="color:#000000;font-style:normal;font-variant:normal;font-weight:normal;font-stretch:normal;font-size:medium;line-height:normal;font-family:sans-serif;font-variant-ligatures:normal;font-variant-position:normal;font-variant-caps:normal;font-variant-numeric:normal;font-variant-alternates:normal;font-feature-settings:normal;text-indent:0;text-align:start;text-decoration:none;text-decoration-line:none;text-decoration-style:solid;text-decoration-color:#000000;letter-spacing:normal;word-spacing:normal;text-transform:none;writing-mode:lr-tb;direction:ltr;text-orientation:mixed;dominant-baseline:auto;baseline-shift:baseline;text-anchor:start;white-space:normal;shape-padding:0;clip-rule:nonzero;display:inline;overflow:visible;visibility:visible;opacity:1;isolation:auto;mix-blend-mode:normal;color-interpolation:sRGB;color-interpolation-filters:linearRGB;solid-color:#000000;solid-opacity:1;vector-effect:none;fill:#00d0c0;fill-opacity:1;fill-rule:nonzero;stroke:none;stroke-width:3.5605731;stroke-linecap:butt;stroke-linejoin:miter;stroke-miterlimit:4;stroke-dasharray:none;stroke-dashoffset:0;stroke-opacity:1;color-rendering:auto;image-rendering:auto;shape-rendering:auto;text-rendering:auto;enable-background:accumulate" />
        </g>
      </g>
      <path
         inkscape:connector-curvature="0"
         id="path1540"
         d="m 43.750063,29.305838 c 0.8611,-1.87052 1.3195,-3.04007 1.2565,-3.20548 -0.056,-0.14278 -0.7917,-1.39961 -1.638,-2.792 -0.8462,-1.39234 -1.5674,-2.60827 -1.6025,-2.70212 -0.036,-0.10234 1.2711,-0.0142 3.2408,0.21598 l 3.3046,0.38662 2.1097,-2.47469 c 1.1604,-1.36106 2.1519,-2.45558 2.2035,-2.43233 0.051,0.0234 0.3926,1.46715 0.758,3.20853 l 0.6646,3.16616 3.0747,1.31197 c 1.6911,0.72158 3.013,1.36162 2.9377,1.4222 -0.075,0.0605 -1.3737,0.81328 -2.8853,1.67255 l -2.7485,1.56233 -0.2705,3.28112 c -0.1489,1.80465 -0.2826,3.30843 -0.297,3.3418 -0.015,0.0336 -1.0474,-0.8788 -2.2954,-2.02713 -1.2479,-1.14824 -2.3825,-2.1569 -2.5213,-2.24134 -0.1961,-0.11933 -0.9059,0.005 -3.1869,0.55001 -1.614,0.38688 -3.0528,0.70291 -3.1974,0.7022 -0.2113,0 0.01,-0.57834 1.0927,-2.94638 z"
         style="fill:#000000;stroke-width:0.13893583" />
      <path
         style="fill:#dddddd;stroke:none;stroke-width:0.139;stroke-miterlimit:4;stroke-dasharray:none;stroke-opacity:1;fill-opacity:1"
         d="m 43.750063,29.305838 c 0.8611,-1.87052 1.3195,-3.04007 1.2565,-3.20548 -0.056,-0.14278 -0.7917,-1.39961 -1.638,-2.792 -0.8462,-1.39234 -1.5674,-2.60827 -1.6025,-2.70212 -0.036,-0.10234 1.2711,-0.0142 3.2408,0.21598 l 3.3046,0.38662 2.1097,-2.47469 c 1.1604,-1.36106 2.1519,-2.45558 2.2035,-2.43233 0.051,0.0234 0.3926,1.46715 0.758,3.20853 l 0.6646,3.16616 3.0747,1.31197 c 1.6911,0.72158 3.013,1.36162 2.9377,1.4222 -0.075,0.0605 -1.3737,0.81328 -2.8853,1.67255 l -2.7485,1.56233 -0.2705,3.28112 c -0.1489,1.80465 -0.2826,3.30843 -0.297,3.3418 -0.015,0.0336 -1.0474,-0.8788 -2.2954,-2.02713 -1.2479,-1.14824 -2.3825,-2.1569 -2.5213,-2.24134 -0.1961,-0.11933 -0.9059,0.005 -3.1869,0.55001 -1.614,0.38688 -3.0528,0.70291 -3.1974,0.7022 -0.2113,0 0.01,-0.57834 1.0927,-2.94638 z"
         id="path1544"
         inkscape:connector-curvature="0" />
      <path
         sodipodi:nodetypes="cccccccccccccscccccc"
         inkscape:connector-curvature="0"
         id="path1547"
         d="m 42.322563,23.645698 -2.1975,-3.71535 c -10.1328,-4.01074 -16.933004,-3.62152 -19.804704,-3.66684 3.5603,0.22874 17.636704,3.65646 22.002204,7.38219 z m -21.852804,-8.05473 c 8.1258,-1.37657 21.696804,3.69756 21.696804,3.69756 l 5.9125,0.61002 3.5986,-4.29176 c -9.8521,-2.58024 -20.0727,-3.43753 -31.207904,-0.0158 z m 1.412,1.70114 c 9.387604,2.39138 16.932104,7.10569 21.206104,10.57755 l 0.775,-1.76101 -0.2551,-0.19217 c -6.2537,-4.14308 -14.594104,-8.50697 -22.914904,-9.07239 -0.1361,-0.01 -0.2723,-0.0173 -0.4084,-0.0244 0.5394,0.19421 0.9939,0.29741 1.5973,0.47264 z m -1.4238,-0.097 c 6.1781,2.84266 14.606804,8.57854 21.115804,14.27124 l 0.9,-2.13823 c -6.2439,-4.14888 -14.185004,-10.08227 -22.015804,-12.13301 z"
         style="color:#000000;clip-rule:nonzero;display:inline;overflow:visible;visibility:visible;opacity:1;isolation:auto;mix-blend-mode:normal;color-interpolation:sRGB;color-interpolation-filters:linearRGB;solid-color:#000000;solid-opacity:1;vector-effect:none;fill:#00d0c0;fill-opacity:1;fill-rule:nonzero;stroke:none;stroke-width:1.26984644;stroke-linecap:butt;stroke-linejoin:round;stroke-miterlimit:4;stroke-dasharray:none;stroke-dashoffset:0;stroke-opacity:1;marker:none;marker-start:none;marker-mid:none;marker-end:none;paint-order:normal;color-rendering:auto;image-rendering:auto;shape-rendering:auto;text-rendering:auto;enable-background:accumulate" />
      <g
         transform="matrix(0.68496159,0.18351743,-0.18351743,0.68496159,-90.908063,-1098.5101)"
         id="g1561">
        <path
           style="color:#000000;clip-rule:nonzero;display:inline;overflow:visible;visibility:visible;opacity:1;isolation:auto;mix-blend-mode:normal;color-interpolation:sRGB;color-interpolation-filters:linearRGB;solid-color:#000000;solid-opacity:1;vector-effect:none;fill:#00d0c0;fill-opacity:1;fill-rule:nonzero;stroke:none;stroke-width:3.3686595;stroke-linecap:round;stroke-linejoin:round;stroke-miterlimit:4;stroke-dasharray:none;stroke-dashoffset:0;stroke-opacity:1;marker:none;marker-start:none;marker-mid:none;marker-end:none;paint-order:normal;color-rendering:auto;image-rendering:auto;shape-rendering:auto;text-rendering:auto;enable-background:accumulate"
           d="m 571.59541,1497.169 c 0.26363,0.083 0.52933,0.1579 0.78534,0.2562 5.48977,2.1077 10.04305,5.1676 13.73507,8.3671 0.46525,0.4032 0.91719,0.809 1.35597,1.2157 1.75221,1.6241 3.23533,3.3191 4.62337,4.8416 1.15521,1.2672 2.27245,2.3962 3.21724,3.466 a 1.6843298,1.6843298 90 0 0 2.525,-2.2298 c -0.97106,-1.0996 -2.03792,-2.3648 -3.33973,-3.5975 -1.56329,-1.4803 -3.41878,-2.9349 -5.41855,-4.42 -0.50079,-0.3718 -1.01405,-0.7419 -1.53984,-1.1085 -4.18699,-2.9194 -9.14312,-5.6031 -14.90602,-7.2844 -0.26795,-0.078 -0.53118,-0.1761 -0.79965,-0.2608 a 0.3955798,0.3955798 90 0 0 -0.2382,0.7544 z"
           id="path1549"
           inkscape:connector-curvature="0"
           sodipodi:nodetypes="cc"
           inkscape:path-effect="#path-effect5030"
           inkscape:original-d="m 571.71451,1496.7918 c 11.94527,3.7714 20.06937,11.9837 24.86039,17.4089" />
        <g
           transform="translate(98.927727,1288.0394)"
           id="g1559">
          <path
             inkscape:connector-curvature="0"
             style="fill:#dddddd;stroke-width:0.25481179;fill-opacity:1"
             d="m 502.17582,234.1526 v -1.91109 h 1.14665 1.14666 v 1.91109 1.91109 h -1.14666 -1.14665 z"
             id="path1551" />
          <path
             inkscape:connector-curvature="0"
             style="fill:#dddddd;stroke-width:0.25481179;fill-opacity:1"
             d="m 497.84402,230.71264 v -1.01925 h 1.91108 1.91109 v 1.01925 1.01925 h -1.91109 -1.91108 z"
             id="path1553" />
          <path
             inkscape:connector-curvature="0"
             style="fill:#dddddd;stroke-width:0.25481179;fill-opacity:1"
             d="m 504.97874,230.71264 v -1.01925 h 1.78369 1.78368 v 1.01925 1.01925 h -1.78368 -1.78369 z"
             id="path1555" />
          <path
             inkscape:connector-curvature="0"
             style="fill:#dddddd;stroke-width:0.25481179;fill-opacity:1"
             d="m 502.17582,227.14528 v -1.78368 h 1.14665 1.14666 v 1.78368 1.78367 h -1.14666 -1.14665 z"
             id="path1557" />
        </g>
      </g>
    </g>
  </g>
</svg>
