<?xml version='1.0' encoding='UTF-8' ?>
<svg xmlns='http://www.w3.org/2000/svg' xmlns:xlink='http://www.w3.org/1999/xlink' class='svglite' width='720.00pt' height='720.00pt' viewBox='0 0 720.00 720.00'>
<defs>
  <style type='text/css'><![CDATA[
    .svglite line, .svglite polyline, .svglite polygon, .svglite path, .svglite rect, .svglite circle {
      fill: none;
      stroke: #000000;
      stroke-linecap: round;
      stroke-linejoin: round;
      stroke-miterlimit: 10.00;
    }
    .svglite text {
      white-space: pre;
    }
  ]]></style>
</defs>
<rect width='100%' height='100%' style='stroke: none; fill: none;'/>
<defs>
  <clipPath id='cpMC4wMHw3MjAuMDB8MC4wMHw3MjAuMDA='>
    <rect x='0.00' y='0.00' width='720.00' height='720.00' />
  </clipPath>
</defs>
<g clip-path='url(#cpMC4wMHw3MjAuMDB8MC4wMHw3MjAuMDA=)'>
<line x1='83.08' y1='566.81' x2='83.08' y2='669.25' style='stroke-width: 1.07; stroke-linecap: butt;' />
<line x1='83.08' y1='669.25' x2='337.30' y2='669.25' style='stroke-width: 1.07; stroke-linecap: butt;' />
<line x1='337.30' y1='669.25' x2='337.30' y2='687.27' style='stroke-width: 1.07; stroke-linecap: butt;' />
<line x1='337.30' y1='687.27' x2='634.37' y2='687.27' style='stroke-width: 1.07; stroke-linecap: butt;' />
<line x1='337.30' y1='669.25' x2='337.30' y2='651.22' style='stroke-width: 1.07; stroke-linecap: butt;' />
<line x1='337.30' y1='651.22' x2='440.81' y2='651.22' style='stroke-width: 1.07; stroke-linecap: butt;' />
<line x1='440.81' y1='651.22' x2='440.81' y2='672.95' style='stroke-width: 1.07; stroke-linecap: butt;' />
<line x1='440.81' y1='672.95' x2='534.23' y2='672.95' style='stroke-width: 1.07; stroke-linecap: butt;' />
<line x1='534.23' y1='672.95' x2='534.23' y2='679.09' style='stroke-width: 1.07; stroke-linecap: butt;' />
<line x1='534.23' y1='679.09' x2='634.37' y2='679.09' style='stroke-width: 1.07; stroke-linecap: butt;' />
<line x1='534.23' y1='672.95' x2='534.23' y2='666.82' style='stroke-width: 1.07; stroke-linecap: butt;' />
<line x1='534.23' y1='666.82' x2='538.68' y2='666.82' style='stroke-width: 1.07; stroke-linecap: butt;' />
<line x1='538.68' y1='666.82' x2='538.68' y2='670.91' style='stroke-width: 1.07; stroke-linecap: butt;' />
<line x1='538.68' y1='670.91' x2='634.37' y2='670.91' style='stroke-width: 1.07; stroke-linecap: butt;' />
<line x1='538.68' y1='666.82' x2='538.68' y2='662.73' style='stroke-width: 1.07; stroke-linecap: butt;' />
<line x1='538.68' y1='662.73' x2='634.37' y2='662.73' style='stroke-width: 1.07; stroke-linecap: butt;' />
<line x1='440.81' y1='651.22' x2='440.81' y2='629.49' style='stroke-width: 1.07; stroke-linecap: butt;' />
<line x1='440.81' y1='629.49' x2='462.11' y2='629.49' style='stroke-width: 1.07; stroke-linecap: butt;' />
<line x1='462.11' y1='629.49' x2='462.11' y2='648.41' style='stroke-width: 1.07; stroke-linecap: butt;' />
<line x1='462.11' y1='648.41' x2='532.07' y2='648.41' style='stroke-width: 1.07; stroke-linecap: butt;' />
<line x1='532.07' y1='648.41' x2='532.07' y2='654.55' style='stroke-width: 1.07; stroke-linecap: butt;' />
<line x1='532.07' y1='654.55' x2='634.37' y2='654.55' style='stroke-width: 1.07; stroke-linecap: butt;' />
<line x1='532.07' y1='648.41' x2='532.07' y2='642.27' style='stroke-width: 1.07; stroke-linecap: butt;' />
<line x1='532.07' y1='642.27' x2='562.03' y2='642.27' style='stroke-width: 1.07; stroke-linecap: butt;' />
<line x1='562.03' y1='642.27' x2='562.03' y2='646.36' style='stroke-width: 1.07; stroke-linecap: butt;' />
<line x1='562.03' y1='646.36' x2='634.37' y2='646.36' style='stroke-width: 1.07; stroke-linecap: butt;' />
<line x1='562.03' y1='642.27' x2='562.03' y2='638.18' style='stroke-width: 1.07; stroke-linecap: butt;' />
<line x1='562.03' y1='638.18' x2='634.37' y2='638.18' style='stroke-width: 1.07; stroke-linecap: butt;' />
<line x1='462.11' y1='629.49' x2='462.11' y2='610.57' style='stroke-width: 1.07; stroke-linecap: butt;' />
<line x1='462.11' y1='610.57' x2='494.76' y2='610.57' style='stroke-width: 1.07; stroke-linecap: butt;' />
<line x1='494.76' y1='610.57' x2='494.76' y2='625.91' style='stroke-width: 1.07; stroke-linecap: butt;' />
<line x1='494.76' y1='625.91' x2='538.68' y2='625.91' style='stroke-width: 1.07; stroke-linecap: butt;' />
<line x1='538.68' y1='625.91' x2='538.68' y2='630.00' style='stroke-width: 1.07; stroke-linecap: butt;' />
<line x1='538.68' y1='630.00' x2='634.37' y2='630.00' style='stroke-width: 1.07; stroke-linecap: butt;' />
<line x1='538.68' y1='625.91' x2='538.68' y2='621.82' style='stroke-width: 1.07; stroke-linecap: butt;' />
<line x1='538.68' y1='621.82' x2='634.37' y2='621.82' style='stroke-width: 1.07; stroke-linecap: butt;' />
<line x1='494.76' y1='610.57' x2='494.76' y2='595.23' style='stroke-width: 1.07; stroke-linecap: butt;' />
<line x1='494.76' y1='595.23' x2='508.16' y2='595.23' style='stroke-width: 1.07; stroke-linecap: butt;' />
<line x1='508.16' y1='595.23' x2='508.16' y2='609.55' style='stroke-width: 1.07; stroke-linecap: butt;' />
<line x1='508.16' y1='609.55' x2='557.65' y2='609.55' style='stroke-width: 1.07; stroke-linecap: butt;' />
<line x1='557.65' y1='609.55' x2='557.65' y2='613.64' style='stroke-width: 1.07; stroke-linecap: butt;' />
<line x1='557.65' y1='613.64' x2='634.37' y2='613.64' style='stroke-width: 1.07; stroke-linecap: butt;' />
<line x1='557.65' y1='609.55' x2='557.65' y2='605.45' style='stroke-width: 1.07; stroke-linecap: butt;' />
<line x1='557.65' y1='605.45' x2='634.37' y2='605.45' style='stroke-width: 1.07; stroke-linecap: butt;' />
<line x1='508.16' y1='595.23' x2='508.16' y2='580.91' style='stroke-width: 1.07; stroke-linecap: butt;' />
<line x1='508.16' y1='580.91' x2='518.05' y2='580.91' style='stroke-width: 1.07; stroke-linecap: butt;' />
<line x1='518.05' y1='580.91' x2='518.05' y2='593.18' style='stroke-width: 1.07; stroke-linecap: butt;' />
<line x1='518.05' y1='593.18' x2='535.32' y2='593.18' style='stroke-width: 1.07; stroke-linecap: butt;' />
<line x1='535.32' y1='593.18' x2='535.32' y2='597.27' style='stroke-width: 1.07; stroke-linecap: butt;' />
<line x1='535.32' y1='597.27' x2='634.37' y2='597.27' style='stroke-width: 1.07; stroke-linecap: butt;' />
<line x1='535.32' y1='593.18' x2='535.32' y2='589.09' style='stroke-width: 1.07; stroke-linecap: butt;' />
<line x1='535.32' y1='589.09' x2='634.37' y2='589.09' style='stroke-width: 1.07; stroke-linecap: butt;' />
<line x1='518.05' y1='580.91' x2='518.05' y2='568.64' style='stroke-width: 1.07; stroke-linecap: butt;' />
<line x1='518.05' y1='568.64' x2='528.73' y2='568.64' style='stroke-width: 1.07; stroke-linecap: butt;' />
<line x1='528.73' y1='568.64' x2='528.73' y2='576.82' style='stroke-width: 1.07; stroke-linecap: butt;' />
<line x1='528.73' y1='576.82' x2='561.81' y2='576.82' style='stroke-width: 1.07; stroke-linecap: butt;' />
<line x1='561.81' y1='576.82' x2='561.81' y2='580.91' style='stroke-width: 1.07; stroke-linecap: butt;' />
<line x1='561.81' y1='580.91' x2='634.37' y2='580.91' style='stroke-width: 1.07; stroke-linecap: butt;' />
<line x1='561.81' y1='576.82' x2='561.81' y2='572.73' style='stroke-width: 1.07; stroke-linecap: butt;' />
<line x1='561.81' y1='572.73' x2='634.37' y2='572.73' style='stroke-width: 1.07; stroke-linecap: butt;' />
<line x1='528.73' y1='568.64' x2='528.73' y2='560.45' style='stroke-width: 1.07; stroke-linecap: butt;' />
<line x1='528.73' y1='560.45' x2='542.16' y2='560.45' style='stroke-width: 1.07; stroke-linecap: butt;' />
<line x1='542.16' y1='560.45' x2='542.16' y2='564.55' style='stroke-width: 1.07; stroke-linecap: butt;' />
<line x1='542.16' y1='564.55' x2='634.37' y2='564.55' style='stroke-width: 1.07; stroke-linecap: butt;' />
<line x1='542.16' y1='560.45' x2='542.16' y2='556.36' style='stroke-width: 1.07; stroke-linecap: butt;' />
<line x1='542.16' y1='556.36' x2='634.37' y2='556.36' style='stroke-width: 1.07; stroke-linecap: butt;' />
<line x1='83.08' y1='566.81' x2='83.08' y2='464.37' style='stroke-width: 1.07; stroke-linecap: butt;' />
<line x1='83.08' y1='464.37' x2='174.26' y2='464.37' style='stroke-width: 1.07; stroke-linecap: butt;' />
<line x1='174.26' y1='464.37' x2='174.26' y2='548.18' style='stroke-width: 1.07; stroke-linecap: butt;' />
<line x1='174.26' y1='548.18' x2='634.37' y2='548.18' style='stroke-width: 1.07; stroke-linecap: butt;' />
<line x1='174.26' y1='464.37' x2='174.26' y2='380.55' style='stroke-width: 1.07; stroke-linecap: butt;' />
<line x1='174.26' y1='380.55' x2='258.39' y2='380.55' style='stroke-width: 1.07; stroke-linecap: butt;' />
<line x1='258.39' y1='380.55' x2='258.39' y2='501.68' style='stroke-width: 1.07; stroke-linecap: butt;' />
<line x1='258.39' y1='501.68' x2='429.22' y2='501.68' style='stroke-width: 1.07; stroke-linecap: butt;' />
<line x1='429.22' y1='501.68' x2='429.22' y2='526.19' style='stroke-width: 1.07; stroke-linecap: butt;' />
<line x1='429.22' y1='526.19' x2='486.35' y2='526.19' style='stroke-width: 1.07; stroke-linecap: butt;' />
<line x1='486.35' y1='526.19' x2='486.35' y2='535.91' style='stroke-width: 1.07; stroke-linecap: butt;' />
<line x1='486.35' y1='535.91' x2='538.68' y2='535.91' style='stroke-width: 1.07; stroke-linecap: butt;' />
<line x1='538.68' y1='535.91' x2='538.68' y2='540.00' style='stroke-width: 1.07; stroke-linecap: butt;' />
<line x1='538.68' y1='540.00' x2='634.37' y2='540.00' style='stroke-width: 1.07; stroke-linecap: butt;' />
<line x1='538.68' y1='535.91' x2='538.68' y2='531.82' style='stroke-width: 1.07; stroke-linecap: butt;' />
<line x1='538.68' y1='531.82' x2='634.37' y2='531.82' style='stroke-width: 1.07; stroke-linecap: butt;' />
<line x1='486.35' y1='526.19' x2='486.35' y2='516.48' style='stroke-width: 1.07; stroke-linecap: butt;' />
<line x1='486.35' y1='516.48' x2='503.55' y2='516.48' style='stroke-width: 1.07; stroke-linecap: butt;' />
<line x1='503.55' y1='516.48' x2='503.55' y2='523.64' style='stroke-width: 1.07; stroke-linecap: butt;' />
<line x1='503.55' y1='523.64' x2='634.37' y2='523.64' style='stroke-width: 1.07; stroke-linecap: butt;' />
<line x1='503.55' y1='516.48' x2='503.55' y2='509.32' style='stroke-width: 1.07; stroke-linecap: butt;' />
<line x1='503.55' y1='509.32' x2='521.92' y2='509.32' style='stroke-width: 1.07; stroke-linecap: butt;' />
<line x1='521.92' y1='509.32' x2='521.92' y2='515.45' style='stroke-width: 1.07; stroke-linecap: butt;' />
<line x1='521.92' y1='515.45' x2='634.37' y2='515.45' style='stroke-width: 1.07; stroke-linecap: butt;' />
<line x1='521.92' y1='509.32' x2='521.92' y2='503.18' style='stroke-width: 1.07; stroke-linecap: butt;' />
<line x1='521.92' y1='503.18' x2='553.50' y2='503.18' style='stroke-width: 1.07; stroke-linecap: butt;' />
<line x1='553.50' y1='503.18' x2='553.50' y2='507.27' style='stroke-width: 1.07; stroke-linecap: butt;' />
<line x1='553.50' y1='507.27' x2='634.37' y2='507.27' style='stroke-width: 1.07; stroke-linecap: butt;' />
<line x1='553.50' y1='503.18' x2='553.50' y2='499.09' style='stroke-width: 1.07; stroke-linecap: butt;' />
<line x1='553.50' y1='499.09' x2='634.37' y2='499.09' style='stroke-width: 1.07; stroke-linecap: butt;' />
<line x1='429.22' y1='501.68' x2='429.22' y2='477.17' style='stroke-width: 1.07; stroke-linecap: butt;' />
<line x1='429.22' y1='477.17' x2='475.21' y2='477.17' style='stroke-width: 1.07; stroke-linecap: butt;' />
<line x1='475.21' y1='477.17' x2='475.21' y2='490.91' style='stroke-width: 1.07; stroke-linecap: butt;' />
<line x1='475.21' y1='490.91' x2='634.37' y2='490.91' style='stroke-width: 1.07; stroke-linecap: butt;' />
<line x1='475.21' y1='477.17' x2='475.21' y2='463.42' style='stroke-width: 1.07; stroke-linecap: butt;' />
<line x1='475.21' y1='463.42' x2='495.86' y2='463.42' style='stroke-width: 1.07; stroke-linecap: butt;' />
<line x1='495.86' y1='463.42' x2='495.86' y2='476.59' style='stroke-width: 1.07; stroke-linecap: butt;' />
<line x1='495.86' y1='476.59' x2='523.88' y2='476.59' style='stroke-width: 1.07; stroke-linecap: butt;' />
<line x1='523.88' y1='476.59' x2='523.88' y2='482.73' style='stroke-width: 1.07; stroke-linecap: butt;' />
<line x1='523.88' y1='482.73' x2='634.37' y2='482.73' style='stroke-width: 1.07; stroke-linecap: butt;' />
<line x1='523.88' y1='476.59' x2='523.88' y2='470.45' style='stroke-width: 1.07; stroke-linecap: butt;' />
<line x1='523.88' y1='470.45' x2='562.03' y2='470.45' style='stroke-width: 1.07; stroke-linecap: butt;' />
<line x1='562.03' y1='470.45' x2='562.03' y2='474.55' style='stroke-width: 1.07; stroke-linecap: butt;' />
<line x1='562.03' y1='474.55' x2='634.37' y2='474.55' style='stroke-width: 1.07; stroke-linecap: butt;' />
<line x1='562.03' y1='470.45' x2='562.03' y2='466.36' style='stroke-width: 1.07; stroke-linecap: butt;' />
<line x1='562.03' y1='466.36' x2='634.37' y2='466.36' style='stroke-width: 1.07; stroke-linecap: butt;' />
<line x1='495.86' y1='463.42' x2='495.86' y2='450.26' style='stroke-width: 1.07; stroke-linecap: butt;' />
<line x1='495.86' y1='450.26' x2='514.78' y2='450.26' style='stroke-width: 1.07; stroke-linecap: butt;' />
<line x1='514.78' y1='450.26' x2='514.78' y2='458.18' style='stroke-width: 1.07; stroke-linecap: butt;' />
<line x1='514.78' y1='458.18' x2='634.37' y2='458.18' style='stroke-width: 1.07; stroke-linecap: butt;' />
<line x1='514.78' y1='450.26' x2='514.78' y2='442.33' style='stroke-width: 1.07; stroke-linecap: butt;' />
<line x1='514.78' y1='442.33' x2='535.99' y2='442.33' style='stroke-width: 1.07; stroke-linecap: butt;' />
<line x1='535.99' y1='442.33' x2='535.99' y2='450.00' style='stroke-width: 1.07; stroke-linecap: butt;' />
<line x1='535.99' y1='450.00' x2='634.37' y2='450.00' style='stroke-width: 1.07; stroke-linecap: butt;' />
<line x1='535.99' y1='442.33' x2='535.99' y2='434.66' style='stroke-width: 1.07; stroke-linecap: butt;' />
<line x1='535.99' y1='434.66' x2='553.50' y2='434.66' style='stroke-width: 1.07; stroke-linecap: butt;' />
<line x1='553.50' y1='434.66' x2='553.50' y2='441.82' style='stroke-width: 1.07; stroke-linecap: butt;' />
<line x1='553.50' y1='441.82' x2='634.37' y2='441.82' style='stroke-width: 1.07; stroke-linecap: butt;' />
<line x1='553.50' y1='434.66' x2='553.50' y2='427.50' style='stroke-width: 1.07; stroke-linecap: butt;' />
<line x1='553.50' y1='427.50' x2='553.50' y2='427.50' style='stroke-width: 1.07; stroke-linecap: butt;' />
<line x1='553.50' y1='427.50' x2='553.50' y2='433.64' style='stroke-width: 1.07; stroke-linecap: butt;' />
<line x1='553.50' y1='433.64' x2='634.37' y2='433.64' style='stroke-width: 1.07; stroke-linecap: butt;' />
<line x1='553.50' y1='427.50' x2='553.50' y2='421.36' style='stroke-width: 1.07; stroke-linecap: butt;' />
<line x1='553.50' y1='421.36' x2='553.50' y2='421.36' style='stroke-width: 1.07; stroke-linecap: butt;' />
<line x1='553.50' y1='421.36' x2='553.50' y2='425.45' style='stroke-width: 1.07; stroke-linecap: butt;' />
<line x1='553.50' y1='425.45' x2='634.37' y2='425.45' style='stroke-width: 1.07; stroke-linecap: butt;' />
<line x1='553.50' y1='421.36' x2='553.50' y2='417.27' style='stroke-width: 1.07; stroke-linecap: butt;' />
<line x1='553.50' y1='417.27' x2='634.37' y2='417.27' style='stroke-width: 1.07; stroke-linecap: butt;' />
<line x1='258.39' y1='380.55' x2='258.39' y2='259.42' style='stroke-width: 1.07; stroke-linecap: butt;' />
<line x1='258.39' y1='259.42' x2='409.31' y2='259.42' style='stroke-width: 1.07; stroke-linecap: butt;' />
<line x1='409.31' y1='259.42' x2='409.31' y2='362.49' style='stroke-width: 1.07; stroke-linecap: butt;' />
<line x1='409.31' y1='362.49' x2='455.87' y2='362.49' style='stroke-width: 1.07; stroke-linecap: butt;' />
<line x1='455.87' y1='362.49' x2='455.87' y2='391.70' style='stroke-width: 1.07; stroke-linecap: butt;' />
<line x1='455.87' y1='391.70' x2='508.56' y2='391.70' style='stroke-width: 1.07; stroke-linecap: butt;' />
<line x1='508.56' y1='391.70' x2='508.56' y2='402.95' style='stroke-width: 1.07; stroke-linecap: butt;' />
<line x1='508.56' y1='402.95' x2='553.50' y2='402.95' style='stroke-width: 1.07; stroke-linecap: butt;' />
<line x1='553.50' y1='402.95' x2='553.50' y2='409.09' style='stroke-width: 1.07; stroke-linecap: butt;' />
<line x1='553.50' y1='409.09' x2='634.37' y2='409.09' style='stroke-width: 1.07; stroke-linecap: butt;' />
<line x1='553.50' y1='402.95' x2='553.50' y2='396.82' style='stroke-width: 1.07; stroke-linecap: butt;' />
<line x1='553.50' y1='396.82' x2='571.73' y2='396.82' style='stroke-width: 1.07; stroke-linecap: butt;' />
<line x1='571.73' y1='396.82' x2='571.73' y2='400.91' style='stroke-width: 1.07; stroke-linecap: butt;' />
<line x1='571.73' y1='400.91' x2='634.37' y2='400.91' style='stroke-width: 1.07; stroke-linecap: butt;' />
<line x1='571.73' y1='396.82' x2='571.73' y2='392.73' style='stroke-width: 1.07; stroke-linecap: butt;' />
<line x1='571.73' y1='392.73' x2='634.37' y2='392.73' style='stroke-width: 1.07; stroke-linecap: butt;' />
<line x1='508.56' y1='391.70' x2='508.56' y2='380.45' style='stroke-width: 1.07; stroke-linecap: butt;' />
<line x1='508.56' y1='380.45' x2='549.55' y2='380.45' style='stroke-width: 1.07; stroke-linecap: butt;' />
<line x1='549.55' y1='380.45' x2='549.55' y2='384.55' style='stroke-width: 1.07; stroke-linecap: butt;' />
<line x1='549.55' y1='384.55' x2='634.37' y2='384.55' style='stroke-width: 1.07; stroke-linecap: butt;' />
<line x1='549.55' y1='380.45' x2='549.55' y2='376.36' style='stroke-width: 1.07; stroke-linecap: butt;' />
<line x1='549.55' y1='376.36' x2='634.37' y2='376.36' style='stroke-width: 1.07; stroke-linecap: butt;' />
<line x1='455.87' y1='362.49' x2='455.87' y2='333.28' style='stroke-width: 1.07; stroke-linecap: butt;' />
<line x1='455.87' y1='333.28' x2='460.92' y2='333.28' style='stroke-width: 1.07; stroke-linecap: butt;' />
<line x1='460.92' y1='333.28' x2='460.92' y2='361.02' style='stroke-width: 1.07; stroke-linecap: butt;' />
<line x1='460.92' y1='361.02' x2='521.92' y2='361.02' style='stroke-width: 1.07; stroke-linecap: butt;' />
<line x1='521.92' y1='361.02' x2='521.92' y2='368.18' style='stroke-width: 1.07; stroke-linecap: butt;' />
<line x1='521.92' y1='368.18' x2='634.37' y2='368.18' style='stroke-width: 1.07; stroke-linecap: butt;' />
<line x1='521.92' y1='361.02' x2='521.92' y2='353.86' style='stroke-width: 1.07; stroke-linecap: butt;' />
<line x1='521.92' y1='353.86' x2='533.15' y2='353.86' style='stroke-width: 1.07; stroke-linecap: butt;' />
<line x1='533.15' y1='353.86' x2='533.15' y2='360.00' style='stroke-width: 1.07; stroke-linecap: butt;' />
<line x1='533.15' y1='360.00' x2='634.37' y2='360.00' style='stroke-width: 1.07; stroke-linecap: butt;' />
<line x1='533.15' y1='353.86' x2='533.15' y2='347.73' style='stroke-width: 1.07; stroke-linecap: butt;' />
<line x1='533.15' y1='347.73' x2='549.55' y2='347.73' style='stroke-width: 1.07; stroke-linecap: butt;' />
<line x1='549.55' y1='347.73' x2='549.55' y2='351.82' style='stroke-width: 1.07; stroke-linecap: butt;' />
<line x1='549.55' y1='351.82' x2='634.37' y2='351.82' style='stroke-width: 1.07; stroke-linecap: butt;' />
<line x1='549.55' y1='347.73' x2='549.55' y2='343.64' style='stroke-width: 1.07; stroke-linecap: butt;' />
<line x1='549.55' y1='343.64' x2='634.37' y2='343.64' style='stroke-width: 1.07; stroke-linecap: butt;' />
<line x1='460.92' y1='333.28' x2='460.92' y2='305.54' style='stroke-width: 1.07; stroke-linecap: butt;' />
<line x1='460.92' y1='305.54' x2='476.72' y2='305.54' style='stroke-width: 1.07; stroke-linecap: butt;' />
<line x1='476.72' y1='305.54' x2='476.72' y2='329.32' style='stroke-width: 1.07; stroke-linecap: butt;' />
<line x1='476.72' y1='329.32' x2='527.90' y2='329.32' style='stroke-width: 1.07; stroke-linecap: butt;' />
<line x1='527.90' y1='329.32' x2='527.90' y2='335.45' style='stroke-width: 1.07; stroke-linecap: butt;' />
<line x1='527.90' y1='335.45' x2='634.37' y2='335.45' style='stroke-width: 1.07; stroke-linecap: butt;' />
<line x1='527.90' y1='329.32' x2='527.90' y2='323.18' style='stroke-width: 1.07; stroke-linecap: butt;' />
<line x1='527.90' y1='323.18' x2='545.78' y2='323.18' style='stroke-width: 1.07; stroke-linecap: butt;' />
<line x1='545.78' y1='323.18' x2='545.78' y2='327.27' style='stroke-width: 1.07; stroke-linecap: butt;' />
<line x1='545.78' y1='327.27' x2='634.37' y2='327.27' style='stroke-width: 1.07; stroke-linecap: butt;' />
<line x1='545.78' y1='323.18' x2='545.78' y2='319.09' style='stroke-width: 1.07; stroke-linecap: butt;' />
<line x1='545.78' y1='319.09' x2='634.37' y2='319.09' style='stroke-width: 1.07; stroke-linecap: butt;' />
<line x1='476.72' y1='305.54' x2='476.72' y2='281.76' style='stroke-width: 1.07; stroke-linecap: butt;' />
<line x1='476.72' y1='281.76' x2='496.85' y2='281.76' style='stroke-width: 1.07; stroke-linecap: butt;' />
<line x1='496.85' y1='281.76' x2='496.85' y2='303.75' style='stroke-width: 1.07; stroke-linecap: butt;' />
<line x1='496.85' y1='303.75' x2='526.37' y2='303.75' style='stroke-width: 1.07; stroke-linecap: butt;' />
<line x1='526.37' y1='303.75' x2='526.37' y2='310.91' style='stroke-width: 1.07; stroke-linecap: butt;' />
<line x1='526.37' y1='310.91' x2='634.37' y2='310.91' style='stroke-width: 1.07; stroke-linecap: butt;' />
<line x1='526.37' y1='303.75' x2='526.37' y2='296.59' style='stroke-width: 1.07; stroke-linecap: butt;' />
<line x1='526.37' y1='296.59' x2='559.08' y2='296.59' style='stroke-width: 1.07; stroke-linecap: butt;' />
<line x1='559.08' y1='296.59' x2='559.08' y2='302.73' style='stroke-width: 1.07; stroke-linecap: butt;' />
<line x1='559.08' y1='302.73' x2='634.37' y2='302.73' style='stroke-width: 1.07; stroke-linecap: butt;' />
<line x1='559.08' y1='296.59' x2='559.08' y2='290.45' style='stroke-width: 1.07; stroke-linecap: butt;' />
<line x1='559.08' y1='290.45' x2='571.73' y2='290.45' style='stroke-width: 1.07; stroke-linecap: butt;' />
<line x1='571.73' y1='290.45' x2='571.73' y2='294.55' style='stroke-width: 1.07; stroke-linecap: butt;' />
<line x1='571.73' y1='294.55' x2='634.37' y2='294.55' style='stroke-width: 1.07; stroke-linecap: butt;' />
<line x1='571.73' y1='290.45' x2='571.73' y2='286.36' style='stroke-width: 1.07; stroke-linecap: butt;' />
<line x1='571.73' y1='286.36' x2='634.37' y2='286.36' style='stroke-width: 1.07; stroke-linecap: butt;' />
<line x1='496.85' y1='281.76' x2='496.85' y2='259.77' style='stroke-width: 1.07; stroke-linecap: butt;' />
<line x1='496.85' y1='259.77' x2='508.43' y2='259.77' style='stroke-width: 1.07; stroke-linecap: butt;' />
<line x1='508.43' y1='259.77' x2='508.43' y2='274.09' style='stroke-width: 1.07; stroke-linecap: butt;' />
<line x1='508.43' y1='274.09' x2='535.32' y2='274.09' style='stroke-width: 1.07; stroke-linecap: butt;' />
<line x1='535.32' y1='274.09' x2='535.32' y2='278.18' style='stroke-width: 1.07; stroke-linecap: butt;' />
<line x1='535.32' y1='278.18' x2='634.37' y2='278.18' style='stroke-width: 1.07; stroke-linecap: butt;' />
<line x1='535.32' y1='274.09' x2='535.32' y2='270.00' style='stroke-width: 1.07; stroke-linecap: butt;' />
<line x1='535.32' y1='270.00' x2='634.37' y2='270.00' style='stroke-width: 1.07; stroke-linecap: butt;' />
<line x1='508.43' y1='259.77' x2='508.43' y2='245.45' style='stroke-width: 1.07; stroke-linecap: butt;' />
<line x1='508.43' y1='245.45' x2='520.00' y2='245.45' style='stroke-width: 1.07; stroke-linecap: butt;' />
<line x1='520.00' y1='245.45' x2='520.00' y2='257.73' style='stroke-width: 1.07; stroke-linecap: butt;' />
<line x1='520.00' y1='257.73' x2='562.03' y2='257.73' style='stroke-width: 1.07; stroke-linecap: butt;' />
<line x1='562.03' y1='257.73' x2='562.03' y2='261.82' style='stroke-width: 1.07; stroke-linecap: butt;' />
<line x1='562.03' y1='261.82' x2='634.37' y2='261.82' style='stroke-width: 1.07; stroke-linecap: butt;' />
<line x1='562.03' y1='257.73' x2='562.03' y2='253.64' style='stroke-width: 1.07; stroke-linecap: butt;' />
<line x1='562.03' y1='253.64' x2='634.37' y2='253.64' style='stroke-width: 1.07; stroke-linecap: butt;' />
<line x1='520.00' y1='245.45' x2='520.00' y2='233.18' style='stroke-width: 1.07; stroke-linecap: butt;' />
<line x1='520.00' y1='233.18' x2='525.87' y2='233.18' style='stroke-width: 1.07; stroke-linecap: butt;' />
<line x1='525.87' y1='233.18' x2='525.87' y2='241.36' style='stroke-width: 1.07; stroke-linecap: butt;' />
<line x1='525.87' y1='241.36' x2='549.55' y2='241.36' style='stroke-width: 1.07; stroke-linecap: butt;' />
<line x1='549.55' y1='241.36' x2='549.55' y2='245.45' style='stroke-width: 1.07; stroke-linecap: butt;' />
<line x1='549.55' y1='245.45' x2='634.37' y2='245.45' style='stroke-width: 1.07; stroke-linecap: butt;' />
<line x1='549.55' y1='241.36' x2='549.55' y2='237.27' style='stroke-width: 1.07; stroke-linecap: butt;' />
<line x1='549.55' y1='237.27' x2='634.37' y2='237.27' style='stroke-width: 1.07; stroke-linecap: butt;' />
<line x1='525.87' y1='233.18' x2='525.87' y2='225.00' style='stroke-width: 1.07; stroke-linecap: butt;' />
<line x1='525.87' y1='225.00' x2='535.32' y2='225.00' style='stroke-width: 1.07; stroke-linecap: butt;' />
<line x1='535.32' y1='225.00' x2='535.32' y2='229.09' style='stroke-width: 1.07; stroke-linecap: butt;' />
<line x1='535.32' y1='229.09' x2='634.37' y2='229.09' style='stroke-width: 1.07; stroke-linecap: butt;' />
<line x1='535.32' y1='225.00' x2='535.32' y2='220.91' style='stroke-width: 1.07; stroke-linecap: butt;' />
<line x1='535.32' y1='220.91' x2='634.37' y2='220.91' style='stroke-width: 1.07; stroke-linecap: butt;' />
<line x1='409.31' y1='259.42' x2='409.31' y2='156.35' style='stroke-width: 1.07; stroke-linecap: butt;' />
<line x1='409.31' y1='156.35' x2='450.54' y2='156.35' style='stroke-width: 1.07; stroke-linecap: butt;' />
<line x1='450.54' y1='156.35' x2='450.54' y2='194.32' style='stroke-width: 1.07; stroke-linecap: butt;' />
<line x1='450.54' y1='194.32' x2='516.25' y2='194.32' style='stroke-width: 1.07; stroke-linecap: butt;' />
<line x1='516.25' y1='194.32' x2='516.25' y2='206.59' style='stroke-width: 1.07; stroke-linecap: butt;' />
<line x1='516.25' y1='206.59' x2='547.02' y2='206.59' style='stroke-width: 1.07; stroke-linecap: butt;' />
<line x1='547.02' y1='206.59' x2='547.02' y2='212.73' style='stroke-width: 1.07; stroke-linecap: butt;' />
<line x1='547.02' y1='212.73' x2='634.37' y2='212.73' style='stroke-width: 1.07; stroke-linecap: butt;' />
<line x1='547.02' y1='206.59' x2='547.02' y2='200.45' style='stroke-width: 1.07; stroke-linecap: butt;' />
<line x1='547.02' y1='200.45' x2='566.71' y2='200.45' style='stroke-width: 1.07; stroke-linecap: butt;' />
<line x1='566.71' y1='200.45' x2='566.71' y2='204.55' style='stroke-width: 1.07; stroke-linecap: butt;' />
<line x1='566.71' y1='204.55' x2='634.37' y2='204.55' style='stroke-width: 1.07; stroke-linecap: butt;' />
<line x1='566.71' y1='200.45' x2='566.71' y2='196.36' style='stroke-width: 1.07; stroke-linecap: butt;' />
<line x1='566.71' y1='196.36' x2='634.37' y2='196.36' style='stroke-width: 1.07; stroke-linecap: butt;' />
<line x1='516.25' y1='194.32' x2='516.25' y2='182.05' style='stroke-width: 1.07; stroke-linecap: butt;' />
<line x1='516.25' y1='182.05' x2='537.55' y2='182.05' style='stroke-width: 1.07; stroke-linecap: butt;' />
<line x1='537.55' y1='182.05' x2='537.55' y2='188.18' style='stroke-width: 1.07; stroke-linecap: butt;' />
<line x1='537.55' y1='188.18' x2='634.37' y2='188.18' style='stroke-width: 1.07; stroke-linecap: butt;' />
<line x1='537.55' y1='182.05' x2='537.55' y2='175.91' style='stroke-width: 1.07; stroke-linecap: butt;' />
<line x1='537.55' y1='175.91' x2='590.07' y2='175.91' style='stroke-width: 1.07; stroke-linecap: butt;' />
<line x1='590.07' y1='175.91' x2='590.07' y2='180.00' style='stroke-width: 1.07; stroke-linecap: butt;' />
<line x1='590.07' y1='180.00' x2='634.37' y2='180.00' style='stroke-width: 1.07; stroke-linecap: butt;' />
<line x1='590.07' y1='175.91' x2='590.07' y2='171.82' style='stroke-width: 1.07; stroke-linecap: butt;' />
<line x1='590.07' y1='171.82' x2='634.37' y2='171.82' style='stroke-width: 1.07; stroke-linecap: butt;' />
<line x1='450.54' y1='156.35' x2='450.54' y2='118.38' style='stroke-width: 1.07; stroke-linecap: butt;' />
<line x1='450.54' y1='118.38' x2='461.13' y2='118.38' style='stroke-width: 1.07; stroke-linecap: butt;' />
<line x1='461.13' y1='118.38' x2='461.13' y2='150.34' style='stroke-width: 1.07; stroke-linecap: butt;' />
<line x1='461.13' y1='150.34' x2='494.45' y2='150.34' style='stroke-width: 1.07; stroke-linecap: butt;' />
<line x1='494.45' y1='150.34' x2='494.45' y2='159.55' style='stroke-width: 1.07; stroke-linecap: butt;' />
<line x1='494.45' y1='159.55' x2='557.65' y2='159.55' style='stroke-width: 1.07; stroke-linecap: butt;' />
<line x1='557.65' y1='159.55' x2='557.65' y2='163.64' style='stroke-width: 1.07; stroke-linecap: butt;' />
<line x1='557.65' y1='163.64' x2='634.37' y2='163.64' style='stroke-width: 1.07; stroke-linecap: butt;' />
<line x1='557.65' y1='159.55' x2='557.65' y2='155.45' style='stroke-width: 1.07; stroke-linecap: butt;' />
<line x1='557.65' y1='155.45' x2='634.37' y2='155.45' style='stroke-width: 1.07; stroke-linecap: butt;' />
<line x1='494.45' y1='150.34' x2='494.45' y2='141.14' style='stroke-width: 1.07; stroke-linecap: butt;' />
<line x1='494.45' y1='141.14' x2='523.88' y2='141.14' style='stroke-width: 1.07; stroke-linecap: butt;' />
<line x1='523.88' y1='141.14' x2='523.88' y2='147.27' style='stroke-width: 1.07; stroke-linecap: butt;' />
<line x1='523.88' y1='147.27' x2='634.37' y2='147.27' style='stroke-width: 1.07; stroke-linecap: butt;' />
<line x1='523.88' y1='141.14' x2='523.88' y2='135.00' style='stroke-width: 1.07; stroke-linecap: butt;' />
<line x1='523.88' y1='135.00' x2='545.78' y2='135.00' style='stroke-width: 1.07; stroke-linecap: butt;' />
<line x1='545.78' y1='135.00' x2='545.78' y2='139.09' style='stroke-width: 1.07; stroke-linecap: butt;' />
<line x1='545.78' y1='139.09' x2='634.37' y2='139.09' style='stroke-width: 1.07; stroke-linecap: butt;' />
<line x1='545.78' y1='135.00' x2='545.78' y2='130.91' style='stroke-width: 1.07; stroke-linecap: butt;' />
<line x1='545.78' y1='130.91' x2='634.37' y2='130.91' style='stroke-width: 1.07; stroke-linecap: butt;' />
<line x1='461.13' y1='118.38' x2='461.13' y2='86.42' style='stroke-width: 1.07; stroke-linecap: butt;' />
<line x1='461.13' y1='86.42' x2='484.34' y2='86.42' style='stroke-width: 1.07; stroke-linecap: butt;' />
<line x1='484.34' y1='86.42' x2='484.34' y2='112.50' style='stroke-width: 1.07; stroke-linecap: butt;' />
<line x1='484.34' y1='112.50' x2='546.89' y2='112.50' style='stroke-width: 1.07; stroke-linecap: butt;' />
<line x1='546.89' y1='112.50' x2='546.89' y2='122.73' style='stroke-width: 1.07; stroke-linecap: butt;' />
<line x1='546.89' y1='122.73' x2='634.37' y2='122.73' style='stroke-width: 1.07; stroke-linecap: butt;' />
<line x1='546.89' y1='112.50' x2='546.89' y2='102.27' style='stroke-width: 1.07; stroke-linecap: butt;' />
<line x1='546.89' y1='102.27' x2='551.50' y2='102.27' style='stroke-width: 1.07; stroke-linecap: butt;' />
<line x1='551.50' y1='102.27' x2='551.50' y2='110.45' style='stroke-width: 1.07; stroke-linecap: butt;' />
<line x1='551.50' y1='110.45' x2='590.07' y2='110.45' style='stroke-width: 1.07; stroke-linecap: butt;' />
<line x1='590.07' y1='110.45' x2='590.07' y2='114.55' style='stroke-width: 1.07; stroke-linecap: butt;' />
<line x1='590.07' y1='114.55' x2='634.37' y2='114.55' style='stroke-width: 1.07; stroke-linecap: butt;' />
<line x1='590.07' y1='110.45' x2='590.07' y2='106.36' style='stroke-width: 1.07; stroke-linecap: butt;' />
<line x1='590.07' y1='106.36' x2='634.37' y2='106.36' style='stroke-width: 1.07; stroke-linecap: butt;' />
<line x1='551.50' y1='102.27' x2='551.50' y2='94.09' style='stroke-width: 1.07; stroke-linecap: butt;' />
<line x1='551.50' y1='94.09' x2='571.73' y2='94.09' style='stroke-width: 1.07; stroke-linecap: butt;' />
<line x1='571.73' y1='94.09' x2='571.73' y2='98.18' style='stroke-width: 1.07; stroke-linecap: butt;' />
<line x1='571.73' y1='98.18' x2='634.37' y2='98.18' style='stroke-width: 1.07; stroke-linecap: butt;' />
<line x1='571.73' y1='94.09' x2='571.73' y2='90.00' style='stroke-width: 1.07; stroke-linecap: butt;' />
<line x1='571.73' y1='90.00' x2='634.37' y2='90.00' style='stroke-width: 1.07; stroke-linecap: butt;' />
<line x1='484.34' y1='86.42' x2='484.34' y2='60.34' style='stroke-width: 1.07; stroke-linecap: butt;' />
<line x1='484.34' y1='60.34' x2='512.49' y2='60.34' style='stroke-width: 1.07; stroke-linecap: butt;' />
<line x1='512.49' y1='60.34' x2='512.49' y2='75.68' style='stroke-width: 1.07; stroke-linecap: butt;' />
<line x1='512.49' y1='75.68' x2='538.68' y2='75.68' style='stroke-width: 1.07; stroke-linecap: butt;' />
<line x1='538.68' y1='75.68' x2='538.68' y2='81.82' style='stroke-width: 1.07; stroke-linecap: butt;' />
<line x1='538.68' y1='81.82' x2='634.37' y2='81.82' style='stroke-width: 1.07; stroke-linecap: butt;' />
<line x1='538.68' y1='75.68' x2='538.68' y2='69.55' style='stroke-width: 1.07; stroke-linecap: butt;' />
<line x1='538.68' y1='69.55' x2='553.50' y2='69.55' style='stroke-width: 1.07; stroke-linecap: butt;' />
<line x1='553.50' y1='69.55' x2='553.50' y2='73.64' style='stroke-width: 1.07; stroke-linecap: butt;' />
<line x1='553.50' y1='73.64' x2='634.37' y2='73.64' style='stroke-width: 1.07; stroke-linecap: butt;' />
<line x1='553.50' y1='69.55' x2='553.50' y2='65.45' style='stroke-width: 1.07; stroke-linecap: butt;' />
<line x1='553.50' y1='65.45' x2='634.37' y2='65.45' style='stroke-width: 1.07; stroke-linecap: butt;' />
<line x1='512.49' y1='60.34' x2='512.49' y2='45.00' style='stroke-width: 1.07; stroke-linecap: butt;' />
<line x1='512.49' y1='45.00' x2='528.93' y2='45.00' style='stroke-width: 1.07; stroke-linecap: butt;' />
<line x1='528.93' y1='45.00' x2='528.93' y2='53.18' style='stroke-width: 1.07; stroke-linecap: butt;' />
<line x1='528.93' y1='53.18' x2='562.03' y2='53.18' style='stroke-width: 1.07; stroke-linecap: butt;' />
<line x1='562.03' y1='53.18' x2='562.03' y2='57.27' style='stroke-width: 1.07; stroke-linecap: butt;' />
<line x1='562.03' y1='57.27' x2='634.37' y2='57.27' style='stroke-width: 1.07; stroke-linecap: butt;' />
<line x1='562.03' y1='53.18' x2='562.03' y2='49.09' style='stroke-width: 1.07; stroke-linecap: butt;' />
<line x1='562.03' y1='49.09' x2='634.37' y2='49.09' style='stroke-width: 1.07; stroke-linecap: butt;' />
<line x1='528.93' y1='45.00' x2='528.93' y2='36.82' style='stroke-width: 1.07; stroke-linecap: butt;' />
<line x1='528.93' y1='36.82' x2='553.50' y2='36.82' style='stroke-width: 1.07; stroke-linecap: butt;' />
<line x1='553.50' y1='36.82' x2='553.50' y2='40.91' style='stroke-width: 1.07; stroke-linecap: butt;' />
<line x1='553.50' y1='40.91' x2='634.37' y2='40.91' style='stroke-width: 1.07; stroke-linecap: butt;' />
<line x1='553.50' y1='36.82' x2='553.50' y2='32.73' style='stroke-width: 1.07; stroke-linecap: butt;' />
<line x1='553.50' y1='32.73' x2='634.37' y2='32.73' style='stroke-width: 1.07; stroke-linecap: butt;' />
<line x1='337.30' y1='687.27' x2='634.37' y2='687.27' style='stroke-width: 1.07; stroke-linecap: butt;' />
<line x1='534.23' y1='679.09' x2='634.37' y2='679.09' style='stroke-width: 1.07; stroke-linecap: butt;' />
<line x1='538.68' y1='670.91' x2='634.37' y2='670.91' style='stroke-width: 1.07; stroke-linecap: butt;' />
<line x1='538.68' y1='662.73' x2='634.37' y2='662.73' style='stroke-width: 1.07; stroke-linecap: butt;' />
<line x1='532.07' y1='654.55' x2='634.37' y2='654.55' style='stroke-width: 1.07; stroke-linecap: butt;' />
<line x1='562.03' y1='646.36' x2='634.37' y2='646.36' style='stroke-width: 1.07; stroke-linecap: butt;' />
<line x1='562.03' y1='638.18' x2='634.37' y2='638.18' style='stroke-width: 1.07; stroke-linecap: butt;' />
<line x1='538.68' y1='630.00' x2='634.37' y2='630.00' style='stroke-width: 1.07; stroke-linecap: butt;' />
<line x1='538.68' y1='621.82' x2='634.37' y2='621.82' style='stroke-width: 1.07; stroke-linecap: butt;' />
<line x1='557.65' y1='613.64' x2='634.37' y2='613.64' style='stroke-width: 1.07; stroke-linecap: butt;' />
<line x1='557.65' y1='605.45' x2='634.37' y2='605.45' style='stroke-width: 1.07; stroke-linecap: butt;' />
<line x1='535.32' y1='597.27' x2='634.37' y2='597.27' style='stroke-width: 1.07; stroke-linecap: butt;' />
<line x1='535.32' y1='589.09' x2='634.37' y2='589.09' style='stroke-width: 1.07; stroke-linecap: butt;' />
<line x1='561.81' y1='580.91' x2='634.37' y2='580.91' style='stroke-width: 1.07; stroke-linecap: butt;' />
<line x1='561.81' y1='572.73' x2='634.37' y2='572.73' style='stroke-width: 1.07; stroke-linecap: butt;' />
<line x1='542.16' y1='564.55' x2='634.37' y2='564.55' style='stroke-width: 1.07; stroke-linecap: butt;' />
<line x1='542.16' y1='556.36' x2='634.37' y2='556.36' style='stroke-width: 1.07; stroke-linecap: butt;' />
<line x1='174.26' y1='548.18' x2='634.37' y2='548.18' style='stroke-width: 1.07; stroke-linecap: butt;' />
<line x1='538.68' y1='540.00' x2='634.37' y2='540.00' style='stroke-width: 1.07; stroke-linecap: butt;' />
<line x1='538.68' y1='531.82' x2='634.37' y2='531.82' style='stroke-width: 1.07; stroke-linecap: butt;' />
<line x1='503.55' y1='523.64' x2='634.37' y2='523.64' style='stroke-width: 1.07; stroke-linecap: butt;' />
<line x1='521.92' y1='515.45' x2='634.37' y2='515.45' style='stroke-width: 1.07; stroke-linecap: butt;' />
<line x1='553.50' y1='507.27' x2='634.37' y2='507.27' style='stroke-width: 1.07; stroke-linecap: butt;' />
<line x1='553.50' y1='499.09' x2='634.37' y2='499.09' style='stroke-width: 1.07; stroke-linecap: butt;' />
<line x1='475.21' y1='490.91' x2='634.37' y2='490.91' style='stroke-width: 1.07; stroke-linecap: butt;' />
<line x1='523.88' y1='482.73' x2='634.37' y2='482.73' style='stroke-width: 1.07; stroke-linecap: butt;' />
<line x1='562.03' y1='474.55' x2='634.37' y2='474.55' style='stroke-width: 1.07; stroke-linecap: butt;' />
<line x1='562.03' y1='466.36' x2='634.37' y2='466.36' style='stroke-width: 1.07; stroke-linecap: butt;' />
<line x1='514.78' y1='458.18' x2='634.37' y2='458.18' style='stroke-width: 1.07; stroke-linecap: butt;' />
<line x1='535.99' y1='450.00' x2='634.37' y2='450.00' style='stroke-width: 1.07; stroke-linecap: butt;' />
<line x1='553.50' y1='441.82' x2='634.37' y2='441.82' style='stroke-width: 1.07; stroke-linecap: butt;' />
<line x1='553.50' y1='433.64' x2='634.37' y2='433.64' style='stroke-width: 1.07; stroke-linecap: butt;' />
<line x1='553.50' y1='425.45' x2='634.37' y2='425.45' style='stroke-width: 1.07; stroke-linecap: butt;' />
<line x1='553.50' y1='417.27' x2='634.37' y2='417.27' style='stroke-width: 1.07; stroke-linecap: butt;' />
<line x1='553.50' y1='409.09' x2='634.37' y2='409.09' style='stroke-width: 1.07; stroke-linecap: butt;' />
<line x1='571.73' y1='400.91' x2='634.37' y2='400.91' style='stroke-width: 1.07; stroke-linecap: butt;' />
<line x1='571.73' y1='392.73' x2='634.37' y2='392.73' style='stroke-width: 1.07; stroke-linecap: butt;' />
<line x1='549.55' y1='384.55' x2='634.37' y2='384.55' style='stroke-width: 1.07; stroke-linecap: butt;' />
<line x1='549.55' y1='376.36' x2='634.37' y2='376.36' style='stroke-width: 1.07; stroke-linecap: butt;' />
<line x1='521.92' y1='368.18' x2='634.37' y2='368.18' style='stroke-width: 1.07; stroke-linecap: butt;' />
<line x1='533.15' y1='360.00' x2='634.37' y2='360.00' style='stroke-width: 1.07; stroke-linecap: butt;' />
<line x1='549.55' y1='351.82' x2='634.37' y2='351.82' style='stroke-width: 1.07; stroke-linecap: butt;' />
<line x1='549.55' y1='343.64' x2='634.37' y2='343.64' style='stroke-width: 1.07; stroke-linecap: butt;' />
<line x1='527.90' y1='335.45' x2='634.37' y2='335.45' style='stroke-width: 1.07; stroke-linecap: butt;' />
<line x1='545.78' y1='327.27' x2='634.37' y2='327.27' style='stroke-width: 1.07; stroke-linecap: butt;' />
<line x1='545.78' y1='319.09' x2='634.37' y2='319.09' style='stroke-width: 1.07; stroke-linecap: butt;' />
<line x1='526.37' y1='310.91' x2='634.37' y2='310.91' style='stroke-width: 1.07; stroke-linecap: butt;' />
<line x1='559.08' y1='302.73' x2='634.37' y2='302.73' style='stroke-width: 1.07; stroke-linecap: butt;' />
<line x1='571.73' y1='294.55' x2='634.37' y2='294.55' style='stroke-width: 1.07; stroke-linecap: butt;' />
<line x1='571.73' y1='286.36' x2='634.37' y2='286.36' style='stroke-width: 1.07; stroke-linecap: butt;' />
<line x1='535.32' y1='278.18' x2='634.37' y2='278.18' style='stroke-width: 1.07; stroke-linecap: butt;' />
<line x1='535.32' y1='270.00' x2='634.37' y2='270.00' style='stroke-width: 1.07; stroke-linecap: butt;' />
<line x1='562.03' y1='261.82' x2='634.37' y2='261.82' style='stroke-width: 1.07; stroke-linecap: butt;' />
<line x1='562.03' y1='253.64' x2='634.37' y2='253.64' style='stroke-width: 1.07; stroke-linecap: butt;' />
<line x1='549.55' y1='245.45' x2='634.37' y2='245.45' style='stroke-width: 1.07; stroke-linecap: butt;' />
<line x1='549.55' y1='237.27' x2='634.37' y2='237.27' style='stroke-width: 1.07; stroke-linecap: butt;' />
<line x1='535.32' y1='229.09' x2='634.37' y2='229.09' style='stroke-width: 1.07; stroke-linecap: butt;' />
<line x1='535.32' y1='220.91' x2='634.37' y2='220.91' style='stroke-width: 1.07; stroke-linecap: butt;' />
<line x1='547.02' y1='212.73' x2='634.37' y2='212.73' style='stroke-width: 1.07; stroke-linecap: butt;' />
<line x1='566.71' y1='204.55' x2='634.37' y2='204.55' style='stroke-width: 1.07; stroke-linecap: butt;' />
<line x1='566.71' y1='196.36' x2='634.37' y2='196.36' style='stroke-width: 1.07; stroke-linecap: butt;' />
<line x1='537.55' y1='188.18' x2='634.37' y2='188.18' style='stroke-width: 1.07; stroke-linecap: butt;' />
<line x1='590.07' y1='180.00' x2='634.37' y2='180.00' style='stroke-width: 1.07; stroke-linecap: butt;' />
<line x1='590.07' y1='171.82' x2='634.37' y2='171.82' style='stroke-width: 1.07; stroke-linecap: butt;' />
<line x1='557.65' y1='163.64' x2='634.37' y2='163.64' style='stroke-width: 1.07; stroke-linecap: butt;' />
<line x1='557.65' y1='155.45' x2='634.37' y2='155.45' style='stroke-width: 1.07; stroke-linecap: butt;' />
<line x1='523.88' y1='147.27' x2='634.37' y2='147.27' style='stroke-width: 1.07; stroke-linecap: butt;' />
<line x1='545.78' y1='139.09' x2='634.37' y2='139.09' style='stroke-width: 1.07; stroke-linecap: butt;' />
<line x1='545.78' y1='130.91' x2='634.37' y2='130.91' style='stroke-width: 1.07; stroke-linecap: butt;' />
<line x1='546.89' y1='122.73' x2='634.37' y2='122.73' style='stroke-width: 1.07; stroke-linecap: butt;' />
<line x1='590.07' y1='114.55' x2='634.37' y2='114.55' style='stroke-width: 1.07; stroke-linecap: butt;' />
<line x1='590.07' y1='106.36' x2='634.37' y2='106.36' style='stroke-width: 1.07; stroke-linecap: butt;' />
<line x1='571.73' y1='98.18' x2='634.37' y2='98.18' style='stroke-width: 1.07; stroke-linecap: butt;' />
<line x1='571.73' y1='90.00' x2='634.37' y2='90.00' style='stroke-width: 1.07; stroke-linecap: butt;' />
<line x1='538.68' y1='81.82' x2='634.37' y2='81.82' style='stroke-width: 1.07; stroke-linecap: butt;' />
<line x1='553.50' y1='73.64' x2='634.37' y2='73.64' style='stroke-width: 1.07; stroke-linecap: butt;' />
<line x1='553.50' y1='65.45' x2='634.37' y2='65.45' style='stroke-width: 1.07; stroke-linecap: butt;' />
<line x1='562.03' y1='57.27' x2='634.37' y2='57.27' style='stroke-width: 1.07; stroke-linecap: butt;' />
<line x1='562.03' y1='49.09' x2='634.37' y2='49.09' style='stroke-width: 1.07; stroke-linecap: butt;' />
<line x1='553.50' y1='40.91' x2='634.37' y2='40.91' style='stroke-width: 1.07; stroke-linecap: butt;' />
<line x1='553.50' y1='32.73' x2='634.37' y2='32.73' style='stroke-width: 1.07; stroke-linecap: butt;' />
<circle cx='634.37' cy='687.27' r='3.56' style='stroke-width: 0.71; fill: #000000;' />
<circle cx='634.37' cy='679.09' r='3.56' style='stroke-width: 0.71; fill: #000000;' />
<circle cx='634.37' cy='670.91' r='3.56' style='stroke-width: 0.71; fill: #000000;' />
<circle cx='634.37' cy='662.73' r='3.56' style='stroke-width: 0.71; fill: #000000;' />
<circle cx='634.37' cy='654.55' r='3.56' style='stroke-width: 0.71; fill: #000000;' />
<circle cx='634.37' cy='646.36' r='3.56' style='stroke-width: 0.71; fill: #000000;' />
<circle cx='634.37' cy='638.18' r='3.56' style='stroke-width: 0.71; fill: #000000;' />
<circle cx='634.37' cy='630.00' r='3.56' style='stroke-width: 0.71; fill: #000000;' />
<circle cx='634.37' cy='621.82' r='3.56' style='stroke-width: 0.71; fill: #000000;' />
<circle cx='634.37' cy='613.64' r='3.56' style='stroke-width: 0.71; fill: #000000;' />
<circle cx='634.37' cy='605.45' r='3.56' style='stroke-width: 0.71; fill: #000000;' />
<circle cx='634.37' cy='597.27' r='3.56' style='stroke-width: 0.71; fill: #000000;' />
<circle cx='634.37' cy='589.09' r='3.56' style='stroke-width: 0.71; fill: #000000;' />
<circle cx='634.37' cy='580.91' r='3.56' style='stroke-width: 0.71; fill: #000000;' />
<circle cx='634.37' cy='572.73' r='3.56' style='stroke-width: 0.71; fill: #000000;' />
<circle cx='634.37' cy='564.55' r='3.56' style='stroke-width: 0.71; fill: #000000;' />
<circle cx='634.37' cy='556.36' r='3.56' style='stroke-width: 0.71; fill: #000000;' />
<circle cx='634.37' cy='548.18' r='3.56' style='stroke-width: 0.71; fill: #000000;' />
<circle cx='634.37' cy='540.00' r='3.56' style='stroke-width: 0.71; fill: #000000;' />
<circle cx='634.37' cy='531.82' r='3.56' style='stroke-width: 0.71; fill: #000000;' />
<circle cx='634.37' cy='523.64' r='3.56' style='stroke-width: 0.71; fill: #000000;' />
<circle cx='634.37' cy='515.45' r='3.56' style='stroke-width: 0.71; fill: #000000;' />
<circle cx='634.37' cy='507.27' r='3.56' style='stroke-width: 0.71; fill: #000000;' />
<circle cx='634.37' cy='499.09' r='3.56' style='stroke-width: 0.71; fill: #000000;' />
<circle cx='634.37' cy='490.91' r='3.56' style='stroke-width: 0.71; fill: #000000;' />
<circle cx='634.37' cy='482.73' r='3.56' style='stroke-width: 0.71; fill: #000000;' />
<circle cx='634.37' cy='474.55' r='3.56' style='stroke-width: 0.71; fill: #000000;' />
<circle cx='634.37' cy='466.36' r='3.56' style='stroke-width: 0.71; fill: #000000;' />
<circle cx='634.37' cy='458.18' r='3.56' style='stroke-width: 0.71; fill: #000000;' />
<circle cx='634.37' cy='450.00' r='3.56' style='stroke-width: 0.71; fill: #000000;' />
<circle cx='634.37' cy='441.82' r='3.56' style='stroke-width: 0.71; fill: #000000;' />
<circle cx='634.37' cy='433.64' r='3.56' style='stroke-width: 0.71; fill: #000000;' />
<circle cx='634.37' cy='425.45' r='3.56' style='stroke-width: 0.71; fill: #000000;' />
<circle cx='634.37' cy='417.27' r='3.56' style='stroke-width: 0.71; fill: #000000;' />
<circle cx='634.37' cy='409.09' r='3.56' style='stroke-width: 0.71; fill: #000000;' />
<circle cx='634.37' cy='400.91' r='3.56' style='stroke-width: 0.71; fill: #000000;' />
<circle cx='634.37' cy='392.73' r='3.56' style='stroke-width: 0.71; fill: #000000;' />
<circle cx='634.37' cy='384.55' r='3.56' style='stroke-width: 0.71; fill: #000000;' />
<circle cx='634.37' cy='376.36' r='3.56' style='stroke-width: 0.71; fill: #000000;' />
<circle cx='634.37' cy='368.18' r='3.56' style='stroke-width: 0.71; fill: #000000;' />
<circle cx='634.37' cy='360.00' r='3.56' style='stroke-width: 0.71; fill: #000000;' />
<circle cx='634.37' cy='351.82' r='3.56' style='stroke-width: 0.71; fill: #000000;' />
<circle cx='634.37' cy='343.64' r='3.56' style='stroke-width: 0.71; fill: #000000;' />
<circle cx='634.37' cy='335.45' r='3.56' style='stroke-width: 0.71; fill: #000000;' />
<circle cx='634.37' cy='327.27' r='3.56' style='stroke-width: 0.71; fill: #000000;' />
<circle cx='634.37' cy='319.09' r='3.56' style='stroke-width: 0.71; fill: #000000;' />
<circle cx='634.37' cy='310.91' r='3.56' style='stroke-width: 0.71; fill: #000000;' />
<circle cx='634.37' cy='302.73' r='3.56' style='stroke-width: 0.71; fill: #000000;' />
<circle cx='634.37' cy='294.55' r='3.56' style='stroke-width: 0.71; fill: #000000;' />
<circle cx='634.37' cy='286.36' r='3.56' style='stroke-width: 0.71; fill: #000000;' />
<circle cx='634.37' cy='278.18' r='3.56' style='stroke-width: 0.71; fill: #000000;' />
<circle cx='634.37' cy='270.00' r='3.56' style='stroke-width: 0.71; fill: #000000;' />
<circle cx='634.37' cy='261.82' r='3.56' style='stroke-width: 0.71; fill: #000000;' />
<circle cx='634.37' cy='253.64' r='3.56' style='stroke-width: 0.71; fill: #000000;' />
<circle cx='634.37' cy='245.45' r='3.56' style='stroke-width: 0.71; fill: #000000;' />
<circle cx='634.37' cy='237.27' r='3.56' style='stroke-width: 0.71; fill: #000000;' />
<circle cx='634.37' cy='229.09' r='3.56' style='stroke-width: 0.71; fill: #000000;' />
<circle cx='634.37' cy='220.91' r='3.56' style='stroke-width: 0.71; fill: #000000;' />
<circle cx='634.37' cy='212.73' r='3.56' style='stroke-width: 0.71; fill: #000000;' />
<circle cx='634.37' cy='204.55' r='3.56' style='stroke-width: 0.71; fill: #000000;' />
<circle cx='634.37' cy='196.36' r='3.56' style='stroke-width: 0.71; fill: #000000;' />
<circle cx='634.37' cy='188.18' r='3.56' style='stroke-width: 0.71; fill: #000000;' />
<circle cx='634.37' cy='180.00' r='3.56' style='stroke-width: 0.71; fill: #000000;' />
<circle cx='634.37' cy='171.82' r='3.56' style='stroke-width: 0.71; fill: #000000;' />
<circle cx='634.37' cy='163.64' r='3.56' style='stroke-width: 0.71; fill: #000000;' />
<circle cx='634.37' cy='155.45' r='3.56' style='stroke-width: 0.71; fill: #000000;' />
<circle cx='634.37' cy='147.27' r='3.56' style='stroke-width: 0.71; fill: #000000;' />
<circle cx='634.37' cy='139.09' r='3.56' style='stroke-width: 0.71; fill: #000000;' />
<circle cx='634.37' cy='130.91' r='3.56' style='stroke-width: 0.71; fill: #000000;' />
<circle cx='634.37' cy='122.73' r='3.56' style='stroke-width: 0.71; fill: #000000;' />
<circle cx='634.37' cy='114.55' r='3.56' style='stroke-width: 0.71; fill: #000000;' />
<circle cx='634.37' cy='106.36' r='3.56' style='stroke-width: 0.71; fill: #000000;' />
<circle cx='634.37' cy='98.18' r='3.56' style='stroke-width: 0.71; fill: #000000;' />
<circle cx='634.37' cy='90.00' r='3.56' style='stroke-width: 0.71; fill: #000000;' />
<circle cx='634.37' cy='81.82' r='3.56' style='stroke-width: 0.71; fill: #000000;' />
<circle cx='634.37' cy='73.64' r='3.56' style='stroke-width: 0.71; fill: #000000;' />
<circle cx='634.37' cy='65.45' r='3.56' style='stroke-width: 0.71; fill: #000000;' />
<circle cx='634.37' cy='57.27' r='3.56' style='stroke-width: 0.71; fill: #000000;' />
<circle cx='634.37' cy='49.09' r='3.56' style='stroke-width: 0.71; fill: #000000;' />
<circle cx='634.37' cy='40.91' r='3.56' style='stroke-width: 0.71; fill: #000000;' />
<circle cx='634.37' cy='32.73' r='3.56' style='stroke-width: 0.71; fill: #000000;' />
<text x='640.77' y='690.32' style='font-size: 8.54px; font-family: "Liberation Sans";' textLength='19.25px' lengthAdjust='spacingAndGlyphs'>Mew</text>
<text x='643.76' y='682.14' style='font-size: 8.54px; font-family: "Liberation Sans";' textLength='34.20px' lengthAdjust='spacingAndGlyphs'>Mewtwo</text>
<text x='645.75' y='673.95' style='font-size: 8.54px; font-family: "Liberation Sans";' textLength='44.13px' lengthAdjust='spacingAndGlyphs'>Dracolosse</text>
<text x='642.66' y='665.77' style='font-size: 8.54px; font-family: "Liberation Sans";' textLength='28.68px' lengthAdjust='spacingAndGlyphs'>Sulfura</text>
<text x='643.50' y='657.59' style='font-size: 8.54px; font-family: "Liberation Sans";' textLength='32.90px' lengthAdjust='spacingAndGlyphs'>Electhor</text>
<text x='644.26' y='649.41' style='font-size: 8.54px; font-family: "Liberation Sans";' textLength='36.69px' lengthAdjust='spacingAndGlyphs'>Artikodin</text>
<text x='642.97' y='641.23' style='font-size: 8.54px; font-family: "Liberation Sans";' textLength='30.21px' lengthAdjust='spacingAndGlyphs'>Ronflex</text>
<text x='641.19' y='633.05' style='font-size: 8.54px; font-family: "Liberation Sans";' textLength='21.35px' lengthAdjust='spacingAndGlyphs'>Ptera</text>
<text x='644.56' y='624.86' style='font-size: 8.54px; font-family: "Liberation Sans";' textLength='38.17px' lengthAdjust='spacingAndGlyphs'>Kabutops</text>
<text x='645.23' y='616.68' style='font-size: 8.54px; font-family: "Liberation Sans";' textLength='41.53px' lengthAdjust='spacingAndGlyphs'>Amonistar</text>
<text x='643.70' y='608.50' style='font-size: 8.54px; font-family: "Liberation Sans";' textLength='33.88px' lengthAdjust='spacingAndGlyphs'>Porygon</text>
<text x='641.44' y='600.32' style='font-size: 8.54px; font-family: "Liberation Sans";' textLength='22.59px' lengthAdjust='spacingAndGlyphs'>Pyroli</text>
<text x='641.87' y='592.14' style='font-size: 8.54px; font-family: "Liberation Sans";' textLength='24.75px' lengthAdjust='spacingAndGlyphs'>Voltali</text>
<text x='641.95' y='583.95' style='font-size: 8.54px; font-family: "Liberation Sans";' textLength='25.16px' lengthAdjust='spacingAndGlyphs'>Aquali</text>
<text x='646.44' y='575.77' style='font-size: 8.54px; font-family: "Liberation Sans";' textLength='47.60px' lengthAdjust='spacingAndGlyphs'>Metamorph</text>
<text x='643.85' y='567.59' style='font-size: 8.54px; font-family: "Liberation Sans";' textLength='34.62px' lengthAdjust='spacingAndGlyphs'>Lokhlass</text>
<text x='643.39' y='559.41' style='font-size: 8.54px; font-family: "Liberation Sans";' textLength='32.36px' lengthAdjust='spacingAndGlyphs'>Leviator</text>
<text x='642.44' y='551.23' style='font-size: 8.54px; font-family: "Liberation Sans";' textLength='27.57px' lengthAdjust='spacingAndGlyphs'>Tauros</text>
<text x='645.68' y='543.05' style='font-size: 8.54px; font-family: "Liberation Sans";' textLength='43.80px' lengthAdjust='spacingAndGlyphs'>Scarabrute</text>
<text x='643.73' y='534.86' style='font-size: 8.54px; font-family: "Liberation Sans";' textLength='34.05px' lengthAdjust='spacingAndGlyphs'>Magmar</text>
<text x='642.68' y='526.68' style='font-size: 8.54px; font-family: "Liberation Sans";' textLength='28.76px' lengthAdjust='spacingAndGlyphs'>Elektek</text>
<text x='645.15' y='518.50' style='font-size: 8.54px; font-family: "Liberation Sans";' textLength='41.13px' lengthAdjust='spacingAndGlyphs'>Lippoutou</text>
<text x='645.45' y='510.32' style='font-size: 8.54px; font-family: "Liberation Sans";' textLength='42.63px' lengthAdjust='spacingAndGlyphs'>Insecateur</text>
<text x='643.92' y='502.14' style='font-size: 8.54px; font-family: "Liberation Sans";' textLength='34.96px' lengthAdjust='spacingAndGlyphs'>M. Mime</text>
<text x='642.80' y='493.95' style='font-size: 8.54px; font-family: "Liberation Sans";' textLength='29.40px' lengthAdjust='spacingAndGlyphs'>Staross</text>
<text x='644.70' y='485.77' style='font-size: 8.54px; font-family: "Liberation Sans";' textLength='38.87px' lengthAdjust='spacingAndGlyphs'>Poissoroy</text>
<text x='644.93' y='477.59' style='font-size: 8.54px; font-family: "Liberation Sans";' textLength='40.05px' lengthAdjust='spacingAndGlyphs'>Hypocean</text>
<text x='645.70' y='469.41' style='font-size: 8.54px; font-family: "Liberation Sans";' textLength='43.88px' lengthAdjust='spacingAndGlyphs'>Kangourex</text>
<text x='646.97' y='461.23' style='font-size: 8.54px; font-family: "Liberation Sans";' textLength='50.23px' lengthAdjust='spacingAndGlyphs'>Saquedeneu</text>
<text x='644.81' y='453.05' style='font-size: 8.54px; font-family: "Liberation Sans";' textLength='39.45px' lengthAdjust='spacingAndGlyphs'>Leveinard</text>
<text x='645.67' y='444.86' style='font-size: 8.54px; font-family: "Liberation Sans";' textLength='43.73px' lengthAdjust='spacingAndGlyphs'>Rhinoferos</text>
<text x='644.65' y='436.68' style='font-size: 8.54px; font-family: "Liberation Sans";' textLength='38.65px' lengthAdjust='spacingAndGlyphs'>Smogogo</text>
<text x='646.08' y='428.50' style='font-size: 8.54px; font-family: "Liberation Sans";' textLength='45.76px' lengthAdjust='spacingAndGlyphs'>Excelangue</text>
<text x='642.94' y='420.32' style='font-size: 8.54px; font-family: "Liberation Sans";' textLength='30.06px' lengthAdjust='spacingAndGlyphs'>Tygnon</text>
<text x='642.51' y='412.14' style='font-size: 8.54px; font-family: "Liberation Sans";' textLength='27.96px' lengthAdjust='spacingAndGlyphs'>Kicklee</text>
<text x='645.24' y='403.95' style='font-size: 8.54px; font-family: "Liberation Sans";' textLength='41.57px' lengthAdjust='spacingAndGlyphs'>Ossatueur</text>
<text x='645.15' y='395.77' style='font-size: 8.54px; font-family: "Liberation Sans";' textLength='41.11px' lengthAdjust='spacingAndGlyphs'>Noadkoko</text>
<text x='644.46' y='387.59' style='font-size: 8.54px; font-family: "Liberation Sans";' textLength='37.68px' lengthAdjust='spacingAndGlyphs'>Electrode</text>
<text x='643.36' y='379.41' style='font-size: 8.54px; font-family: "Liberation Sans";' textLength='32.16px' lengthAdjust='spacingAndGlyphs'>Kraboss</text>
<text x='646.76' y='371.23' style='font-size: 8.54px; font-family: "Liberation Sans";' textLength='49.18px' lengthAdjust='spacingAndGlyphs'>Hypnomade</text>
<text x='640.65' y='363.05' style='font-size: 8.54px; font-family: "Liberation Sans";' textLength='18.65px' lengthAdjust='spacingAndGlyphs'>Onix</text>
<text x='646.15' y='354.86' style='font-size: 8.54px; font-family: "Liberation Sans";' textLength='46.16px' lengthAdjust='spacingAndGlyphs'>Ectoplasma</text>
<text x='644.34' y='346.68' style='font-size: 8.54px; font-family: "Liberation Sans";' textLength='37.09px' lengthAdjust='spacingAndGlyphs'>Crustabri</text>
<text x='646.72' y='338.50' style='font-size: 8.54px; font-family: "Liberation Sans";' textLength='49.00px' lengthAdjust='spacingAndGlyphs'>Grotadmorv</text>
<text x='645.45' y='330.32' style='font-size: 8.54px; font-family: "Liberation Sans";' textLength='42.65px' lengthAdjust='spacingAndGlyphs'>Lamantine</text>
<text x='642.43' y='322.14' style='font-size: 8.54px; font-family: "Liberation Sans";' textLength='27.52px' lengthAdjust='spacingAndGlyphs'>Dodrio</text>
<text x='645.64' y='313.95' style='font-size: 8.54px; font-family: "Liberation Sans";' textLength='43.56px' lengthAdjust='spacingAndGlyphs'>Canarticho</text>
<text x='645.20' y='305.77' style='font-size: 8.54px; font-family: "Liberation Sans";' textLength='41.38px' lengthAdjust='spacingAndGlyphs'>Magneton</text>
<text x='645.00' y='297.59' style='font-size: 8.54px; font-family: "Liberation Sans";' textLength='40.40px' lengthAdjust='spacingAndGlyphs'>Flagodoss</text>
<text x='642.60' y='289.41' style='font-size: 8.54px; font-family: "Liberation Sans";' textLength='28.39px' lengthAdjust='spacingAndGlyphs'>Galopa</text>
<text x='642.90' y='281.23' style='font-size: 8.54px; font-family: "Liberation Sans";' textLength='29.89px' lengthAdjust='spacingAndGlyphs'>Grolem</text>
<text x='645.44' y='273.05' style='font-size: 8.54px; font-family: "Liberation Sans";' textLength='42.60px' lengthAdjust='spacingAndGlyphs'>Tentacruel</text>
<text x='643.72' y='264.86' style='font-size: 8.54px; font-family: "Liberation Sans";' textLength='33.99px' lengthAdjust='spacingAndGlyphs'>Empiflor</text>
<text x='647.02' y='256.68' style='font-size: 8.54px; font-family: "Liberation Sans";' textLength='50.47px' lengthAdjust='spacingAndGlyphs'>Mackogneur</text>
<text x='644.63' y='248.50' style='font-size: 8.54px; font-family: "Liberation Sans";' textLength='38.53px' lengthAdjust='spacingAndGlyphs'>Alakazam</text>
<text x='642.86' y='240.32' style='font-size: 8.54px; font-family: "Liberation Sans";' textLength='29.68px' lengthAdjust='spacingAndGlyphs'>Tartard</text>
<text x='643.04' y='232.14' style='font-size: 8.54px; font-family: "Liberation Sans";' textLength='30.60px' lengthAdjust='spacingAndGlyphs'>Arcanin</text>
<text x='645.65' y='223.95' style='font-size: 8.54px; font-family: "Liberation Sans";' textLength='43.61px' lengthAdjust='spacingAndGlyphs'>Colossinge</text>
<text x='645.34' y='215.77' style='font-size: 8.54px; font-family: "Liberation Sans";' textLength='42.09px' lengthAdjust='spacingAndGlyphs'>Akwakwak</text>
<text x='642.89' y='207.59' style='font-size: 8.54px; font-family: "Liberation Sans";' textLength='29.82px' lengthAdjust='spacingAndGlyphs'>Persian</text>
<text x='645.17' y='199.41' style='font-size: 8.54px; font-family: "Liberation Sans";' textLength='41.23px' lengthAdjust='spacingAndGlyphs'>Triopikeur</text>
<text x='644.32' y='191.23' style='font-size: 8.54px; font-family: "Liberation Sans";' textLength='37.01px' lengthAdjust='spacingAndGlyphs'>Aeromite</text>
<text x='643.78' y='183.05' style='font-size: 8.54px; font-family: "Liberation Sans";' textLength='34.31px' lengthAdjust='spacingAndGlyphs'>Parasect</text>
<text x='643.73' y='174.86' style='font-size: 8.54px; font-family: "Liberation Sans";' textLength='34.03px' lengthAdjust='spacingAndGlyphs'>Rafflesia</text>
<text x='645.37' y='166.68' style='font-size: 8.54px; font-family: "Liberation Sans";' textLength='42.22px' lengthAdjust='spacingAndGlyphs'>Nosferalto</text>
<text x='645.68' y='158.50' style='font-size: 8.54px; font-family: "Liberation Sans";' textLength='43.78px' lengthAdjust='spacingAndGlyphs'>Papillusion</text>
<text x='644.55' y='150.32' style='font-size: 8.54px; font-family: "Liberation Sans";' textLength='38.15px' lengthAdjust='spacingAndGlyphs'>Florizarre</text>
<text x='645.26' y='142.14' style='font-size: 8.54px; font-family: "Liberation Sans";' textLength='41.71px' lengthAdjust='spacingAndGlyphs'>Dracaufeu</text>
<text x='643.15' y='133.95' style='font-size: 8.54px; font-family: "Liberation Sans";' textLength='31.13px' lengthAdjust='spacingAndGlyphs'>Tortank</text>
<text x='645.95' y='125.77' style='font-size: 8.54px; font-family: "Liberation Sans";' textLength='45.14px' lengthAdjust='spacingAndGlyphs'>Dardagnan</text>
<text x='646.58' y='117.59' style='font-size: 8.54px; font-family: "Liberation Sans";' textLength='48.26px' lengthAdjust='spacingAndGlyphs'>Roucarnage</text>
<text x='643.52' y='109.41' style='font-size: 8.54px; font-family: "Liberation Sans";' textLength='32.99px' lengthAdjust='spacingAndGlyphs'>Rattatac</text>
<text x='646.08' y='101.23' style='font-size: 8.54px; font-family: "Liberation Sans";' textLength='45.80px' lengthAdjust='spacingAndGlyphs'>Rapasdepic</text>
<text x='641.71' y='93.05' style='font-size: 8.54px; font-family: "Liberation Sans";' textLength='23.94px' lengthAdjust='spacingAndGlyphs'>Arbok</text>
<text x='642.31' y='84.86' style='font-size: 8.54px; font-family: "Liberation Sans";' textLength='26.94px' lengthAdjust='spacingAndGlyphs'>Raichu</text>
<text x='645.38' y='76.68' style='font-size: 8.54px; font-family: "Liberation Sans";' textLength='42.29px' lengthAdjust='spacingAndGlyphs'>Sablaireau</text>
<text x='645.83' y='68.50' style='font-size: 8.54px; font-family: "Liberation Sans";' textLength='44.51px' lengthAdjust='spacingAndGlyphs'>Nidoqueen</text>
<text x='644.20' y='60.32' style='font-size: 8.54px; font-family: "Liberation Sans";' textLength='36.37px' lengthAdjust='spacingAndGlyphs'>Nidoking</text>
<text x='644.91' y='52.14' style='font-size: 8.54px; font-family: "Liberation Sans";' textLength='39.92px' lengthAdjust='spacingAndGlyphs'>Melodelfe</text>
<text x='643.59' y='43.95' style='font-size: 8.54px; font-family: "Liberation Sans";' textLength='33.34px' lengthAdjust='spacingAndGlyphs'>Feunard</text>
<text x='646.18' y='35.77' style='font-size: 8.54px; font-family: "Liberation Sans";' textLength='46.27px' lengthAdjust='spacingAndGlyphs'>Grodoudou</text>
</g>
</svg>
