<?xml version="1.0" encoding="UTF-8"?>
<svg xmlns="http://www.w3.org/2000/svg" xmlns:xlink="http://www.w3.org/1999/xlink" width="417.459" height="321.602" viewBox="0 0 417.459 321.602">
<path fill-rule="nonzero" fill="rgb(0%, 0%, 0%)" fill-opacity="1" stroke-width="0.3985" stroke-linecap="butt" stroke-linejoin="miter" stroke="rgb(0%, 0%, 0%)" stroke-opacity="1" stroke-miterlimit="10" d="M 4.697469 0.00175 C 4.697469 2.5955 2.592 4.697063 -0.00175 4.697063 C -2.5955 4.697063 -4.697062 2.5955 -4.697062 0.00175 C -4.697062 -2.592 -2.5955 -4.697469 -0.00175 -4.697469 C 2.592 -4.697469 4.697469 -2.592 4.697469 0.00175 Z M 4.697469 0.00175 " transform="matrix(1, 0, 0, -1, 302.533, 302.533)"/>
<path fill="none" stroke-width="0.3985" stroke-linecap="butt" stroke-linejoin="miter" stroke="rgb(0%, 0%, 0%)" stroke-opacity="1" stroke-miterlimit="10" d="M -3.462687 3.462688 L -283.466594 283.466594 " transform="matrix(1, 0, 0, -1, 302.533, 302.533)"/>
<path fill-rule="nonzero" fill="rgb(100%, 100%, 100%)" fill-opacity="1" stroke-width="0.3985" stroke-linecap="butt" stroke-linejoin="miter" stroke="rgb(0%, 0%, 0%)" stroke-opacity="1" stroke-miterlimit="10" d="M -60.013469 53.372844 L -53.372844 53.372844 L -53.372844 60.013469 L -60.013469 60.013469 Z M -60.013469 53.372844 " transform="matrix(1, 0, 0, -1, 302.533, 302.533)"/>
<path fill-rule="nonzero" fill="rgb(100%, 100%, 100%)" fill-opacity="1" stroke-width="0.3985" stroke-linecap="butt" stroke-linejoin="miter" stroke="rgb(0%, 0%, 0%)" stroke-opacity="1" stroke-miterlimit="10" d="M -116.708781 110.068156 L -110.068156 110.068156 L -110.068156 116.708781 L -116.708781 116.708781 Z M -116.708781 110.068156 " transform="matrix(1, 0, 0, -1, 302.533, 302.533)"/>
<path fill-rule="nonzero" fill="rgb(100%, 100%, 100%)" fill-opacity="1" stroke-width="0.3985" stroke-linecap="butt" stroke-linejoin="miter" stroke="rgb(0%, 0%, 0%)" stroke-opacity="1" stroke-miterlimit="10" d="M -173.400187 166.759563 L -166.759562 166.759563 L -166.759562 173.400188 L -173.400187 173.400188 Z M -173.400187 166.759563 " transform="matrix(1, 0, 0, -1, 302.533, 302.533)"/>
<path fill-rule="nonzero" fill="rgb(100%, 100%, 100%)" fill-opacity="1" stroke-width="0.3985" stroke-linecap="butt" stroke-linejoin="miter" stroke="rgb(0%, 0%, 0%)" stroke-opacity="1" stroke-miterlimit="10" d="M -230.0955 223.454875 L -223.454875 223.454875 L -223.454875 230.0955 L -230.0955 230.0955 Z M -230.0955 223.454875 " transform="matrix(1, 0, 0, -1, 302.533, 302.533)"/>
<path fill-rule="nonzero" fill="rgb(100%, 100%, 100%)" fill-opacity="1" stroke-width="0.3985" stroke-linecap="butt" stroke-linejoin="miter" stroke="rgb(0%, 0%, 0%)" stroke-opacity="1" stroke-miterlimit="10" d="M -286.786906 280.146281 L -280.146281 280.146281 L -280.146281 286.786906 L -286.786906 286.786906 Z M -286.786906 280.146281 " transform="matrix(1, 0, 0, -1, 302.533, 302.533)"/>
<path fill-rule="nonzero" fill="rgb(0%, 0%, 0%)" fill-opacity="1" stroke-width="0.3985" stroke-linecap="butt" stroke-linejoin="miter" stroke="rgb(0%, 0%, 0%)" stroke-opacity="1" stroke-miterlimit="10" d="M -278.771281 283.466594 C -278.771281 286.060344 -280.872844 288.165813 -283.466594 288.165813 C -286.060344 288.165813 -288.165812 286.060344 -288.165812 283.466594 C -288.165812 280.872844 -286.060344 278.771281 -283.466594 278.771281 C -280.872844 278.771281 -278.771281 280.872844 -278.771281 283.466594 Z M -278.771281 283.466594 " transform="matrix(1, 0, 0, -1, 302.533, 302.533)"/>
<path fill-rule="nonzero" fill="rgb(0%, 0%, 0%)" fill-opacity="1" stroke-width="0.3985" stroke-linecap="butt" stroke-linejoin="miter" stroke="rgb(0%, 0%, 0%)" stroke-opacity="1" stroke-miterlimit="10" d="M -183.93925 283.466594 C -183.93925 286.060344 -186.044719 288.165813 -188.634562 288.165813 C -191.228312 288.165813 -193.333781 286.060344 -193.333781 283.466594 C -193.333781 280.872844 -191.228312 278.771281 -188.634562 278.771281 C -186.044719 278.771281 -183.93925 280.872844 -183.93925 283.466594 Z M -183.93925 283.466594 " transform="matrix(1, 0, 0, -1, 302.533, 302.533)"/>
<path fill="none" stroke-width="0.3985" stroke-linecap="butt" stroke-linejoin="miter" stroke="rgb(0%, 0%, 0%)" stroke-opacity="1" stroke-miterlimit="10" d="M -224.408 230.294719 L -191.368937 279.408 " transform="matrix(1, 0, 0, -1, 302.533, 302.533)"/>
<path fill-rule="nonzero" fill="rgb(0%, 0%, 0%)" fill-opacity="1" stroke-width="0.3985" stroke-linecap="butt" stroke-linejoin="miter" stroke="rgb(0%, 0%, 0%)" stroke-opacity="1" stroke-miterlimit="10" d="M -89.107219 283.466594 C -89.107219 286.060344 -91.212687 288.165813 -93.806437 288.165813 C -96.400187 288.165813 -98.50175 286.060344 -98.50175 283.466594 C -98.50175 280.872844 -96.400187 278.771281 -93.806437 278.771281 C -91.212687 278.771281 -89.107219 280.872844 -89.107219 283.466594 Z M -89.107219 283.466594 " transform="matrix(1, 0, 0, -1, 302.533, 302.533)"/>
<path fill="none" stroke-width="0.3985" stroke-linecap="butt" stroke-linejoin="miter" stroke="rgb(0%, 0%, 0%)" stroke-opacity="1" stroke-miterlimit="10" d="M -167.712687 173.599406 L -96.536906 279.408 " transform="matrix(1, 0, 0, -1, 302.533, 302.533)"/>
<path fill-rule="nonzero" fill="rgb(0%, 0%, 0%)" fill-opacity="1" stroke-width="0.3985" stroke-linecap="butt" stroke-linejoin="miter" stroke="rgb(0%, 0%, 0%)" stroke-opacity="1" stroke-miterlimit="10" d="M 5.724813 283.466594 C 5.724813 286.060344 3.619344 288.165813 1.025594 288.165813 C -1.568156 288.165813 -3.669719 286.060344 -3.669719 283.466594 C -3.669719 280.872844 -1.568156 278.771281 1.025594 278.771281 C 3.619344 278.771281 5.724813 280.872844 5.724813 283.466594 Z M 5.724813 283.466594 " transform="matrix(1, 0, 0, -1, 302.533, 302.533)"/>
<path fill="none" stroke-width="0.3985" stroke-linecap="butt" stroke-linejoin="miter" stroke="rgb(0%, 0%, 0%)" stroke-opacity="1" stroke-miterlimit="10" d="M -111.021281 116.908 L -1.704875 279.408 " transform="matrix(1, 0, 0, -1, 302.533, 302.533)"/>
<path fill-rule="nonzero" fill="rgb(0%, 0%, 0%)" fill-opacity="1" stroke-width="0.3985" stroke-linecap="butt" stroke-linejoin="miter" stroke="rgb(0%, 0%, 0%)" stroke-opacity="1" stroke-miterlimit="10" d="M 100.552938 283.466594 C 100.552938 286.060344 98.451375 288.165813 95.857625 288.165813 C 93.263875 288.165813 91.162313 286.060344 91.162313 283.466594 C 91.162313 280.872844 93.263875 278.771281 95.857625 278.771281 C 98.451375 278.771281 100.552938 280.872844 100.552938 283.466594 Z M 100.552938 283.466594 " transform="matrix(1, 0, 0, -1, 302.533, 302.533)"/>
<path fill="none" stroke-width="0.3985" stroke-linecap="butt" stroke-linejoin="miter" stroke="rgb(0%, 0%, 0%)" stroke-opacity="1" stroke-miterlimit="10" d="M -54.325969 60.212688 L 93.127156 279.408 " transform="matrix(1, 0, 0, -1, 302.533, 302.533)"/>
</svg>
