[
  {
    "kmer": "AAAA",
    "tone": "G",
    "duration": "blanche"
  },
  {
    "kmer": "AAAC",
    "tone": "D",
    "duration": "ronde"
  },
  {
    "kmer": "AAAG",
    "tone": "G",
    "duration": "noire"
  },
  {
    "kmer": "AAAT",
    "tone": "C",
    "duration": "noire"
  },
  {
    "kmer": "AACA",
    "tone": "C",
    "duration": "double croche"
  },
  {
    "kmer": "AACC",
    "tone": "G",
    "duration": "noire"
  },
  {
    "kmer": "AACG",
    "tone": "C",
    "duration": "croche"
  },
  {
    "kmer": "AACT",
    "tone": "C",
    "duration": "blanche"
  },
  {
    "kmer": "AAGA",
    "tone": "E",
    "duration": "ronde"
  },
  {
    "kmer": "AAGC",
    "tone": "F",
    "duration": "double croche"
  },
  {
    "kmer": "AAGG",
    "tone": "F",
    "duration": "noire"
  },
  {
    "kmer": "AAGT",
    "tone": "D",
    "duration": "noire"
  },
  {
    "kmer": "AATA",
    "tone": "E",
    "duration": "ronde"
  },
  {
    "kmer": "AATC",
    "tone": "D",
    "duration": "blanche"
  },
  {
    "kmer": "AATG",
    "tone": "D",
    "duration": "noire"
  },
  {
    "kmer": "AATT",
    "tone": "B",
    "duration": "noire"
  },
  {
    "kmer": "ACAA",
    "tone": "E",
    "duration": "double croche"
  },
  {
    "kmer": "ACAC",
    "tone": "C",
    "duration": "double croche"
  },
  {
    "kmer": "ACAG",
    "tone": "C",
    "duration": "croche"
  },
  {
    "kmer": "ACAT",
    "tone": "D",
    "duration": "double croche"
  },
  {
    "kmer": "ACCA",
    "tone": "D",
    "duration": "ronde"
  },
  {
    "kmer": "ACCC",
    "tone": "C",
    "duration": "ronde"
  },
  {
    "kmer": "ACCG",
    "tone": "B",
    "duration": "croche"
  },
  {
    "kmer": "ACCT",
    "tone": "F",
    "duration": "blanche"
  },
  {
    "kmer": "ACGA",
    "tone": "B",
    "duration": "blanche"
  },
  {
    "kmer": "ACGC",
    "tone": "F",
    "duration": "double croche"
  },
  {
    "kmer": "ACGG",
    "tone": "C",
    "duration": "double croche"
  },
  {
    "kmer": "ACGT",
    "tone": "A",
    "duration": "ronde"
  },
  {
    "kmer": "ACTA",
    "tone": "C",
    "duration": "blanche"
  },
  {
    "kmer": "ACTC",
    "tone": "E",
    "duration": "blanche"
  },
  {
    "kmer": "ACTG",
    "tone": "C",
    "duration": "ronde"
  },
  {
    "kmer": "ACTT",
    "tone": "F",
    "duration": "noire"
  },
  {
    "kmer": "AGAA",
    "tone": "C",
    "duration": "blanche"
  },
  {
    "kmer": "AGAC",
    "tone": "C",
    "duration": "ronde"
  },
  {
    "kmer": "AGAG",
    "tone": "B",
    "duration": "noire"
  },
  {
    "kmer": "AGAT",
    "tone": "C",
    "duration": "noire"
  },
  {
    "kmer": "AGCA",
    "tone": "A",
    "duration": "blanche"
  },
  {
    "kmer": "AGCC",
    "tone": "C",
    "duration": "ronde"
  },
  {
    "kmer": "AGCG",
    "tone": "F",
    "duration": "blanche"
  },
  {
    "kmer": "AGCT",
    "tone": "A",
    "duration": "blanche"
  },
  {
    "kmer": "AGGA",
    "tone": "D",
    "duration": "croche"
  },
  {
    "kmer": "AGGC",
    "tone": "G",
    "duration": "double croche"
  },
  {
    "kmer": "AGGG",
    "tone": "F",
    "duration": "blanche"
  },
  {
    "kmer": "AGGT",
    "tone": "F",
    "duration": "ronde"
  },
  {
    "kmer": "AGTA",
    "tone": "B",
    "duration": "double croche"
  },
  {
    "kmer": "AGTC",
    "tone": "C",
    "duration": "ronde"
  },
  {
    "kmer": "AGTG",
    "tone": "C",
    "duration": "croche"
  },
  {
    "kmer": "AGTT",
    "tone": "F",
    "duration": "double croche"
  },
  {
    "kmer": "ATAA",
    "tone": "F",
    "duration": "croche"
  },
  {
    "kmer": "ATAC",
    "tone": "F",
    "duration": "ronde"
  },
  {
    "kmer": "ATAG",
    "tone": "F",
    "duration": "noire"
  },
  {
    "kmer": "ATAT",
    "tone": "C",
    "duration": "noire"
  },
  {
    "kmer": "ATCA",
    "tone": "A",
    "duration": "croche"
  },
  {
    "kmer": "ATCC",
    "tone": "E",
    "duration": "double croche"
  },
  {
    "kmer": "ATCG",
    "tone": "D",
    "duration": "noire"
  },
  {
    "kmer": "ATCT",
    "tone": "A",
    "duration": "double croche"
  },
  {
    "kmer": "ATGA",
    "tone": "D",
    "duration": "blanche"
  },
  {
    "kmer": "ATGC",
    "tone": "C",
    "duration": "double croche"
  },
  {
    "kmer": "ATGG",
    "tone": "F",
    "duration": "ronde"
  },
  {
    "kmer": "ATGT",
    "tone": "A",
    "duration": "double croche"
  },
  {
    "kmer": "ATTA",
    "tone": "G",
    "duration": "double croche"
  },
  {
    "kmer": "ATTC",
    "tone": "C",
    "duration": "croche"
  },
  {
    "kmer": "ATTG",
    "tone": "B",
    "duration": "ronde"
  },
  {
    "kmer": "ATTT",
    "tone": "D",
    "duration": "noire"
  },
  {
    "kmer": "CAAA",
    "tone": "A",
    "duration": "blanche"
  },
  {
    "kmer": "CAAC",
    "tone": "A",
    "duration": "double croche"
  },
  {
    "kmer": "CAAG",
    "tone": "F",
    "duration": "ronde"
  },
  {
    "kmer": "CAAT",
    "tone": "C",
    "duration": "ronde"
  },
  {
    "kmer": "CACA",
    "tone": "G",
    "duration": "noire"
  },
  {
    "kmer": "CACC",
    "tone": "C",
    "duration": "croche"
  },
  {
    "kmer": "CACG",
    "tone": "F",
    "duration": "ronde"
  },
  {
    "kmer": "CACT",
    "tone": "D",
    "duration": "noire"
  },
  {
    "kmer": "CAGA",
    "tone": "B",
    "duration": "noire"
  },
  {
    "kmer": "CAGC",
    "tone": "G",
    "duration": "noire"
  },
  {
    "kmer": "CAGG",
    "tone": "C",
    "duration": "noire"
  },
  {
    "kmer": "CAGT",
    "tone": "C",
    "duration": "ronde"
  },
  {
    "kmer": "CATA",
    "tone": "D",
    "duration": "blanche"
  },
  {
    "kmer": "CATC",
    "tone": "D",
    "duration": "ronde"
  },
  {
    "kmer": "CATG",
    "tone": "C",
    "duration": "ronde"
  },
  {
    "kmer": "CATT",
    "tone": "E",
    "duration": "blanche"
  },
  {
    "kmer": "CCAA",
    "tone": "G",
    "duration": "ronde"
  },
  {
    "kmer": "CCAC",
    "tone": "D",
    "duration": "noire"
  },
  {
    "kmer": "CCAG",
    "tone": "C",
    "duration": "blanche"
  },
  {
    "kmer": "CCAT",
    "tone": "D",
    "duration": "noire"
  },
  {
    "kmer": "CCCA",
    "tone": "F",
    "duration": "ronde"
  },
  {
    "kmer": "CCCC",
    "tone": "D",
    "duration": "noire"
  },
  {
    "kmer": "CCCG",
    "tone": "E",
    "duration": "double croche"
  },
  {
    "kmer": "CCCT",
    "tone": "B",
    "duration": "noire"
  },
  {
    "kmer": "CCGA",
    "tone": "C",
    "duration": "double croche"
  },
  {
    "kmer": "CCGC",
    "tone": "D",
    "duration": "blanche"
  },
  {
    "kmer": "CCGG",
    "tone": "C",
    "duration": "noire"
  },
  {
    "kmer": "CCGT",
    "tone": "B",
    "duration": "ronde"
  },
  {
    "kmer": "CCTA",
    "tone": "A",
    "duration": "noire"
  },
  {
    "kmer": "CCTC",
    "tone": "B",
    "duration": "blanche"
  },
  {
    "kmer": "CCTG",
    "tone": "B",
    "duration": "noire"
  },
  {
    "kmer": "CCTT",
    "tone": "B",
    "duration": "ronde"
  },
  {
    "kmer": "CGAA",
    "tone": "D",
    "duration": "double croche"
  },
  {
    "kmer": "CGAC",
    "tone": "G",
    "duration": "double croche"
  },
  {
    "kmer": "CGAG",
    "tone": "A",
    "duration": "croche"
  },
  {
    "kmer": "CGAT",
    "tone": "D",
    "duration": "double croche"
  },
  {
    "kmer": "CGCA",
    "tone": "G",
    "duration": "double croche"
  },
  {
    "kmer": "CGCC",
    "tone": "F",
    "duration": "double croche"
  },
  {
    "kmer": "CGCG",
    "tone": "E",
    "duration": "ronde"
  },
  {
    "kmer": "CGCT",
    "tone": "E",
    "duration": "noire"
  },
  {
    "kmer": "CGGA",
    "tone": "G",
    "duration": "croche"
  },
  {
    "kmer": "CGGC",
    "tone": "G",
    "duration": "noire"
  },
  {
    "kmer": "CGGG",
    "tone": "B",
    "duration": "croche"
  },
  {
    "kmer": "CGGT",
    "tone": "E",
    "duration": "croche"
  },
  {
    "kmer": "CGTA",
    "tone": "D",
    "duration": "ronde"
  },
  {
    "kmer": "CGTC",
    "tone": "A",
    "duration": "blanche"
  },
  {
    "kmer": "CGTG",
    "tone": "G",
    "duration": "ronde"
  },
  {
    "kmer": "CGTT",
    "tone": "C",
    "duration": "croche"
  },
  {
    "kmer": "CTAA",
    "tone": "D",
    "duration": "noire"
  },
  {
    "kmer": "CTAC",
    "tone": "D",
    "duration": "blanche"
  },
  {
    "kmer": "CTAG",
    "tone": "C",
    "duration": "noire"
  },
  {
    "kmer": "CTAT",
    "tone": "G",
    "duration": "blanche"
  },
  {
    "kmer": "CTCA",
    "tone": "C",
    "duration": "double croche"
  },
  {
    "kmer": "CTCC",
    "tone": "G",
    "duration": "croche"
  },
  {
    "kmer": "CTCG",
    "tone": "G",
    "duration": "blanche"
  },
  {
    "kmer": "CTCT",
    "tone": "C",
    "duration": "ronde"
  },
  {
    "kmer": "CTGA",
    "tone": "F",
    "duration": "croche"
  },
  {
    "kmer": "CTGC",
    "tone": "E",
    "duration": "ronde"
  },
  {
    "kmer": "CTGG",
    "tone": "B",
    "duration": "blanche"
  },
  {
    "kmer": "CTGT",
    "tone": "C",
    "duration": "double croche"
  },
  {
    "kmer": "CTTA",
    "tone": "A",
    "duration": "blanche"
  },
  {
    "kmer": "CTTC",
    "tone": "D",
    "duration": "croche"
  },
  {
    "kmer": "CTTG",
    "tone": "B",
    "duration": "double croche"
  },
  {
    "kmer": "CTTT",
    "tone": "F",
    "duration": "noire"
  },
  {
    "kmer": "GAAA",
    "tone": "C",
    "duration": "croche"
  },
  {
    "kmer": "GAAC",
    "tone": "F",
    "duration": "croche"
  },
  {
    "kmer": "GAAG",
    "tone": "D",
    "duration": "ronde"
  },
  {
    "kmer": "GAAT",
    "tone": "C",
    "duration": "ronde"
  },
  {
    "kmer": "GACA",
    "tone": "A",
    "duration": "croche"
  },
  {
    "kmer": "GACC",
    "tone": "B",
    "duration": "croche"
  },
  {
    "kmer": "GACG",
    "tone": "E",
    "duration": "ronde"
  },
  {
    "kmer": "GACT",
    "tone": "F",
    "duration": "ronde"
  },
  {
    "kmer": "GAGA",
    "tone": "B",
    "duration": "croche"
  },
  {
    "kmer": "GAGC",
    "tone": "D",
    "duration": "noire"
  },
  {
    "kmer": "GAGG",
    "tone": "A",
    "duration": "noire"
  },
  {
    "kmer": "GAGT",
    "tone": "G",
    "duration": "croche"
  },
  {
    "kmer": "GATA",
    "tone": "G",
    "duration": "double croche"
  },
  {
    "kmer": "GATC",
    "tone": "D",
    "duration": "croche"
  },
  {
    "kmer": "GATG",
    "tone": "F",
    "duration": "croche"
  },
  {
    "kmer": "GATT",
    "tone": "D",
    "duration": "noire"
  },
  {
    "kmer": "GCAA",
    "tone": "E",
    "duration": "noire"
  },
  {
    "kmer": "GCAC",
    "tone": "G",
    "duration": "double croche"
  },
  {
    "kmer": "GCAG",
    "tone": "C",
    "duration": "noire"
  },
  {
    "kmer": "GCAT",
    "tone": "C",
    "duration": "noire"
  },
  {
    "kmer": "GCCA",
    "tone": "E",
    "duration": "ronde"
  },
  {
    "kmer": "GCCC",
    "tone": "G",
    "duration": "noire"
  },
  {
    "kmer": "GCCG",
    "tone": "D",
    "duration": "croche"
  },
  {
    "kmer": "GCCT",
    "tone": "B",
    "duration": "double croche"
  },
  {
    "kmer": "GCGA",
    "tone": "C",
    "duration": "double croche"
  },
  {
    "kmer": "GCGC",
    "tone": "D",
    "duration": "blanche"
  },
  {
    "kmer": "GCGG",
    "tone": "D",
    "duration": "double croche"
  },
  {
    "kmer": "GCGT",
    "tone": "F",
    "duration": "blanche"
  },
  {
    "kmer": "GCTA",
    "tone": "C",
    "duration": "blanche"
  },
  {
    "kmer": "GCTC",
    "tone": "C",
    "duration": "double croche"
  },
  {
    "kmer": "GCTG",
    "tone": "C",
    "duration": "ronde"
  },
  {
    "kmer": "GCTT",
    "tone": "A",
    "duration": "croche"
  },
  {
    "kmer": "GGAA",
    "tone": "B",
    "duration": "ronde"
  },
  {
    "kmer": "GGAC",
    "tone": "E",
    "duration": "ronde"
  },
  {
    "kmer": "GGAG",
    "tone": "G",
    "duration": "blanche"
  },
  {
    "kmer": "GGAT",
    "tone": "G",
    "duration": "double croche"
  },
  {
    "kmer": "GGCA",
    "tone": "G",
    "duration": "croche"
  },
  {
    "kmer": "GGCC",
    "tone": "B",
    "duration": "croche"
  },
  {
    "kmer": "GGCG",
    "tone": "F",
    "duration": "double croche"
  },
  {
    "kmer": "GGCT",
    "tone": "C",
    "duration": "double croche"
  },
  {
    "kmer": "GGGA",
    "tone": "C",
    "duration": "double croche"
  },
  {
    "kmer": "GGGC",
    "tone": "B",
    "duration": "croche"
  },
  {
    "kmer": "GGGG",
    "tone": "D",
    "duration": "noire"
  },
  {
    "kmer": "GGGT",
    "tone": "A",
    "duration": "ronde"
  },
  {
    "kmer": "GGTA",
    "tone": "B",
    "duration": "croche"
  },
  {
    "kmer": "GGTC",
    "tone": "G",
    "duration": "blanche"
  },
  {
    "kmer": "GGTG",
    "tone": "C",
    "duration": "blanche"
  },
  {
    "kmer": "GGTT",
    "tone": "G",
    "duration": "double croche"
  },
  {
    "kmer": "GTAA",
    "tone": "C",
    "duration": "double croche"
  },
  {
    "kmer": "GTAC",
    "tone": "D",
    "duration": "croche"
  },
  {
    "kmer": "GTAG",
    "tone": "C",
    "duration": "double croche"
  },
  {
    "kmer": "GTAT",
    "tone": "C",
    "duration": "double croche"
  },
  {
    "kmer": "GTCA",
    "tone": "C",
    "duration": "blanche"
  },
  {
    "kmer": "GTCC",
    "tone": "B",
    "duration": "ronde"
  },
  {
    "kmer": "GTCG",
    "tone": "D",
    "duration": "noire"
  },
  {
    "kmer": "GTCT",
    "tone": "B",
    "duration": "noire"
  },
  {
    "kmer": "GTGA",
    "tone": "F",
    "duration": "blanche"
  },
  {
    "kmer": "GTGC",
    "tone": "B",
    "duration": "croche"
  },
  {
    "kmer": "GTGG",
    "tone": "B",
    "duration": "blanche"
  },
  {
    "kmer": "GTGT",
    "tone": "C",
    "duration": "ronde"
  },
  {
    "kmer": "GTTA",
    "tone": "C",
    "duration": "noire"
  },
  {
    "kmer": "GTTC",
    "tone": "G",
    "duration": "noire"
  },
  {
    "kmer": "GTTG",
    "tone": "A",
    "duration": "noire"
  },
  {
    "kmer": "GTTT",
    "tone": "E",
    "duration": "double croche"
  },
  {
    "kmer": "TAAA",
    "tone": "F",
    "duration": "ronde"
  },
  {
    "kmer": "TAAC",
    "tone": "G",
    "duration": "blanche"
  },
  {
    "kmer": "TAAG",
    "tone": "D",
    "duration": "blanche"
  },
  {
    "kmer": "TAAT",
    "tone": "D",
    "duration": "blanche"
  },
  {
    "kmer": "TACA",
    "tone": "D",
    "duration": "ronde"
  },
  {
    "kmer": "TACC",
    "tone": "F",
    "duration": "blanche"
  },
  {
    "kmer": "TACG",
    "tone": "D",
    "duration": "croche"
  },
  {
    "kmer": "TACT",
    "tone": "E",
    "duration": "noire"
  },
  {
    "kmer": "TAGA",
    "tone": "G",
    "duration": "croche"
  },
  {
    "kmer": "TAGC",
    "tone": "C",
    "duration": "croche"
  },
  {
    "kmer": "TAGG",
    "tone": "B",
    "duration": "double croche"
  },
  {
    "kmer": "TAGT",
    "tone": "F",
    "duration": "croche"
  },
  {
    "kmer": "TATA",
    "tone": "C",
    "duration": "double croche"
  },
  {
    "kmer": "TATC",
    "tone": "E",
    "duration": "noire"
  },
  {
    "kmer": "TATG",
    "tone": "G",
    "duration": "double croche"
  },
  {
    "kmer": "TATT",
    "tone": "G",
    "duration": "blanche"
  },
  {
    "kmer": "TCAA",
    "tone": "C",
    "duration": "croche"
  },
  {
    "kmer": "TCAC",
    "tone": "C",
    "duration": "double croche"
  },
  {
    "kmer": "TCAG",
    "tone": "F",
    "duration": "blanche"
  },
  {
    "kmer": "TCAT",
    "tone": "B",
    "duration": "double croche"
  },
  {
    "kmer": "TCCA",
    "tone": "B",
    "duration": "ronde"
  },
  {
    "kmer": "TCCC",
    "tone": "G",
    "duration": "double croche"
  },
  {
    "kmer": "TCCG",
    "tone": "G",
    "duration": "croche"
  },
  {
    "kmer": "TCCT",
    "tone": "B",
    "duration": "croche"
  },
  {
    "kmer": "TCGA",
    "tone": "A",
    "duration": "noire"
  },
  {
    "kmer": "TCGC",
    "tone": "G",
    "duration": "noire"
  },
  {
    "kmer": "TCGG",
    "tone": "E",
    "duration": "double croche"
  },
  {
    "kmer": "TCGT",
    "tone": "D",
    "duration": "ronde"
  },
  {
    "kmer": "TCTA",
    "tone": "E",
    "duration": "noire"
  },
  {
    "kmer": "TCTC",
    "tone": "E",
    "duration": "noire"
  },
  {
    "kmer": "TCTG",
    "tone": "D",
    "duration": "noire"
  },
  {
    "kmer": "TCTT",
    "tone": "F",
    "duration": "croche"
  },
  {
    "kmer": "TGAA",
    "tone": "F",
    "duration": "double croche"
  },
  {
    "kmer": "TGAC",
    "tone": "B",
    "duration": "croche"
  },
  {
    "kmer": "TGAG",
    "tone": "E",
    "duration": "blanche"
  },
  {
    "kmer": "TGAT",
    "tone": "A",
    "duration": "blanche"
  },
  {
    "kmer": "TGCA",
    "tone": "E",
    "duration": "ronde"
  },
  {
    "kmer": "TGCC",
    "tone": "F",
    "duration": "ronde"
  },
  {
    "kmer": "TGCG",
    "tone": "G",
    "duration": "ronde"
  },
  {
    "kmer": "TGCT",
    "tone": "G",
    "duration": "ronde"
  },
  {
    "kmer": "TGGA",
    "tone": "E",
    "duration": "noire"
  },
  {
    "kmer": "TGGC",
    "tone": "F",
    "duration": "double croche"
  },
  {
    "kmer": "TGGG",
    "tone": "B",
    "duration": "double croche"
  },
  {
    "kmer": "TGGT",
    "tone": "C",
    "duration": "blanche"
  },
  {
    "kmer": "TGTA",
    "tone": "C",
    "duration": "noire"
  },
  {
    "kmer": "TGTC",
    "tone": "C",
    "duration": "noire"
  },
  {
    "kmer": "TGTG",
    "tone": "G",
    "duration": "noire"
  },
  {
    "kmer": "TGTT",
    "tone": "E",
    "duration": "double croche"
  },
  {
    "kmer": "TTAA",
    "tone": "E",
    "duration": "croche"
  },
  {
    "kmer": "TTAC",
    "tone": "F",
    "duration": "double croche"
  },
  {
    "kmer": "TTAG",
    "tone": "F",
    "duration": "noire"
  },
  {
    "kmer": "TTAT",
    "tone": "B",
    "duration": "blanche"
  },
  {
    "kmer": "TTCA",
    "tone": "D",
    "duration": "double croche"
  },
  {
    "kmer": "TTCC",
    "tone": "G",
    "duration": "blanche"
  },
  {
    "kmer": "TTCG",
    "tone": "C",
    "duration": "noire"
  },
  {
    "kmer": "TTCT",
    "tone": "G",
    "duration": "croche"
  },
  {
    "kmer": "TTGA",
    "tone": "F",
    "duration": "ronde"
  },
  {
    "kmer": "TTGC",
    "tone": "G",
    "duration": "double croche"
  },
  {
    "kmer": "TTGG",
    "tone": "F",
    "duration": "blanche"
  },
  {
    "kmer": "TTGT",
    "tone": "A",
    "duration": "double croche"
  },
  {
    "kmer": "TTTA",
    "tone": "C",
    "duration": "noire"
  },
  {
    "kmer": "TTTC",
    "tone": "E",
    "duration": "croche"
  },
  {
    "kmer": "TTTG",
    "tone": "E",
    "duration": "croche"
  },
  {
    "kmer": "TTTT",
    "tone": "E",
    "duration": "ronde"
  }
]